You are viewing a plain text version of this content. The canonical link for it is here.
Posted to commits@karaf.apache.org by Apache Jenkins Server <je...@builds.apache.org> on 2019/09/27 03:03:27 UTC
Build failed in Jenkins: karaf-4.2.x #397
See <https://builds.apache.org/job/karaf-4.2.x/397/display/redirect>
------------------------------------------
Started by timer
[EnvInject] - Loading node environment variables.
Building remotely on H40 (ubuntu xenial) in workspace <https://builds.apache.org/job/karaf-4.2.x/ws/>
No credentials specified
> git rev-parse --is-inside-work-tree # timeout=10
Fetching changes from the remote Git repository
> git config remote.origin.url https://gitbox.apache.org/repos/asf/karaf.git # timeout=10
Fetching upstream changes from https://gitbox.apache.org/repos/asf/karaf.git
> git --version # timeout=10
> git fetch --tags --progress https://gitbox.apache.org/repos/asf/karaf.git +refs/heads/*:refs/remotes/origin/*
> git rev-parse refs/remotes/origin/karaf-4.2.x^{commit} # timeout=10
> git rev-parse refs/remotes/origin/origin/karaf-4.2.x^{commit} # timeout=10
Checking out Revision 3e7f42ed9309b30bf55383388374c1030dbf2e74 (refs/remotes/origin/karaf-4.2.x)
> git config core.sparsecheckout # timeout=10
> git checkout -f 3e7f42ed9309b30bf55383388374c1030dbf2e74
Commit message: "[maven-release-plugin] prepare for next development iteration"
> git rev-list --no-walk 3e7f42ed9309b30bf55383388374c1030dbf2e74 # timeout=10
Parsing POMs
Established TCP socket on 44475
maven35-agent.jar already up to date
maven35-interceptor.jar already up to date
maven3-interceptor-commons.jar already up to date
[karaf-4.2.x] $ /home/jenkins/tools/java/latest1.8/bin/java -Xmx4g -Xms4g -cp /home/jenkins/jenkins-slave/maven35-agent.jar:/home/jenkins/tools/maven/apache-maven-3.6.0/boot/plexus-classworlds-2.5.2.jar:/home/jenkins/tools/maven/apache-maven-3.6.0/conf/logging jenkins.maven3.agent.Maven35Main /home/jenkins/tools/maven/apache-maven-3.6.0 /home/jenkins/jenkins-slave/remoting.jar /home/jenkins/jenkins-slave/maven35-interceptor.jar /home/jenkins/jenkins-slave/maven3-interceptor-commons.jar 44475
#
# There is insufficient memory for the Java Runtime Environment to continue.
# Cannot create GC thread. Out of system resources.
# An error report file with more information is saved as:
# <https://builds.apache.org/job/karaf-4.2.x/ws/hs_err_pid25628.log>
ERROR: Failed to launch Maven. Exit code = 1
Jenkins build is back to normal : karaf-4.2.x #401
Posted by Apache Jenkins Server <je...@builds.apache.org>.
See <https://builds.apache.org/job/karaf-4.2.x/401/display/redirect>
Build failed in Jenkins: karaf-4.2.x #400
Posted by Apache Jenkins Server <je...@builds.apache.org>.
See <https://builds.apache.org/job/karaf-4.2.x/400/display/redirect>
Changes:
------------------------------------------
[...truncated 62.29 KB...]
at org.codehaus.plexus.classworlds.launcher.Launcher.launchEnhanced (Launcher.java:289)
at org.codehaus.plexus.classworlds.launcher.Launcher.launch (Launcher.java:229)
at jenkins.maven3.agent.Maven35Main.launch (Maven35Main.java:178)
at sun.reflect.NativeMethodAccessorImpl.invoke0 (Native Method)
at sun.reflect.NativeMethodAccessorImpl.invoke (NativeMethodAccessorImpl.java:62)
at sun.reflect.DelegatingMethodAccessorImpl.invoke (DelegatingMethodAccessorImpl.java:43)
at java.lang.reflect.Method.invoke (Method.java:498)
at hudson.maven.Maven3Builder.call (Maven3Builder.java:139)
at hudson.maven.Maven3Builder.call (Maven3Builder.java:70)
at hudson.remoting.UserRequest.perform (UserRequest.java:212)
at hudson.remoting.UserRequest.perform (UserRequest.java:54)
at hudson.remoting.Request$2.run (Request.java:369)
at hudson.remoting.InterceptingExecutorService$1.call (InterceptingExecutorService.java:72)
at java.util.concurrent.FutureTask.run (FutureTask.java:266)
at java.util.concurrent.ThreadPoolExecutor.runWorker (ThreadPoolExecutor.java:1149)
at java.util.concurrent.ThreadPoolExecutor$Worker.run (ThreadPoolExecutor.java:624)
at java.lang.Thread.run (Thread.java:748)
[ERROR]
[ERROR] Re-run Maven using the -X switch to enable full debug logging.
[ERROR]
[ERROR] For more information about the errors and possible solutions, please read the following articles:
[ERROR] [Help 1] http://cwiki.apache.org/confluence/display/MAVEN/OutOfMemoryError
[JENKINS] Archiving <https://builds.apache.org/job/karaf-4.2.x/ws/examples/karaf-profile-example/karaf-profile-example-static/pom.xml> to org.apache.karaf.examples/karaf-profile-example-static/4.2.8-SNAPSHOT/karaf-profile-example-static-4.2.8-SNAPSHOT.pom
[JENKINS] Archiving <https://builds.apache.org/job/karaf-4.2.x/ws/examples/karaf-bundle-example/karaf-bundle-example-provider/pom.xml> to org.apache.karaf.examples/karaf-bundle-example-provider/4.2.8-SNAPSHOT/karaf-bundle-example-provider-4.2.8-SNAPSHOT.pom
[JENKINS] Archiving <https://builds.apache.org/job/karaf-4.2.x/ws/examples/karaf-jpa-example/karaf-jpa-example-provider/karaf-jpa-example-provider-ds/pom.xml> to org.apache.karaf.examples/karaf-jpa-example-provider-ds/4.2.8-SNAPSHOT/karaf-jpa-example-provider-ds-4.2.8-SNAPSHOT.pom
[JENKINS] Archiving <https://builds.apache.org/job/karaf-4.2.x/ws/examples/karaf-soap-example/karaf-soap-example-features/pom.xml> to org.apache.karaf.examples/karaf-soap-example-features/4.2.8-SNAPSHOT/karaf-soap-example-features-4.2.8-SNAPSHOT.pom
[JENKINS] Archiving <https://builds.apache.org/job/karaf-4.2.x/ws/examples/karaf-blueprint-example/karaf-blueprint-example-provider/pom.xml> to org.apache.karaf.examples/karaf-blueprint-example-provider/4.2.8-SNAPSHOT/karaf-blueprint-example-provider-4.2.8-SNAPSHOT.pom
[JENKINS] Archiving <https://builds.apache.org/job/karaf-4.2.x/ws/maven/pom.xml> to org.apache.karaf.maven/maven-parent/4.2.8-SNAPSHOT/maven-parent-4.2.8-SNAPSHOT.pom
[JENKINS] Archiving <https://builds.apache.org/job/karaf-4.2.x/ws/features/core/pom.xml> to org.apache.karaf.features/org.apache.karaf.features.core/4.2.8-SNAPSHOT/org.apache.karaf.features.core-4.2.8-SNAPSHOT.pom
[JENKINS] Archiving <https://builds.apache.org/job/karaf-4.2.x/ws/services/coordinator/pom.xml> to org.apache.karaf.services/org.apache.karaf.services.coordinator/4.2.8-SNAPSHOT/org.apache.karaf.services.coordinator-4.2.8-SNAPSHOT.pom
[JENKINS] Archiving <https://builds.apache.org/job/karaf-4.2.x/ws/examples/karaf-scr-example/karaf-scr-example-api/pom.xml> to org.apache.karaf.examples/karaf-scr-example-api/4.2.8-SNAPSHOT/karaf-scr-example-api-4.2.8-SNAPSHOT.pom
[JENKINS] Archiving <https://builds.apache.org/job/karaf-4.2.x/ws/system/pom.xml> to org.apache.karaf.system/org.apache.karaf.system.core/4.2.8-SNAPSHOT/org.apache.karaf.system.core-4.2.8-SNAPSHOT.pom
[JENKINS] Archiving <https://builds.apache.org/job/karaf-4.2.x/ws/maven/core/pom.xml> to org.apache.karaf.maven/org.apache.karaf.maven.core/4.2.8-SNAPSHOT/org.apache.karaf.maven.core-4.2.8-SNAPSHOT.pom
[JENKINS] Archiving <https://builds.apache.org/job/karaf-4.2.x/ws/client/pom.xml> to org.apache.karaf/org.apache.karaf.client/4.2.8-SNAPSHOT/org.apache.karaf.client-4.2.8-SNAPSHOT.pom
[JENKINS] Archiving <https://builds.apache.org/job/karaf-4.2.x/ws/jpa/pom.xml> to org.apache.karaf.jpa/jpa-parent/4.2.8-SNAPSHOT/jpa-parent-4.2.8-SNAPSHOT.pom
[JENKINS] Archiving <https://builds.apache.org/job/karaf-4.2.x/ws/examples/karaf-docker-example/karaf-docker-example-static-dist/pom.xml> to org.apache.karaf.examples/karaf-docker-example-static-dist/4.2.8-SNAPSHOT/karaf-docker-example-static-dist-4.2.8-SNAPSHOT.pom
[JENKINS] Archiving <https://builds.apache.org/job/karaf-4.2.x/ws/bundle/blueprintstate/pom.xml> to org.apache.karaf.bundle/org.apache.karaf.bundle.blueprintstate/4.2.8-SNAPSHOT/org.apache.karaf.bundle.blueprintstate-4.2.8-SNAPSHOT.pom
[JENKINS] Archiving <https://builds.apache.org/job/karaf-4.2.x/ws/examples/karaf-jpa-example/karaf-jpa-example-command/pom.xml> to org.apache.karaf.examples/karaf-jpa-example-command/4.2.8-SNAPSHOT/karaf-jpa-example-command-4.2.8-SNAPSHOT.pom
[JENKINS] Archiving <https://builds.apache.org/job/karaf-4.2.x/ws/examples/karaf-mbean-example/karaf-mbean-example-scr/pom.xml> to org.apache.karaf.examples/karaf-mbean-example-scr/4.2.8-SNAPSHOT/karaf-mbean-example-scr-4.2.8-SNAPSHOT.pom
[JENKINS] Archiving <https://builds.apache.org/job/karaf-4.2.x/ws/examples/karaf-scr-example/karaf-scr-example-client/pom.xml> to org.apache.karaf.examples/karaf-scr-example-client/4.2.8-SNAPSHOT/karaf-scr-example-client-4.2.8-SNAPSHOT.pom
[JENKINS] Archiving <https://builds.apache.org/job/karaf-4.2.x/ws/examples/karaf-jpa-example/karaf-jpa-example-provider/karaf-jpa-example-provider-ds/karaf-jpa-example-provider-ds-eclipselink/pom.xml> to org.apache.karaf.examples/karaf-jpa-example-provider-ds-eclipselink/4.2.8-SNAPSHOT/karaf-jpa-example-provider-ds-eclipselink-4.2.8-SNAPSHOT.pom
[JENKINS] Archiving <https://builds.apache.org/job/karaf-4.2.x/ws/main/pom.xml> to org.apache.karaf/org.apache.karaf.main/4.2.8-SNAPSHOT/org.apache.karaf.main-4.2.8-SNAPSHOT.pom
[JENKINS] Archiving <https://builds.apache.org/job/karaf-4.2.x/ws/scr/management/pom.xml> to org.apache.karaf.scr/org.apache.karaf.scr.management/4.2.8-SNAPSHOT/org.apache.karaf.scr.management-4.2.8-SNAPSHOT.pom
[JENKINS] Archiving <https://builds.apache.org/job/karaf-4.2.x/ws/examples/karaf-mbean-example/karaf-mbean-example-api/pom.xml> to org.apache.karaf.examples/karaf-mbean-example-api/4.2.8-SNAPSHOT/karaf-mbean-example-api-4.2.8-SNAPSHOT.pom
[JENKINS] Archiving <https://builds.apache.org/job/karaf-4.2.x/ws/bundle/springstate/pom.xml> to org.apache.karaf.bundle/org.apache.karaf.bundle.springstate/4.2.8-SNAPSHOT/org.apache.karaf.bundle.springstate-4.2.8-SNAPSHOT.pom
[JENKINS] Archiving <https://builds.apache.org/job/karaf-4.2.x/ws/diagnostic/core/pom.xml> to org.apache.karaf.diagnostic/org.apache.karaf.diagnostic.core/4.2.8-SNAPSHOT/org.apache.karaf.diagnostic.core-4.2.8-SNAPSHOT.pom
[JENKINS] Archiving <https://builds.apache.org/job/karaf-4.2.x/ws/deployer/spring/pom.xml> to org.apache.karaf.deployer/org.apache.karaf.deployer.spring/4.2.8-SNAPSHOT/org.apache.karaf.deployer.spring-4.2.8-SNAPSHOT.pom
[JENKINS] Archiving <https://builds.apache.org/job/karaf-4.2.x/ws/jms/pom.xml> to org.apache.karaf.jms/org.apache.karaf.jms.core/4.2.8-SNAPSHOT/org.apache.karaf.jms.core-4.2.8-SNAPSHOT.pom
[JENKINS] Archiving <https://builds.apache.org/job/karaf-4.2.x/ws/examples/karaf-servlet-example/karaf-servlet-example-features/pom.xml> to org.apache.karaf.examples/karaf-servlet-example-features/4.2.8-SNAPSHOT/karaf-servlet-example-features-4.2.8-SNAPSHOT.pom
[JENKINS] Archiving <https://builds.apache.org/job/karaf-4.2.x/ws/webconsole/instance/pom.xml> to org.apache.karaf.webconsole/org.apache.karaf.webconsole.instance/4.2.8-SNAPSHOT/org.apache.karaf.webconsole.instance-4.2.8-SNAPSHOT.pom
[JENKINS] Archiving <https://builds.apache.org/job/karaf-4.2.x/ws/examples/karaf-servlet-example/pom.xml> to org.apache.karaf.examples/karaf-servlet-example/4.2.8-SNAPSHOT/karaf-servlet-example-4.2.8-SNAPSHOT.pom
[JENKINS] Archiving <https://builds.apache.org/job/karaf-4.2.x/ws/examples/karaf-rest-example/karaf-rest-example-client/karaf-rest-example-client-http/pom.xml> to org.apache.karaf.examples/karaf-rest-example-client-http/4.2.8-SNAPSHOT/karaf-rest-example-client-http-4.2.8-SNAPSHOT.pom
[JENKINS] Archiving <https://builds.apache.org/job/karaf-4.2.x/ws/examples/karaf-profile-example/pom.xml> to org.apache.karaf.examples/karaf-profile-example/4.2.8-SNAPSHOT/karaf-profile-example-4.2.8-SNAPSHOT.pom
[JENKINS] Archiving <https://builds.apache.org/job/karaf-4.2.x/ws/examples/karaf-scheduler-example/karaf-scheduler-example-runnable/pom.xml> to org.apache.karaf.examples/karaf-scheduler-example-runnable/4.2.8-SNAPSHOT/karaf-scheduler-example-runnable-4.2.8-SNAPSHOT.pom
[JENKINS] Archiving <https://builds.apache.org/job/karaf-4.2.x/ws/jaas/jasypt/pom.xml> to org.apache.karaf.jaas/org.apache.karaf.jaas.jasypt/4.2.8-SNAPSHOT/org.apache.karaf.jaas.jasypt-4.2.8-SNAPSHOT.pom
[JENKINS] Archiving <https://builds.apache.org/job/karaf-4.2.x/ws/services/pom.xml> to org.apache.karaf.services/services/4.2.8-SNAPSHOT/services-4.2.8-SNAPSHOT.pom
[JENKINS] Archiving <https://builds.apache.org/job/karaf-4.2.x/ws/examples/karaf-command-example/karaf-command-example-api/pom.xml> to org.apache.karaf.examples/karaf-command-example-api/4.2.8-SNAPSHOT/karaf-command-example-api-4.2.8-SNAPSHOT.pom
[JENKINS] Archiving <https://builds.apache.org/job/karaf-4.2.x/ws/examples/karaf-war-example/karaf-war-example-features/pom.xml> to org.apache.karaf.examples/karaf-war-example-features/4.2.8-SNAPSHOT/karaf-war-example-features-4.2.8-SNAPSHOT.pom
[JENKINS] Archiving <https://builds.apache.org/job/karaf-4.2.x/ws/jaas/blueprint/config/pom.xml> to org.apache.karaf.jaas.blueprint/org.apache.karaf.jaas.blueprint.config/4.2.8-SNAPSHOT/org.apache.karaf.jaas.blueprint.config-4.2.8-SNAPSHOT.pom
[JENKINS] Archiving <https://builds.apache.org/job/karaf-4.2.x/ws/examples/karaf-scheduler-example/pom.xml> to org.apache.karaf.examples/karaf-scheduler-example/4.2.8-SNAPSHOT/karaf-scheduler-example-4.2.8-SNAPSHOT.pom
[JENKINS] Archiving <https://builds.apache.org/job/karaf-4.2.x/ws/examples/karaf-jpa-example/karaf-jpa-example-provider/karaf-jpa-example-provider-ds/karaf-jpa-example-provider-ds-openjpa/pom.xml> to org.apache.karaf.examples/karaf-jpa-example-provider-ds-openjpa/4.2.8-SNAPSHOT/karaf-jpa-example-provider-ds-openjpa-4.2.8-SNAPSHOT.pom
[JENKINS] Archiving <https://builds.apache.org/job/karaf-4.2.x/ws/pom.xml> to org.apache.karaf/karaf/4.2.8-SNAPSHOT/karaf-4.2.8-SNAPSHOT.pom
[Fast Archiver] Compressed 106.48 KB of artifacts by 60.1% relative to #396
[JENKINS] Archiving <https://builds.apache.org/job/karaf-4.2.x/ws/specs/java.xml.ws/pom.xml> to org.apache.karaf.specs/org.apache.karaf.specs.java.xml.ws/4.2.8-SNAPSHOT/org.apache.karaf.specs.java.xml.ws-4.2.8-SNAPSHOT.pom
[JENKINS] Archiving <https://builds.apache.org/job/karaf-4.2.x/ws/assemblies/features/base/pom.xml> to org.apache.karaf.features/base/4.2.8-SNAPSHOT/base-4.2.8-SNAPSHOT.pom
[JENKINS] Archiving <https://builds.apache.org/job/karaf-4.2.x/ws/examples/karaf-soap-example/karaf-soap-example-api/pom.xml> to org.apache.karaf.examples/karaf-soap-example-api/4.2.8-SNAPSHOT/karaf-soap-example-api-4.2.8-SNAPSHOT.pom
[JENKINS] Archiving <https://builds.apache.org/job/karaf-4.2.x/ws/assemblies/features/standard/pom.xml> to org.apache.karaf.features/standard/4.2.8-SNAPSHOT/standard-4.2.8-SNAPSHOT.pom
[JENKINS] Archiving <https://builds.apache.org/job/karaf-4.2.x/ws/examples/karaf-jms-example/pom.xml> to org.apache.karaf.examples/karaf-jms-example/4.2.8-SNAPSHOT/karaf-jms-example-4.2.8-SNAPSHOT.pom
[JENKINS] Archiving <https://builds.apache.org/job/karaf-4.2.x/ws/examples/karaf-scr-example/karaf-scr-example-provider/pom.xml> to org.apache.karaf.examples/karaf-scr-example-provider/4.2.8-SNAPSHOT/karaf-scr-example-provider-4.2.8-SNAPSHOT.pom
[JENKINS] Archiving <https://builds.apache.org/job/karaf-4.2.x/ws/examples/karaf-mbean-example/karaf-mbean-example-simple/pom.xml> to org.apache.karaf.examples/karaf-mbean-example-simple/4.2.8-SNAPSHOT/karaf-mbean-example-simple-4.2.8-SNAPSHOT.pom
[JENKINS] Archiving <https://builds.apache.org/job/karaf-4.2.x/ws/examples/karaf-profile-example/karaf-profile-example-registry/pom.xml> to org.apache.karaf.examples/karaf-profile-example-registry/4.2.8-SNAPSHOT/karaf-profile-example-registry-4.2.8-SNAPSHOT.pom
[JENKINS] Archiving <https://builds.apache.org/job/karaf-4.2.x/ws/examples/karaf-camel-example/pom.xml> to org.apache.karaf.examples/karaf-camel-example/4.2.8-SNAPSHOT/karaf-camel-example-4.2.8-SNAPSHOT.pom
[JENKINS] Archiving <https://builds.apache.org/job/karaf-4.2.x/ws/examples/karaf-rest-example/karaf-rest-example-client/pom.xml> to org.apache.karaf.examples/karaf-rest-example-client/4.2.8-SNAPSHOT/karaf-rest-example-client-4.2.8-SNAPSHOT.pom
[JENKINS] Archiving <https://builds.apache.org/job/karaf-4.2.x/ws/instance/pom.xml> to org.apache.karaf.instance/org.apache.karaf.instance.core/4.2.8-SNAPSHOT/org.apache.karaf.instance.core-4.2.8-SNAPSHOT.pom
[JENKINS] Archiving <https://builds.apache.org/job/karaf-4.2.x/ws/shell/pom.xml> to org.apache.karaf.shell/shell/4.2.8-SNAPSHOT/shell-4.2.8-SNAPSHOT.pom
[JENKINS] Archiving <https://builds.apache.org/job/karaf-4.2.x/ws/service/pom.xml> to org.apache.karaf.service/service/4.2.8-SNAPSHOT/service-4.2.8-SNAPSHOT.pom
[JENKINS] Archiving <https://builds.apache.org/job/karaf-4.2.x/ws/specs/java.xml/pom.xml> to org.apache.karaf.specs/org.apache.karaf.specs.java.xml/4.2.8-SNAPSHOT/org.apache.karaf.specs.java.xml-4.2.8-SNAPSHOT.pom
[JENKINS] Archiving <https://builds.apache.org/job/karaf-4.2.x/ws/jaas/pom.xml> to org.apache.karaf.jaas/jaas/4.2.8-SNAPSHOT/jaas-4.2.8-SNAPSHOT.pom
[JENKINS] Archiving <https://builds.apache.org/job/karaf-4.2.x/ws/examples/karaf-camel-example/karaf-camel-example-blueprint/pom.xml> to org.apache.karaf.examples/karaf-camel-example-blueprint/4.2.8-SNAPSHOT/karaf-camel-example-blueprint-4.2.8-SNAPSHOT.pom
[JENKINS] Archiving <https://builds.apache.org/job/karaf-4.2.x/ws/examples/karaf-config-example/karaf-config-example-static/pom.xml> to org.apache.karaf.examples/karaf-config-example-static/4.2.8-SNAPSHOT/karaf-config-example-static-4.2.8-SNAPSHOT.pom
[JENKINS] Archiving <https://builds.apache.org/job/karaf-4.2.x/ws/diagnostic/boot/pom.xml> to org.apache.karaf.diagnostic/org.apache.karaf.diagnostic.boot/4.2.8-SNAPSHOT/org.apache.karaf.diagnostic.boot-4.2.8-SNAPSHOT.pom
[JENKINS] Archiving <https://builds.apache.org/job/karaf-4.2.x/ws/examples/karaf-url-namespace-handler-example/karaf-url-namespace-handler-example-features/pom.xml> to org.apache.karaf.examples/karaf-url-namespace-handler-example-features/4.2.8-SNAPSHOT/karaf-url-namespace-handler-example-features-4.2.8-SNAPSHOT.pom
[JENKINS] Archiving <https://builds.apache.org/job/karaf-4.2.x/ws/examples/karaf-rest-example/karaf-rest-example-client/karaf-rest-example-client-cxf/pom.xml> to org.apache.karaf.examples/karaf-rest-example-client-cxf/4.2.8-SNAPSHOT/karaf-rest-example-client-cxf-4.2.8-SNAPSHOT.pom
[JENKINS] Archiving <https://builds.apache.org/job/karaf-4.2.x/ws/jdbc/pom.xml> to org.apache.karaf.jdbc/org.apache.karaf.jdbc.core/4.2.8-SNAPSHOT/org.apache.karaf.jdbc.core-4.2.8-SNAPSHOT.pom
[JENKINS] Archiving <https://builds.apache.org/job/karaf-4.2.x/ws/archetypes/feature/pom.xml> to org.apache.karaf.archetypes/karaf-feature-archetype/4.2.8-SNAPSHOT/karaf-feature-archetype-4.2.8-SNAPSHOT.pom
[JENKINS] Archiving <https://builds.apache.org/job/karaf-4.2.x/ws/examples/karaf-servlet-example/karaf-servlet-example-annotation/pom.xml> to org.apache.karaf.examples/karaf-servlet-example-annotation/4.2.8-SNAPSHOT/karaf-servlet-example-annotation-4.2.8-SNAPSHOT.pom
[JENKINS] Archiving <https://builds.apache.org/job/karaf-4.2.x/ws/shell/core/pom.xml> to org.apache.karaf.shell/org.apache.karaf.shell.core/4.2.8-SNAPSHOT/org.apache.karaf.shell.core-4.2.8-SNAPSHOT.pom
[JENKINS] Archiving <https://builds.apache.org/job/karaf-4.2.x/ws/examples/karaf-dump-example/pom.xml> to org.apache.karaf.examples/karaf-dump-example/4.2.8-SNAPSHOT/karaf-dump-example-4.2.8-SNAPSHOT.pom
[JENKINS] Archiving <https://builds.apache.org/job/karaf-4.2.x/ws/examples/karaf-config-example/karaf-config-example-listener/pom.xml> to org.apache.karaf.examples/karaf-config-example-listener/4.2.8-SNAPSHOT/karaf-config-example-listener-4.2.8-SNAPSHOT.pom
[JENKINS] Archiving <https://builds.apache.org/job/karaf-4.2.x/ws/examples/karaf-mbean-example/karaf-mbean-example-blueprint/pom.xml> to org.apache.karaf.examples/karaf-mbean-example-blueprint/4.2.8-SNAPSHOT/karaf-mbean-example-blueprint-4.2.8-SNAPSHOT.pom
[JENKINS] Archiving <https://builds.apache.org/job/karaf-4.2.x/ws/bundle/pom.xml> to org.apache.karaf.bundle/bundle/4.2.8-SNAPSHOT/bundle-4.2.8-SNAPSHOT.pom
[JENKINS] Archiving <https://builds.apache.org/job/karaf-4.2.x/ws/shell/table/pom.xml> to org.apache.karaf.shell/org.apache.karaf.shell.table/4.2.8-SNAPSHOT/org.apache.karaf.shell.table-4.2.8-SNAPSHOT.pom
[JENKINS] Archiving <https://builds.apache.org/job/karaf-4.2.x/ws/examples/karaf-blueprint-example/pom.xml> to org.apache.karaf.examples/karaf-blueprint-example/4.2.8-SNAPSHOT/karaf-blueprint-example-4.2.8-SNAPSHOT.pom
[JENKINS] Archiving <https://builds.apache.org/job/karaf-4.2.x/ws/examples/karaf-config-example/karaf-config-example-features/pom.xml> to org.apache.karaf.examples/karaf-config-example-features/4.2.8-SNAPSHOT/karaf-config-example-features-4.2.8-SNAPSHOT.pom
[JENKINS] Archiving <https://builds.apache.org/job/karaf-4.2.x/ws/services/eventadmin/pom.xml> to org.apache.karaf.services/org.apache.karaf.services.eventadmin/4.2.8-SNAPSHOT/org.apache.karaf.services.eventadmin-4.2.8-SNAPSHOT.pom
[JENKINS] Archiving <https://builds.apache.org/job/karaf-4.2.x/ws/examples/karaf-config-example/karaf-config-example-managed-factory/pom.xml> to org.apache.karaf.examples/karaf-config-example-managed-factory/4.2.8-SNAPSHOT/karaf-config-example-managed-factory-4.2.8-SNAPSHOT.pom
[JENKINS] Archiving <https://builds.apache.org/job/karaf-4.2.x/ws/scr/examples/component-factory/pom.xml> to org.apache.karaf.scr.examples/org.apache.karaf.scr.examples.component.factories/4.2.8-SNAPSHOT/org.apache.karaf.scr.examples.component.factories-4.2.8-SNAPSHOT.pom
[JENKINS] Archiving <https://builds.apache.org/job/karaf-4.2.x/ws/assemblies/features/spring-legacy/pom.xml> to org.apache.karaf.features/spring-legacy/4.2.8-SNAPSHOT/spring-legacy-4.2.8-SNAPSHOT.pom
[JENKINS] Archiving <https://builds.apache.org/job/karaf-4.2.x/ws/assemblies/features/enterprise/pom.xml> to org.apache.karaf.features/enterprise/4.2.8-SNAPSHOT/enterprise-4.2.8-SNAPSHOT.pom
[JENKINS] Archiving <https://builds.apache.org/job/karaf-4.2.x/ws/examples/karaf-scheduler-example/karaf-scheduler-example-features/pom.xml> to org.apache.karaf.examples/karaf-scheduler-example-features/4.2.8-SNAPSHOT/karaf-scheduler-example-features-4.2.8-SNAPSHOT.pom
[JENKINS] Archiving <https://builds.apache.org/job/karaf-4.2.x/ws/examples/karaf-maven-example/karaf-maven-example-run-bundle/pom.xml> to org.apache.karaf.examples/karaf-maven-example-run-bundle/4.2.8-SNAPSHOT/karaf-maven-example-run-bundle-4.2.8-SNAPSHOT.pom
[JENKINS] Archiving <https://builds.apache.org/job/karaf-4.2.x/ws/examples/karaf-log-appender-example/pom.xml> to org.apache.karaf.examples/karaf-log-appender-example/4.2.8-SNAPSHOT/karaf-log-appender-example-4.2.8-SNAPSHOT.pom
[JENKINS] Archiving <https://builds.apache.org/job/karaf-4.2.x/ws/examples/karaf-websocket-example/pom.xml> to org.apache.karaf.examples/karaf-websocket-example/4.2.8-SNAPSHOT/karaf-websocket-example-4.2.8-SNAPSHOT.pom
[JENKINS] Archiving <https://builds.apache.org/job/karaf-4.2.x/ws/examples/karaf-camel-example/karaf-camel-example-java/pom.xml> to org.apache.karaf.examples/karaf-camel-example-java/4.2.8-SNAPSHOT/karaf-camel-example-java-4.2.8-SNAPSHOT.pom
[JENKINS] Archiving <https://builds.apache.org/job/karaf-4.2.x/ws/examples/karaf-command-example/karaf-command-example-provider/pom.xml> to org.apache.karaf.examples/karaf-command-example-provider/4.2.8-SNAPSHOT/karaf-command-example-provider-4.2.8-SNAPSHOT.pom
[JENKINS] Archiving <https://builds.apache.org/job/karaf-4.2.x/ws/examples/karaf-http-resource-example/karaf-http-resource-example-features/pom.xml> to org.apache.karaf.examples/karaf-http-resource-example-features/4.2.8-SNAPSHOT/karaf-http-resource-example-features-4.2.8-SNAPSHOT.pom
[JENKINS] Archiving <https://builds.apache.org/job/karaf-4.2.x/ws/examples/karaf-jms-example/karaf-jms-example-features/pom.xml> to org.apache.karaf.examples/karaf-jms-example-features/4.2.8-SNAPSHOT/karaf-jms-example-features-4.2.8-SNAPSHOT.pom
[JENKINS] Archiving <https://builds.apache.org/job/karaf-4.2.x/ws/examples/karaf-jpa-example/karaf-jpa-example-provider/pom.xml> to org.apache.karaf.examples/karaf-jpa-example-provider/4.2.8-SNAPSHOT/karaf-jpa-example-provider-4.2.8-SNAPSHOT.pom
[JENKINS] Archiving <https://builds.apache.org/job/karaf-4.2.x/ws/scr/pom.xml> to org.apache.karaf.scr/scr/4.2.8-SNAPSHOT/scr-4.2.8-SNAPSHOT.pom
[JENKINS] Archiving <https://builds.apache.org/job/karaf-4.2.x/ws/examples/karaf-rest-example/karaf-rest-example-features/pom.xml> to org.apache.karaf.examples/karaf-rest-example-features/4.2.8-SNAPSHOT/karaf-rest-example-features-4.2.8-SNAPSHOT.pom
[JENKINS] Archiving <https://builds.apache.org/job/karaf-4.2.x/ws/deployer/wrap/pom.xml> to org.apache.karaf.deployer/org.apache.karaf.deployer.wrap/4.2.8-SNAPSHOT/org.apache.karaf.deployer.wrap-4.2.8-SNAPSHOT.pom
[JENKINS] Archiving <https://builds.apache.org/job/karaf-4.2.x/ws/examples/karaf-blueprint-example/karaf-blueprint-example-client/pom.xml> to org.apache.karaf.examples/karaf-blueprint-example-client/4.2.8-SNAPSHOT/karaf-blueprint-example-client-4.2.8-SNAPSHOT.pom
[JENKINS] Archiving <https://builds.apache.org/job/karaf-4.2.x/ws/examples/karaf-jdbc-example/pom.xml> to org.apache.karaf.examples/karaf-jdbc-example/4.2.8-SNAPSHOT/karaf-jdbc-example-4.2.8-SNAPSHOT.pom
[JENKINS] Archiving <https://builds.apache.org/job/karaf-4.2.x/ws/examples/karaf-rest-example/karaf-rest-example-provider/pom.xml> to org.apache.karaf.examples/karaf-rest-example-provider/4.2.8-SNAPSHOT/karaf-rest-example-provider-4.2.8-SNAPSHOT.pom
[JENKINS] Archiving <https://builds.apache.org/job/karaf-4.2.x/ws/examples/karaf-rest-example/pom.xml> to org.apache.karaf.examples/karaf-rest-example/4.2.8-SNAPSHOT/karaf-rest-example-4.2.8-SNAPSHOT.pom
[JENKINS] Archiving <https://builds.apache.org/job/karaf-4.2.x/ws/assemblies/features/static/pom.xml> to org.apache.karaf.features/static/4.2.8-SNAPSHOT/static-4.2.8-SNAPSHOT.pom
[JENKINS] Archiving <https://builds.apache.org/job/karaf-4.2.x/ws/examples/karaf-http-resource-example/karaf-http-resource-example-whiteboard/pom.xml> to org.apache.karaf.examples/karaf-http-resource-example-whiteboard/4.2.8-SNAPSHOT/karaf-http-resource-example-whiteboard-4.2.8-SNAPSHOT.pom
[JENKINS] Archiving <https://builds.apache.org/job/karaf-4.2.x/ws/scr/examples/managed-service/pom.xml> to org.apache.karaf.scr.examples/org.apache.karaf.scr.examples.managed.service/4.2.8-SNAPSHOT/org.apache.karaf.scr.examples.managed.service-4.2.8-SNAPSHOT.pom
[JENKINS] Archiving <https://builds.apache.org/job/karaf-4.2.x/ws/examples/karaf-command-example/karaf-command-example-features/pom.xml> to org.apache.karaf.examples/karaf-command-example-features/4.2.8-SNAPSHOT/karaf-command-example-features-4.2.8-SNAPSHOT.pom
[JENKINS] Archiving <https://builds.apache.org/job/karaf-4.2.x/ws/profile/pom.xml> to org.apache.karaf.profile/org.apache.karaf.profile.core/4.2.8-SNAPSHOT/org.apache.karaf.profile.core-4.2.8-SNAPSHOT.pom
[JENKINS] Archiving <https://builds.apache.org/job/karaf-4.2.x/ws/webconsole/features/pom.xml> to org.apache.karaf.webconsole/org.apache.karaf.webconsole.features/4.2.8-SNAPSHOT/org.apache.karaf.webconsole.features-4.2.8-SNAPSHOT.pom
[JENKINS] Archiving <https://builds.apache.org/job/karaf-4.2.x/ws/assemblies/apache-karaf/pom.xml> to org.apache.karaf/apache-karaf/4.2.8-SNAPSHOT/apache-karaf-4.2.8-SNAPSHOT.pom
[JENKINS] Archiving <https://builds.apache.org/job/karaf-4.2.x/ws/specs/locator/pom.xml> to org.apache.karaf.specs/org.apache.karaf.specs.locator/4.2.8-SNAPSHOT/org.apache.karaf.specs.locator-4.2.8-SNAPSHOT.pom
[JENKINS] Archiving <https://builds.apache.org/job/karaf-4.2.x/ws/examples/karaf-camel-example/karaf-camel-example-features/pom.xml> to org.apache.karaf.examples/karaf-camel-example-features/4.2.8-SNAPSHOT/karaf-camel-example-features-4.2.8-SNAPSHOT.pom
[JENKINS] Archiving <https://builds.apache.org/job/karaf-4.2.x/ws/http/pom.xml> to org.apache.karaf.http/org.apache.karaf.http.core/4.2.8-SNAPSHOT/org.apache.karaf.http.core-4.2.8-SNAPSHOT.pom
[JENKINS] Archiving <https://builds.apache.org/job/karaf-4.2.x/ws/examples/karaf-maven-example/karaf-maven-example-run/pom.xml> to org.apache.karaf.examples/karaf-maven-example-run/4.2.8-SNAPSHOT/karaf-maven-example-run-4.2.8-SNAPSHOT.pom
[JENKINS] Archiving <https://builds.apache.org/job/karaf-4.2.x/ws/examples/karaf-http-resource-example/pom.xml> to org.apache.karaf.examples/karaf-http-resource-example/4.2.8-SNAPSHOT/karaf-http-resource-example-4.2.8-SNAPSHOT.pom
[JENKINS] Archiving <https://builds.apache.org/job/karaf-4.2.x/ws/archetypes/bundle/pom.xml> to org.apache.karaf.archetypes/karaf-bundle-archetype/4.2.8-SNAPSHOT/karaf-bundle-archetype-4.2.8-SNAPSHOT.pom
[JENKINS] Archiving <https://builds.apache.org/job/karaf-4.2.x/ws/subsystem/pom.xml> to org.apache.karaf.subsystem/org.apache.karaf.subsystem.core/4.2.8-SNAPSHOT/org.apache.karaf.subsystem.core-4.2.8-SNAPSHOT.pom
[JENKINS] Archiving <https://builds.apache.org/job/karaf-4.2.x/ws/jaas/modules/pom.xml> to org.apache.karaf.jaas/org.apache.karaf.jaas.modules/4.2.8-SNAPSHOT/org.apache.karaf.jaas.modules-4.2.8-SNAPSHOT.pom
[JENKINS] Archiving <https://builds.apache.org/job/karaf-4.2.x/ws/examples/karaf-bundle-example/pom.xml> to org.apache.karaf.examples/karaf-bundle-example/4.2.8-SNAPSHOT/karaf-bundle-example-4.2.8-SNAPSHOT.pom
[JENKINS] Archiving <https://builds.apache.org/job/karaf-4.2.x/ws/archetypes/assembly/pom.xml> to org.apache.karaf.archetypes/karaf-assembly-archetype/4.2.8-SNAPSHOT/karaf-assembly-archetype-4.2.8-SNAPSHOT.pom
[JENKINS] Archiving <https://builds.apache.org/job/karaf-4.2.x/ws/service/guard/pom.xml> to org.apache.karaf.service/org.apache.karaf.service.guard/4.2.8-SNAPSHOT/org.apache.karaf.service.guard-4.2.8-SNAPSHOT.pom
[JENKINS] Archiving <https://builds.apache.org/job/karaf-4.2.x/ws/examples/karaf-jpa-example/karaf-jpa-example-provider/karaf-jpa-example-provider-blueprint/karaf-jpa-example-provider-blueprint-openjpa/pom.xml> to org.apache.karaf.examples/karaf-jpa-example-provider-blueprint-openjpa/4.2.8-SNAPSHOT/karaf-jpa-example-provider-blueprint-openjpa-4.2.8-SNAPSHOT.pom
[JENKINS] Archiving <https://builds.apache.org/job/karaf-4.2.x/ws/examples/karaf-war-example/karaf-war-example-webapp/pom.xml> to org.apache.karaf.examples/karaf-war-example-webapp/4.2.8-SNAPSHOT/karaf-war-example-webapp-4.2.8-SNAPSHOT.pom
[JENKINS] Archiving <https://builds.apache.org/job/karaf-4.2.x/ws/tooling/karaf-services-maven-plugin/pom.xml> to org.apache.karaf.tooling/karaf-services-maven-plugin/4.2.8-SNAPSHOT/karaf-services-maven-plugin-4.2.8-SNAPSHOT.pom
[JENKINS] Archiving <https://builds.apache.org/job/karaf-4.2.x/ws/package/pom.xml> to org.apache.karaf.package/org.apache.karaf.package.core/4.2.8-SNAPSHOT/org.apache.karaf.package.core-4.2.8-SNAPSHOT.pom
[JENKINS] Archiving <https://builds.apache.org/job/karaf-4.2.x/ws/features/command/pom.xml> to org.apache.karaf.features/org.apache.karaf.features.command/4.2.8-SNAPSHOT/org.apache.karaf.features.command-4.2.8-SNAPSHOT.pom
[JENKINS] Archiving <https://builds.apache.org/job/karaf-4.2.x/ws/archetypes/blueprint/pom.xml> to org.apache.karaf.archetypes/karaf-blueprint-archetype/4.2.8-SNAPSHOT/karaf-blueprint-archetype-4.2.8-SNAPSHOT.pom
[JENKINS] Archiving <https://builds.apache.org/job/karaf-4.2.x/ws/webconsole/gogo/pom.xml> to org.apache.karaf.webconsole/org.apache.karaf.webconsole.gogo/4.2.8-SNAPSHOT/org.apache.karaf.webconsole.gogo-4.2.8-SNAPSHOT.pom
[JENKINS] Archiving <https://builds.apache.org/job/karaf-4.2.x/ws/audit/pom.xml> to org.apache.karaf.audit/org.apache.karaf.audit.core/4.2.8-SNAPSHOT/org.apache.karaf.audit.core-4.2.8-SNAPSHOT.pom
[JENKINS] Archiving <https://builds.apache.org/job/karaf-4.2.x/ws/management/pom.xml> to org.apache.karaf.management/management/4.2.8-SNAPSHOT/management-4.2.8-SNAPSHOT.pom
[JENKINS] Archiving <https://builds.apache.org/job/karaf-4.2.x/ws/jpa/hibernate/pom.xml> to org.apache.karaf.jpa/hibernate/4.2.8-SNAPSHOT/hibernate-4.2.8-SNAPSHOT.pom
[JENKINS] Archiving <https://builds.apache.org/job/karaf-4.2.x/ws/examples/karaf-mbean-example/karaf-mbean-example-features/pom.xml> to org.apache.karaf.examples/karaf-mbean-example-features/4.2.8-SNAPSHOT/karaf-mbean-example-features-4.2.8-SNAPSHOT.pom
[JENKINS] Archiving <https://builds.apache.org/job/karaf-4.2.x/ws/archetypes/pom.xml> to org.apache.karaf/archetypes/4.2.8-SNAPSHOT/archetypes-4.2.8-SNAPSHOT.pom
[JENKINS] Archiving <https://builds.apache.org/job/karaf-4.2.x/ws/examples/karaf-rest-example/karaf-rest-example-api/pom.xml> to org.apache.karaf.examples/karaf-rest-example-api/4.2.8-SNAPSHOT/karaf-rest-example-api-4.2.8-SNAPSHOT.pom
[JENKINS] Archiving <https://builds.apache.org/job/karaf-4.2.x/ws/examples/karaf-config-example/karaf-config-example-blueprint/pom.xml> to org.apache.karaf.examples/karaf-config-example-blueprint/4.2.8-SNAPSHOT/karaf-config-example-blueprint-4.2.8-SNAPSHOT.pom
[JENKINS] Archiving <https://builds.apache.org/job/karaf-4.2.x/ws/assemblies/features/pom.xml> to org.apache.karaf.assemblies.features/features/4.2.8-SNAPSHOT/features-4.2.8-SNAPSHOT.pom
[JENKINS] Archiving <https://builds.apache.org/job/karaf-4.2.x/ws/examples/karaf-jpa-example/karaf-jpa-example-features/pom.xml> to org.apache.karaf.examples/karaf-jpa-example-features/4.2.8-SNAPSHOT/karaf-jpa-example-features-4.2.8-SNAPSHOT.pom
[JENKINS] Archiving <https://builds.apache.org/job/karaf-4.2.x/ws/manual/pom.xml> to org.apache.karaf/manual/4.2.8-SNAPSHOT/manual-4.2.8-SNAPSHOT.pom
[JENKINS] Archiving <https://builds.apache.org/job/karaf-4.2.x/ws/examples/karaf-jdbc-example/karaf-jdbc-example-provider/pom.xml> to org.apache.karaf.examples/karaf-jdbc-example-provider/4.2.8-SNAPSHOT/karaf-jdbc-example-provider-4.2.8-SNAPSHOT.pom
[JENKINS] Archiving <https://builds.apache.org/job/karaf-4.2.x/ws/examples/karaf-jdbc-example/karaf-jdbc-example-command/pom.xml> to org.apache.karaf.examples/karaf-jdbc-example-command/4.2.8-SNAPSHOT/karaf-jdbc-example-command-4.2.8-SNAPSHOT.pom
[JENKINS] Archiving <https://builds.apache.org/job/karaf-4.2.x/ws/examples/karaf-log-appender-example/karaf-log-appender-example-core/pom.xml> to org.apache.karaf.examples/karaf-log-appender-example-core/4.2.8-SNAPSHOT/karaf-log-appender-example-core-4.2.8-SNAPSHOT.pom
[JENKINS] Archiving <https://builds.apache.org/job/karaf-4.2.x/ws/examples/karaf-jpa-example/karaf-jpa-example-provider/karaf-jpa-example-provider-blueprint/karaf-jpa-example-provider-blueprint-hibernate/pom.xml> to org.apache.karaf.examples/karaf-jpa-example-provider-blueprint-hibernate/4.2.8-SNAPSHOT/karaf-jpa-example-provider-blueprint-hibernate-4.2.8-SNAPSHOT.pom
[JENKINS] Archiving <https://builds.apache.org/job/karaf-4.2.x/ws/assemblies/pom.xml> to org.apache.karaf.assemblies/assemblies/4.2.8-SNAPSHOT/assemblies-4.2.8-SNAPSHOT.pom
[JENKINS] Archiving <https://builds.apache.org/job/karaf-4.2.x/ws/assemblies/apache-karaf-minimal/pom.xml> to org.apache.karaf/apache-karaf-minimal/4.2.8-SNAPSHOT/apache-karaf-minimal-4.2.8-SNAPSHOT.pom
[JENKINS] Archiving <https://builds.apache.org/job/karaf-4.2.x/ws/deployer/pom.xml> to org.apache.karaf.deployer/deployer/4.2.8-SNAPSHOT/deployer-4.2.8-SNAPSHOT.pom
[JENKINS] Archiving <https://builds.apache.org/job/karaf-4.2.x/ws/bundle/core/pom.xml> to org.apache.karaf.bundle/org.apache.karaf.bundle.core/4.2.8-SNAPSHOT/org.apache.karaf.bundle.core-4.2.8-SNAPSHOT.pom
[JENKINS] Archiving <https://builds.apache.org/job/karaf-4.2.x/ws/shell/ssh/pom.xml> to org.apache.karaf.shell/org.apache.karaf.shell.ssh/4.2.8-SNAPSHOT/org.apache.karaf.shell.ssh-4.2.8-SNAPSHOT.pom
[JENKINS] Archiving <https://builds.apache.org/job/karaf-4.2.x/ws/examples/karaf-soap-example/karaf-soap-example-provider/pom.xml> to org.apache.karaf.examples/karaf-soap-example-provider/4.2.8-SNAPSHOT/karaf-soap-example-provider-4.2.8-SNAPSHOT.pom
[JENKINS] Archiving <https://builds.apache.org/job/karaf-4.2.x/ws/examples/karaf-bundle-example/karaf-bundle-example-features/pom.xml> to org.apache.karaf.examples/karaf-bundle-example-features/4.2.8-SNAPSHOT/karaf-bundle-example-features-4.2.8-SNAPSHOT.pom
[JENKINS] Archiving <https://builds.apache.org/job/karaf-4.2.x/ws/examples/karaf-jpa-example/karaf-jpa-example-provider/karaf-jpa-example-provider-api/pom.xml> to org.apache.karaf.examples/karaf-jpa-example-provider-api/4.2.8-SNAPSHOT/karaf-jpa-example-provider-api-4.2.8-SNAPSHOT.pom
[JENKINS] Archiving <https://builds.apache.org/job/karaf-4.2.x/ws/examples/karaf-servlet-example/karaf-servlet-example-blueprint/pom.xml> to org.apache.karaf.examples/karaf-servlet-example-blueprint/4.2.8-SNAPSHOT/karaf-servlet-example-blueprint-4.2.8-SNAPSHOT.pom
[JENKINS] Archiving <https://builds.apache.org/job/karaf-4.2.x/ws/deployer/features/pom.xml> to org.apache.karaf.deployer/org.apache.karaf.deployer.features/4.2.8-SNAPSHOT/org.apache.karaf.deployer.features-4.2.8-SNAPSHOT.pom
[JENKINS] Archiving <https://builds.apache.org/job/karaf-4.2.x/ws/examples/karaf-docker-example/pom.xml> to org.apache.karaf.examples/karaf-docker-example/4.2.8-SNAPSHOT/karaf-docker-example-4.2.8-SNAPSHOT.pom
[JENKINS] Archiving <https://builds.apache.org/job/karaf-4.2.x/ws/examples/karaf-itest-example/pom.xml> to org.apache.karaf.examples/karaf-itest-example/4.2.8-SNAPSHOT/karaf-itest-example-4.2.8-SNAPSHOT.pom
[JENKINS] Archiving <https://builds.apache.org/job/karaf-4.2.x/ws/examples/karaf-blueprint-example/karaf-blueprint-example-common/pom.xml> to org.apache.karaf.examples/karaf-blueprint-example-common/4.2.8-SNAPSHOT/karaf-blueprint-example-common-4.2.8-SNAPSHOT.pom
[JENKINS] Archiving <https://builds.apache.org/job/karaf-4.2.x/ws/examples/karaf-config-example/karaf-config-example-scr/pom.xml> to org.apache.karaf.examples/karaf-config-example-scr/4.2.8-SNAPSHOT/karaf-config-example-scr-4.2.8-SNAPSHOT.pom
[JENKINS] Archiving <https://builds.apache.org/job/karaf-4.2.x/ws/scr/examples/pom.xml> to org.apache.karaf.scr/org.apache.karaf.scr.examples/4.2.8-SNAPSHOT/org.apache.karaf.scr.examples-4.2.8-SNAPSHOT.pom
[JENKINS] Archiving <https://builds.apache.org/job/karaf-4.2.x/ws/examples/karaf-docker-example/karaf-docker-example-dynamic-dist/pom.xml> to org.apache.karaf.examples/karaf-docker-example-dynamic-dist/4.2.8-SNAPSHOT/karaf-docker-example-dynamic-dist-4.2.8-SNAPSHOT.pom
[JENKINS] Archiving <https://builds.apache.org/job/karaf-4.2.x/ws/web/pom.xml> to org.apache.karaf.web/org.apache.karaf.web.core/4.2.8-SNAPSHOT/org.apache.karaf.web.core-4.2.8-SNAPSHOT.pom
[JENKINS] Archiving <https://builds.apache.org/job/karaf-4.2.x/ws/log/pom.xml> to org.apache.karaf.log/org.apache.karaf.log.core/4.2.8-SNAPSHOT/org.apache.karaf.log.core-4.2.8-SNAPSHOT.pom
[JENKINS] Archiving <https://builds.apache.org/job/karaf-4.2.x/ws/examples/karaf-scr-example/karaf-scr-example-features/pom.xml> to org.apache.karaf.examples/karaf-scr-example-features/4.2.8-SNAPSHOT/karaf-scr-example-features-4.2.8-SNAPSHOT.pom
[JENKINS] Archiving <https://builds.apache.org/job/karaf-4.2.x/ws/examples/karaf-jdbc-example/karaf-jdbc-example-api/pom.xml> to org.apache.karaf.examples/karaf-jdbc-example-api/4.2.8-SNAPSHOT/karaf-jdbc-example-api-4.2.8-SNAPSHOT.pom
[JENKINS] Archiving <https://builds.apache.org/job/karaf-4.2.x/ws/features/pom.xml> to org.apache.karaf.features/features/4.2.8-SNAPSHOT/features-4.2.8-SNAPSHOT.pom
[JENKINS] Archiving <https://builds.apache.org/job/karaf-4.2.x/ws/kar/pom.xml> to org.apache.karaf.kar/org.apache.karaf.kar.core/4.2.8-SNAPSHOT/org.apache.karaf.kar.core-4.2.8-SNAPSHOT.pom
[JENKINS] Archiving <https://builds.apache.org/job/karaf-4.2.x/ws/examples/karaf-branding-example/pom.xml> to org.apache.karaf.examples/karaf-branding-example/4.2.8-SNAPSHOT/karaf-branding-example-4.2.8-SNAPSHOT.pom
[JENKINS] Archiving <https://builds.apache.org/job/karaf-4.2.x/ws/diagnostic/pom.xml> to org.apache.karaf.diagnostic/diagnostic/4.2.8-SNAPSHOT/diagnostic-4.2.8-SNAPSHOT.pom
[JENKINS] Archiving <https://builds.apache.org/job/karaf-4.2.x/ws/examples/karaf-mbean-example/pom.xml> to org.apache.karaf.examples/karaf-mbean-example/4.2.8-SNAPSHOT/karaf-mbean-example-4.2.8-SNAPSHOT.pom
[JENKINS] Archiving <https://builds.apache.org/job/karaf-4.2.x/ws/jndi/pom.xml> to org.apache.karaf.jndi/org.apache.karaf.jndi.core/4.2.8-SNAPSHOT/org.apache.karaf.jndi.core-4.2.8-SNAPSHOT.pom
[JENKINS] Archiving <https://builds.apache.org/job/karaf-4.2.x/ws/event/pom.xml> to org.apache.karaf/org.apache.karaf.event/4.2.8-SNAPSHOT/org.apache.karaf.event-4.2.8-SNAPSHOT.pom
[JENKINS] Archiving <https://builds.apache.org/job/karaf-4.2.x/ws/examples/karaf-servlet-example/karaf-servlet-example-registration/pom.xml> to org.apache.karaf.examples/karaf-servlet-example-registration/4.2.8-SNAPSHOT/karaf-servlet-example-registration-4.2.8-SNAPSHOT.pom
[JENKINS] Archiving <https://builds.apache.org/job/karaf-4.2.x/ws/jaas/blueprint/pom.xml> to org.apache.karaf.jaas.blueprint/blueprint/4.2.8-SNAPSHOT/blueprint-4.2.8-SNAPSHOT.pom
[JENKINS] Archiving <https://builds.apache.org/job/karaf-4.2.x/ws/scr/state/pom.xml> to org.apache.karaf.scr/org.apache.karaf.scr.state/4.2.8-SNAPSHOT/org.apache.karaf.scr.state-4.2.8-SNAPSHOT.pom
[JENKINS] Archiving <https://builds.apache.org/job/karaf-4.2.x/ws/config/pom.xml> to org.apache.karaf.config/org.apache.karaf.config.core/4.2.8-SNAPSHOT/org.apache.karaf.config.core-4.2.8-SNAPSHOT.pom
[JENKINS] Archiving <https://builds.apache.org/job/karaf-4.2.x/ws/deployer/blueprint/pom.xml> to org.apache.karaf.deployer/org.apache.karaf.deployer.blueprint/4.2.8-SNAPSHOT/org.apache.karaf.deployer.blueprint-4.2.8-SNAPSHOT.pom
[JENKINS] Archiving <https://builds.apache.org/job/karaf-4.2.x/ws/examples/karaf-url-namespace-handler-example/karaf-url-namespace-handler-example-core/pom.xml> to org.apache.karaf.examples/karaf-url-namespace-handler-example-core/4.2.8-SNAPSHOT/karaf-url-namespace-handler-example-core-4.2.8-SNAPSHOT.pom
[JENKINS] Archiving <https://builds.apache.org/job/karaf-4.2.x/ws/assemblies/features/framework/pom.xml> to org.apache.karaf.features/framework/4.2.8-SNAPSHOT/framework-4.2.8-SNAPSHOT.pom
[JENKINS] Archiving <https://builds.apache.org/job/karaf-4.2.x/ws/deployer/kar/pom.xml> to org.apache.karaf.deployer/org.apache.karaf.deployer.kar/4.2.8-SNAPSHOT/org.apache.karaf.deployer.kar-4.2.8-SNAPSHOT.pom
[JENKINS] Archiving <https://builds.apache.org/job/karaf-4.2.x/ws/examples/karaf-jpa-example/karaf-jpa-example-provider/karaf-jpa-example-provider-blueprint/pom.xml> to org.apache.karaf.examples/karaf-jpa-example-provider-blueprint/4.2.8-SNAPSHOT/karaf-jpa-example-provider-blueprint-4.2.8-SNAPSHOT.pom
[JENKINS] Archiving <https://builds.apache.org/job/karaf-4.2.x/ws/wrapper/pom.xml> to org.apache.karaf.wrapper/org.apache.karaf.wrapper.core/4.2.8-SNAPSHOT/org.apache.karaf.wrapper.core-4.2.8-SNAPSHOT.pom
[JENKINS] Archiving <https://builds.apache.org/job/karaf-4.2.x/ws/examples/karaf-servlet-example/karaf-servlet-example-scr/pom.xml> to org.apache.karaf.examples/karaf-servlet-example-scr/4.2.8-SNAPSHOT/karaf-servlet-example-scr-4.2.8-SNAPSHOT.pom
[JENKINS] Archiving <https://builds.apache.org/job/karaf-4.2.x/ws/examples/karaf-deployer-example/pom.xml> to org.apache.karaf.examples/karaf-deployer-example/4.2.8-SNAPSHOT/karaf-deployer-example-4.2.8-SNAPSHOT.pom
[JENKINS] Archiving <https://builds.apache.org/job/karaf-4.2.x/ws/tooling/utils/pom.xml> to org.apache.karaf.tooling/org.apache.karaf.tools.utils/4.2.8-SNAPSHOT/org.apache.karaf.tools.utils-4.2.8-SNAPSHOT.pom
[JENKINS] Archiving <https://builds.apache.org/job/karaf-4.2.x/ws/service/core/pom.xml> to org.apache.karaf.service/org.apache.karaf.service.core/4.2.8-SNAPSHOT/org.apache.karaf.service.core-4.2.8-SNAPSHOT.pom
[JENKINS] Archiving <https://builds.apache.org/job/karaf-4.2.x/ws/docker/pom.xml> to org.apache.karaf.docker/org.apache.karaf.docker.core/4.2.8-SNAPSHOT/org.apache.karaf.docker.core-4.2.8-SNAPSHOT.pom
[JENKINS] Archiving <https://builds.apache.org/job/karaf-4.2.x/ws/examples/karaf-config-example/karaf-config-example-managed/pom.xml> to org.apache.karaf.examples/karaf-config-example-managed/4.2.8-SNAPSHOT/karaf-config-example-managed-4.2.8-SNAPSHOT.pom
[JENKINS] Archiving <https://builds.apache.org/job/karaf-4.2.x/ws/examples/karaf-jms-example/karaf-jms-example-command/pom.xml> to org.apache.karaf.examples/karaf-jms-example-command/4.2.8-SNAPSHOT/karaf-jms-example-command-4.2.8-SNAPSHOT.pom
[JENKINS] Archiving <https://builds.apache.org/job/karaf-4.2.x/ws/examples/karaf-rest-example/karaf-rest-example-whiteboard/pom.xml> to org.apache.karaf.examples/karaf-rest-example-whiteboard/4.2.8-SNAPSHOT/karaf-rest-example-whiteboard-4.2.8-SNAPSHOT.pom
[JENKINS] Archiving <https://builds.apache.org/job/karaf-4.2.x/ws/archetypes/kar/pom.xml> to org.apache.karaf.archetypes/karaf-kar-archetype/4.2.8-SNAPSHOT/karaf-kar-archetype-4.2.8-SNAPSHOT.pom
[JENKINS] Archiving <https://builds.apache.org/job/karaf-4.2.x/ws/jaas/command/pom.xml> to org.apache.karaf.jaas/org.apache.karaf.jaas.command/4.2.8-SNAPSHOT/org.apache.karaf.jaas.command-4.2.8-SNAPSHOT.pom
[JENKINS] Archiving <https://builds.apache.org/job/karaf-4.2.x/ws/examples/karaf-mbean-example/karaf-mbean-example-provider/pom.xml> to org.apache.karaf.examples/karaf-mbean-example-provider/4.2.8-SNAPSHOT/karaf-mbean-example-provider-4.2.8-SNAPSHOT.pom
[JENKINS] Archiving <https://builds.apache.org/job/karaf-4.2.x/ws/assemblies/features/spring/pom.xml> to org.apache.karaf.features/spring/4.2.8-SNAPSHOT/spring-4.2.8-SNAPSHOT.pom
[JENKINS] Archiving <https://builds.apache.org/job/karaf-4.2.x/ws/archetypes/command/pom.xml> to org.apache.karaf.archetypes/karaf-command-archetype/4.2.8-SNAPSHOT/karaf-command-archetype-4.2.8-SNAPSHOT.pom
[JENKINS] Archiving <https://builds.apache.org/job/karaf-4.2.x/ws/examples/karaf-war-example/pom.xml> to org.apache.karaf.examples/karaf-war-example/4.2.8-SNAPSHOT/karaf-war-example-4.2.8-SNAPSHOT.pom
[JENKINS] Archiving <https://builds.apache.org/job/karaf-4.2.x/ws/examples/karaf-jpa-example/karaf-jpa-example-provider/karaf-jpa-example-provider-blueprint/karaf-jpa-example-provider-blueprint-eclipselink/pom.xml> to org.apache.karaf.examples/karaf-jpa-example-provider-blueprint-eclipselink/4.2.8-SNAPSHOT/karaf-jpa-example-provider-blueprint-eclipselink-4.2.8-SNAPSHOT.pom
[JENKINS] Archiving <https://builds.apache.org/job/karaf-4.2.x/ws/examples/karaf-command-example/pom.xml> to org.apache.karaf.examples/karaf-command-example/4.2.8-SNAPSHOT/karaf-command-example-4.2.8-SNAPSHOT.pom
[JENKINS] Archiving <https://builds.apache.org/job/karaf-4.2.x/ws/tooling/karaf-maven-plugin/pom.xml> to org.apache.karaf.tooling/karaf-maven-plugin/4.2.8-SNAPSHOT/karaf-maven-plugin-4.2.8-SNAPSHOT.pom
[JENKINS] Archiving <https://builds.apache.org/job/karaf-4.2.x/ws/itests/common/pom.xml> to org.apache.karaf.itests/common/4.2.8-SNAPSHOT/common-4.2.8-SNAPSHOT.pom
[JENKINS] Archiving <https://builds.apache.org/job/karaf-4.2.x/ws/examples/karaf-bundle-example/karaf-bundle-example-client/pom.xml> to org.apache.karaf.examples/karaf-bundle-example-client/4.2.8-SNAPSHOT/karaf-bundle-example-client-4.2.8-SNAPSHOT.pom
[JENKINS] Archiving <https://builds.apache.org/job/karaf-4.2.x/ws/itests/test/pom.xml> to org.apache.karaf.itests/tests/4.2.8-SNAPSHOT/tests-4.2.8-SNAPSHOT.pom
[JENKINS] Archiving <https://builds.apache.org/job/karaf-4.2.x/ws/webconsole/console/pom.xml> to org.apache.karaf.webconsole/org.apache.karaf.webconsole.console/4.2.8-SNAPSHOT/org.apache.karaf.webconsole.console-4.2.8-SNAPSHOT.pom
[JENKINS] Archiving <https://builds.apache.org/job/karaf-4.2.x/ws/scr/examples/service/pom.xml> to org.apache.karaf.scr.examples/org.apache.karaf.scr.examples.service/4.2.8-SNAPSHOT/org.apache.karaf.scr.examples.service-4.2.8-SNAPSHOT.pom
[JENKINS] Archiving <https://builds.apache.org/job/karaf-4.2.x/ws/obr/pom.xml> to org.apache.karaf.obr/org.apache.karaf.obr.core/4.2.8-SNAPSHOT/org.apache.karaf.obr.core-4.2.8-SNAPSHOT.pom
[JENKINS] Archiving <https://builds.apache.org/job/karaf-4.2.x/ws/examples/karaf-jpa-example/karaf-jpa-example-provider/karaf-jpa-example-provider-ds/karaf-jpa-example-provider-ds-hibernate/pom.xml> to org.apache.karaf.examples/karaf-jpa-example-provider-ds-hibernate/4.2.8-SNAPSHOT/karaf-jpa-example-provider-ds-hibernate-4.2.8-SNAPSHOT.pom
[JENKINS] Archiving <https://builds.apache.org/job/karaf-4.2.x/ws/itests/pom.xml> to org.apache.karaf.itests/itests/4.2.8-SNAPSHOT/itests-4.2.8-SNAPSHOT.pom
[JENKINS] Archiving <https://builds.apache.org/job/karaf-4.2.x/ws/jaas/boot/pom.xml> to org.apache.karaf.jaas/org.apache.karaf.jaas.boot/4.2.8-SNAPSHOT/org.apache.karaf.jaas.boot-4.2.8-SNAPSHOT.pom
[JENKINS] Archiving <https://builds.apache.org/job/karaf-4.2.x/ws/jaas/boot/target/org.apache.karaf.jaas.boot-4.2.8-SNAPSHOT.jar> to org.apache.karaf.jaas/org.apache.karaf.jaas.boot/4.2.8-SNAPSHOT/org.apache.karaf.jaas.boot-4.2.8-SNAPSHOT.jar
[JENKINS] Archiving <https://builds.apache.org/job/karaf-4.2.x/ws/examples/karaf-maven-example/pom.xml> to org.apache.karaf.examples/karaf-maven-example/4.2.8-SNAPSHOT/karaf-maven-example-4.2.8-SNAPSHOT.pom
[JENKINS] Archiving <https://builds.apache.org/job/karaf-4.2.x/ws/tooling/pom.xml> to org.apache.karaf.tooling/tooling/4.2.8-SNAPSHOT/tooling-4.2.8-SNAPSHOT.pom
[JENKINS] Archiving <https://builds.apache.org/job/karaf-4.2.x/ws/examples/karaf-bundle-example/karaf-bundle-example-common/pom.xml> to org.apache.karaf.examples/karaf-bundle-example-common/4.2.8-SNAPSHOT/karaf-bundle-example-common-4.2.8-SNAPSHOT.pom
[JENKINS] Archiving <https://builds.apache.org/job/karaf-4.2.x/ws/shell/commands/pom.xml> to org.apache.karaf.shell/org.apache.karaf.shell.commands/4.2.8-SNAPSHOT/org.apache.karaf.shell.commands-4.2.8-SNAPSHOT.pom
[JENKINS] Archiving <https://builds.apache.org/job/karaf-4.2.x/ws/webconsole/http/pom.xml> to org.apache.karaf.webconsole/org.apache.karaf.webconsole.http/4.2.8-SNAPSHOT/org.apache.karaf.webconsole.http-4.2.8-SNAPSHOT.pom
[JENKINS] Archiving <https://builds.apache.org/job/karaf-4.2.x/ws/examples/karaf-jpa-example/pom.xml> to org.apache.karaf.examples/karaf-jpa-example/4.2.8-SNAPSHOT/karaf-jpa-example-4.2.8-SNAPSHOT.pom
[JENKINS] Archiving <https://builds.apache.org/job/karaf-4.2.x/ws/jaas/config/pom.xml> to org.apache.karaf.jaas/org.apache.karaf.jaas.config/4.2.8-SNAPSHOT/org.apache.karaf.jaas.config-4.2.8-SNAPSHOT.pom
[JENKINS] Archiving <https://builds.apache.org/job/karaf-4.2.x/ws/services/staticcm/pom.xml> to org.apache.karaf.services/org.apache.karaf.services.staticcm/4.2.8-SNAPSHOT/org.apache.karaf.services.staticcm-4.2.8-SNAPSHOT.pom
[JENKINS] Archiving <https://builds.apache.org/job/karaf-4.2.x/ws/jaas/blueprint/jasypt/pom.xml> to org.apache.karaf.jaas.blueprint/org.apache.karaf.jaas.blueprint.jasypt/4.2.8-SNAPSHOT/org.apache.karaf.jaas.blueprint.jasypt-4.2.8-SNAPSHOT.pom
[JENKINS] Archiving <https://builds.apache.org/job/karaf-4.2.x/ws/specs/pom.xml> to org.apache.karaf.specs/specs/4.2.8-SNAPSHOT/specs-4.2.8-SNAPSHOT.pom
[JENKINS] Archiving <https://builds.apache.org/job/karaf-4.2.x/ws/shell/console/pom.xml> to org.apache.karaf.shell/org.apache.karaf.shell.console/4.2.8-SNAPSHOT/org.apache.karaf.shell.console-4.2.8-SNAPSHOT.pom
[JENKINS] Archiving <https://builds.apache.org/job/karaf-4.2.x/ws/examples/karaf-jdbc-example/karaf-jdbc-example-features/pom.xml> to org.apache.karaf.examples/karaf-jdbc-example-features/4.2.8-SNAPSHOT/karaf-jdbc-example-features-4.2.8-SNAPSHOT.pom
[JENKINS] Archiving <https://builds.apache.org/job/karaf-4.2.x/ws/webconsole/pom.xml> to org.apache.karaf.webconsole/webconsole/4.2.8-SNAPSHOT/webconsole-4.2.8-SNAPSHOT.pom
[JENKINS] Archiving <https://builds.apache.org/job/karaf-4.2.x/ws/examples/karaf-command-example/karaf-command-example-command/pom.xml> to org.apache.karaf.examples/karaf-command-example-command/4.2.8-SNAPSHOT/karaf-command-example-command-4.2.8-SNAPSHOT.pom
[JENKINS] Archiving <https://builds.apache.org/job/karaf-4.2.x/ws/examples/karaf-config-example/pom.xml> to org.apache.karaf.examples/karaf-config-example/4.2.8-SNAPSHOT/karaf-config-example-4.2.8-SNAPSHOT.pom
[JENKINS] Archiving <https://builds.apache.org/job/karaf-4.2.x/ws/assemblies/features/enterprise-legacy/pom.xml> to org.apache.karaf.features/enterprise-legacy/4.2.8-SNAPSHOT/enterprise-legacy-4.2.8-SNAPSHOT.pom
[JENKINS] Archiving <https://builds.apache.org/job/karaf-4.2.x/ws/examples/karaf-soap-example/karaf-soap-example-client/pom.xml> to org.apache.karaf.examples/karaf-soap-example-client/4.2.8-SNAPSHOT/karaf-soap-example-client-4.2.8-SNAPSHOT.pom
[JENKINS] Archiving <https://builds.apache.org/job/karaf-4.2.x/ws/features/extension/pom.xml> to org.apache.karaf.features/org.apache.karaf.features.extension/4.2.8-SNAPSHOT/org.apache.karaf.features.extension-4.2.8-SNAPSHOT.pom
[JENKINS] Archiving <https://builds.apache.org/job/karaf-4.2.x/ws/management/server/pom.xml> to org.apache.karaf.management/org.apache.karaf.management.server/4.2.8-SNAPSHOT/org.apache.karaf.management.server-4.2.8-SNAPSHOT.pom
[JENKINS] Archiving <https://builds.apache.org/job/karaf-4.2.x/ws/examples/karaf-url-namespace-handler-example/pom.xml> to org.apache.karaf.examples/karaf-url-namespace-handler-example/4.2.8-SNAPSHOT/karaf-url-namespace-handler-example-4.2.8-SNAPSHOT.pom
[JENKINS] Archiving <https://builds.apache.org/job/karaf-4.2.x/ws/examples/karaf-soap-example/pom.xml> to org.apache.karaf.examples/karaf-soap-example/4.2.8-SNAPSHOT/karaf-soap-example-4.2.8-SNAPSHOT.pom
[JENKINS] Archiving <https://builds.apache.org/job/karaf-4.2.x/ws/examples/karaf-profile-example/karaf-profile-example-dynamic/pom.xml> to org.apache.karaf.examples/karaf-profile-example-dynamic/4.2.8-SNAPSHOT/karaf-profile-example-dynamic-4.2.8-SNAPSHOT.pom
[JENKINS] Archiving <https://builds.apache.org/job/karaf-4.2.x/ws/scheduler/pom.xml> to org.apache.karaf.scheduler/org.apache.karaf.scheduler.core/4.2.8-SNAPSHOT/org.apache.karaf.scheduler.core-4.2.8-SNAPSHOT.pom
[JENKINS] Archiving <https://builds.apache.org/job/karaf-4.2.x/ws/examples/pom.xml> to org.apache.karaf.examples/apache-karaf-examples/4.2.8-SNAPSHOT/apache-karaf-examples-4.2.8-SNAPSHOT.pom
[JENKINS] Archiving <https://builds.apache.org/job/karaf-4.2.x/ws/examples/karaf-docker-example/karaf-docker-example-app/pom.xml> to org.apache.karaf.examples/karaf-docker-example-app/4.2.8-SNAPSHOT/karaf-docker-example-app-4.2.8-SNAPSHOT.pom
[JENKINS] Archiving <https://builds.apache.org/job/karaf-4.2.x/ws/util/pom.xml> to org.apache.karaf/org.apache.karaf.util/4.2.8-SNAPSHOT/org.apache.karaf.util-4.2.8-SNAPSHOT.pom
[JENKINS] Archiving <https://builds.apache.org/job/karaf-4.2.x/ws/examples/karaf-log-appender-example/karaf-log-appender-example-features/pom.xml> to org.apache.karaf.examples/karaf-log-appender-example-features/4.2.8-SNAPSHOT/karaf-log-appender-example-features-4.2.8-SNAPSHOT.pom
[JENKINS] Archiving <https://builds.apache.org/job/karaf-4.2.x/ws/examples/karaf-scr-example/pom.xml> to org.apache.karaf.examples/karaf-scr-example/4.2.8-SNAPSHOT/karaf-scr-example-4.2.8-SNAPSHOT.pom
[JENKINS] Archiving <https://builds.apache.org/job/karaf-4.2.x/ws/specs/activator/pom.xml> to org.apache.karaf.specs/org.apache.karaf.specs.activator/4.2.8-SNAPSHOT/org.apache.karaf.specs.activator-4.2.8-SNAPSHOT.pom
[JENKINS] Archiving <https://builds.apache.org/job/karaf-4.2.x/ws/examples/karaf-blueprint-example/karaf-blueprint-example-features/pom.xml> to org.apache.karaf.examples/karaf-blueprint-example-features/4.2.8-SNAPSHOT/karaf-blueprint-example-features-4.2.8-SNAPSHOT.pom
channel stopped
Build failed in Jenkins: karaf-4.2.x #399
Posted by Apache Jenkins Server <je...@builds.apache.org>.
See <https://builds.apache.org/job/karaf-4.2.x/399/display/redirect>
------------------------------------------
[...truncated 1.82 KB...]
at hudson.remoting.InterceptingExecutorService$1.call(InterceptingExecutorService.java:72)
at java.util.concurrent.FutureTask.run(FutureTask.java:266)
at java.util.concurrent.ThreadPoolExecutor.runWorker(ThreadPoolExecutor.java:1142)
at java.util.concurrent.ThreadPoolExecutor$Worker.run(ThreadPoolExecutor.java:617)
at java.lang.Thread.run(Thread.java:748)
Caused by: java.lang.OutOfMemoryError: unable to create new native thread
at java.lang.Thread.start0(Native Method)
at java.lang.Thread.start(Thread.java:717)
at hudson.Proc$LocalProc.<init>(Proc.java:281)
at hudson.Proc$LocalProc.<init>(Proc.java:218)
at hudson.Launcher$LocalLauncher.launch(Launcher.java:936)
at hudson.Launcher$ProcStarter.start(Launcher.java:455)
at org.jenkinsci.plugins.gitclient.CliGitAPIImpl.launchCommandIn(CliGitAPIImpl.java:2038)
... 20 more
Cloning the remote Git repository
Cloning repository https://gitbox.apache.org/repos/asf/karaf.git
> git init <https://builds.apache.org/job/karaf-4.2.x/ws/> # timeout=10
ERROR: Error cloning remote repo 'origin'
hudson.plugins.git.GitException: Could not init <https://builds.apache.org/job/karaf-4.2.x/ws/>
at org.jenkinsci.plugins.gitclient.CliGitAPIImpl$5.execute(CliGitAPIImpl.java:813)
at org.jenkinsci.plugins.gitclient.CliGitAPIImpl$2.execute(CliGitAPIImpl.java:605)
at org.jenkinsci.plugins.gitclient.RemoteGitImpl$CommandInvocationHandler$1.call(RemoteGitImpl.java:153)
at org.jenkinsci.plugins.gitclient.RemoteGitImpl$CommandInvocationHandler$1.call(RemoteGitImpl.java:146)
at hudson.remoting.UserRequest.perform(UserRequest.java:212)
at hudson.remoting.UserRequest.perform(UserRequest.java:54)
at hudson.remoting.Request$2.run(Request.java:369)
at hudson.remoting.InterceptingExecutorService$1.call(InterceptingExecutorService.java:72)
at java.util.concurrent.FutureTask.run(FutureTask.java:266)
at java.util.concurrent.ThreadPoolExecutor.runWorker(ThreadPoolExecutor.java:1142)
at java.util.concurrent.ThreadPoolExecutor$Worker.run(ThreadPoolExecutor.java:617)
at java.lang.Thread.run(Thread.java:748)
Suppressed: hudson.remoting.Channel$CallSiteStackTrace: Remote call to H41
at hudson.remoting.Channel.attachCallSiteStackTrace(Channel.java:1741)
at hudson.remoting.UserRequest$ExceptionResponse.retrieve(UserRequest.java:357)
at hudson.remoting.Channel.call(Channel.java:955)
at org.jenkinsci.plugins.gitclient.RemoteGitImpl$CommandInvocationHandler.execute(RemoteGitImpl.java:146)
at sun.reflect.GeneratedMethodAccessor1084.invoke(Unknown Source)
at sun.reflect.DelegatingMethodAccessorImpl.invoke(DelegatingMethodAccessorImpl.java:43)
at java.lang.reflect.Method.invoke(Method.java:498)
at org.jenkinsci.plugins.gitclient.RemoteGitImpl$CommandInvocationHandler.invoke(RemoteGitImpl.java:132)
at com.sun.proxy.$Proxy135.execute(Unknown Source)
at hudson.plugins.git.GitSCM.retrieveChanges(GitSCM.java:1152)
at hudson.plugins.git.GitSCM.checkout(GitSCM.java:1192)
at hudson.scm.SCM.checkout(SCM.java:504)
at hudson.model.AbstractProject.checkout(AbstractProject.java:1208)
at hudson.model.AbstractBuild$AbstractBuildExecution.defaultCheckout(AbstractBuild.java:574)
at jenkins.scm.SCMCheckoutStrategy.checkout(SCMCheckoutStrategy.java:86)
at hudson.model.AbstractBuild$AbstractBuildExecution.run(AbstractBuild.java:499)
at hudson.model.Run.execute(Run.java:1810)
at hudson.maven.MavenModuleSetBuild.run(MavenModuleSetBuild.java:543)
at hudson.model.ResourceController.execute(ResourceController.java:97)
at hudson.model.Executor.run(Executor.java:429)
Caused by: hudson.plugins.git.GitException: Error performing git command
at org.jenkinsci.plugins.gitclient.CliGitAPIImpl.launchCommandIn(CliGitAPIImpl.java:2051)
at org.jenkinsci.plugins.gitclient.CliGitAPIImpl.launchCommandIn(CliGitAPIImpl.java:2010)
at org.jenkinsci.plugins.gitclient.CliGitAPIImpl.launchCommandIn(CliGitAPIImpl.java:2006)
at org.jenkinsci.plugins.gitclient.CliGitAPIImpl.launchCommand(CliGitAPIImpl.java:1638)
at org.jenkinsci.plugins.gitclient.CliGitAPIImpl$5.execute(CliGitAPIImpl.java:811)
... 11 more
Caused by: java.lang.OutOfMemoryError: unable to create new native thread
at java.lang.Thread.start0(Native Method)
at java.lang.Thread.start(Thread.java:717)
at hudson.Proc$LocalProc.<init>(Proc.java:281)
at hudson.Proc$LocalProc.<init>(Proc.java:218)
at hudson.Launcher$LocalLauncher.launch(Launcher.java:936)
at hudson.Launcher$ProcStarter.start(Launcher.java:455)
at org.jenkinsci.plugins.gitclient.CliGitAPIImpl.launchCommandIn(CliGitAPIImpl.java:2038)
... 15 more
ERROR: Error cloning remote repo 'origin'
Retrying after 10 seconds
No credentials specified
> git rev-parse --is-inside-work-tree # timeout=10
ERROR: Workspace has a .git repository, but it appears to be corrupt.
hudson.plugins.git.GitException: Error performing git command
at org.jenkinsci.plugins.gitclient.CliGitAPIImpl.launchCommandIn(CliGitAPIImpl.java:2051)
at org.jenkinsci.plugins.gitclient.CliGitAPIImpl.launchCommandIn(CliGitAPIImpl.java:2010)
at org.jenkinsci.plugins.gitclient.CliGitAPIImpl.launchCommandIn(CliGitAPIImpl.java:2006)
at org.jenkinsci.plugins.gitclient.CliGitAPIImpl.launchCommand(CliGitAPIImpl.java:1638)
at org.jenkinsci.plugins.gitclient.CliGitAPIImpl.launchCommand(CliGitAPIImpl.java:1650)
at org.jenkinsci.plugins.gitclient.CliGitAPIImpl.hasGitRepo(CliGitAPIImpl.java:300)
at hudson.plugins.git.GitAPI.hasGitRepo(GitAPI.java:232)
at sun.reflect.GeneratedMethodAccessor57.invoke(Unknown Source)
at sun.reflect.DelegatingMethodAccessorImpl.invoke(DelegatingMethodAccessorImpl.java:43)
at java.lang.reflect.Method.invoke(Method.java:498)
at hudson.remoting.RemoteInvocationHandler$RPCRequest.perform(RemoteInvocationHandler.java:929)
at hudson.remoting.RemoteInvocationHandler$RPCRequest.call(RemoteInvocationHandler.java:903)
at hudson.remoting.RemoteInvocationHandler$RPCRequest.call(RemoteInvocationHandler.java:855)
at hudson.remoting.UserRequest.perform(UserRequest.java:212)
at hudson.remoting.UserRequest.perform(UserRequest.java:54)
at hudson.remoting.Request$2.run(Request.java:369)
at hudson.remoting.InterceptingExecutorService$1.call(InterceptingExecutorService.java:72)
at java.util.concurrent.FutureTask.run(FutureTask.java:266)
at java.util.concurrent.ThreadPoolExecutor.runWorker(ThreadPoolExecutor.java:1142)
at java.util.concurrent.ThreadPoolExecutor$Worker.run(ThreadPoolExecutor.java:617)
at java.lang.Thread.run(Thread.java:748)
Caused by: java.lang.OutOfMemoryError: unable to create new native thread
at java.lang.Thread.start0(Native Method)
at java.lang.Thread.start(Thread.java:717)
at hudson.Proc$LocalProc.<init>(Proc.java:281)
at hudson.Proc$LocalProc.<init>(Proc.java:218)
at hudson.Launcher$LocalLauncher.launch(Launcher.java:936)
at hudson.Launcher$ProcStarter.start(Launcher.java:455)
at org.jenkinsci.plugins.gitclient.CliGitAPIImpl.launchCommandIn(CliGitAPIImpl.java:2038)
... 20 more
Cloning the remote Git repository
Cloning repository https://gitbox.apache.org/repos/asf/karaf.git
> git init <https://builds.apache.org/job/karaf-4.2.x/ws/> # timeout=10
ERROR: Error cloning remote repo 'origin'
hudson.plugins.git.GitException: Could not init <https://builds.apache.org/job/karaf-4.2.x/ws/>
at org.jenkinsci.plugins.gitclient.CliGitAPIImpl$5.execute(CliGitAPIImpl.java:813)
at org.jenkinsci.plugins.gitclient.CliGitAPIImpl$2.execute(CliGitAPIImpl.java:605)
at org.jenkinsci.plugins.gitclient.RemoteGitImpl$CommandInvocationHandler$1.call(RemoteGitImpl.java:153)
at org.jenkinsci.plugins.gitclient.RemoteGitImpl$CommandInvocationHandler$1.call(RemoteGitImpl.java:146)
at hudson.remoting.UserRequest.perform(UserRequest.java:212)
at hudson.remoting.UserRequest.perform(UserRequest.java:54)
at hudson.remoting.Request$2.run(Request.java:369)
at hudson.remoting.InterceptingExecutorService$1.call(InterceptingExecutorService.java:72)
at java.util.concurrent.FutureTask.run(FutureTask.java:266)
at java.util.concurrent.ThreadPoolExecutor.runWorker(ThreadPoolExecutor.java:1142)
at java.util.concurrent.ThreadPoolExecutor$Worker.run(ThreadPoolExecutor.java:617)
at java.lang.Thread.run(Thread.java:748)
Suppressed: hudson.remoting.Channel$CallSiteStackTrace: Remote call to H41
at hudson.remoting.Channel.attachCallSiteStackTrace(Channel.java:1741)
at hudson.remoting.UserRequest$ExceptionResponse.retrieve(UserRequest.java:357)
at hudson.remoting.Channel.call(Channel.java:955)
at org.jenkinsci.plugins.gitclient.RemoteGitImpl$CommandInvocationHandler.execute(RemoteGitImpl.java:146)
at sun.reflect.GeneratedMethodAccessor1084.invoke(Unknown Source)
at sun.reflect.DelegatingMethodAccessorImpl.invoke(DelegatingMethodAccessorImpl.java:43)
at java.lang.reflect.Method.invoke(Method.java:498)
at org.jenkinsci.plugins.gitclient.RemoteGitImpl$CommandInvocationHandler.invoke(RemoteGitImpl.java:132)
at com.sun.proxy.$Proxy135.execute(Unknown Source)
at hudson.plugins.git.GitSCM.retrieveChanges(GitSCM.java:1152)
at hudson.plugins.git.GitSCM.checkout(GitSCM.java:1192)
at hudson.scm.SCM.checkout(SCM.java:504)
at hudson.model.AbstractProject.checkout(AbstractProject.java:1208)
at hudson.model.AbstractBuild$AbstractBuildExecution.defaultCheckout(AbstractBuild.java:574)
at jenkins.scm.SCMCheckoutStrategy.checkout(SCMCheckoutStrategy.java:86)
at hudson.model.AbstractBuild$AbstractBuildExecution.run(AbstractBuild.java:499)
at hudson.model.Run.execute(Run.java:1810)
at hudson.maven.MavenModuleSetBuild.run(MavenModuleSetBuild.java:543)
at hudson.model.ResourceController.execute(ResourceController.java:97)
at hudson.model.Executor.run(Executor.java:429)
Caused by: hudson.plugins.git.GitException: Error performing git command
at org.jenkinsci.plugins.gitclient.CliGitAPIImpl.launchCommandIn(CliGitAPIImpl.java:2051)
at org.jenkinsci.plugins.gitclient.CliGitAPIImpl.launchCommandIn(CliGitAPIImpl.java:2010)
at org.jenkinsci.plugins.gitclient.CliGitAPIImpl.launchCommandIn(CliGitAPIImpl.java:2006)
at org.jenkinsci.plugins.gitclient.CliGitAPIImpl.launchCommand(CliGitAPIImpl.java:1638)
at org.jenkinsci.plugins.gitclient.CliGitAPIImpl$5.execute(CliGitAPIImpl.java:811)
... 11 more
Caused by: java.lang.OutOfMemoryError: unable to create new native thread
at java.lang.Thread.start0(Native Method)
at java.lang.Thread.start(Thread.java:717)
at hudson.Proc$LocalProc.<init>(Proc.java:281)
at hudson.Proc$LocalProc.<init>(Proc.java:218)
at hudson.Launcher$LocalLauncher.launch(Launcher.java:936)
at hudson.Launcher$ProcStarter.start(Launcher.java:455)
at org.jenkinsci.plugins.gitclient.CliGitAPIImpl.launchCommandIn(CliGitAPIImpl.java:2038)
... 15 more
ERROR: Error cloning remote repo 'origin'
Retrying after 10 seconds
No credentials specified
> git rev-parse --is-inside-work-tree # timeout=10
ERROR: Workspace has a .git repository, but it appears to be corrupt.
hudson.plugins.git.GitException: Error performing git command
at org.jenkinsci.plugins.gitclient.CliGitAPIImpl.launchCommandIn(CliGitAPIImpl.java:2051)
at org.jenkinsci.plugins.gitclient.CliGitAPIImpl.launchCommandIn(CliGitAPIImpl.java:2010)
at org.jenkinsci.plugins.gitclient.CliGitAPIImpl.launchCommandIn(CliGitAPIImpl.java:2006)
at org.jenkinsci.plugins.gitclient.CliGitAPIImpl.launchCommand(CliGitAPIImpl.java:1638)
at org.jenkinsci.plugins.gitclient.CliGitAPIImpl.launchCommand(CliGitAPIImpl.java:1650)
at org.jenkinsci.plugins.gitclient.CliGitAPIImpl.hasGitRepo(CliGitAPIImpl.java:300)
at hudson.plugins.git.GitAPI.hasGitRepo(GitAPI.java:232)
at sun.reflect.GeneratedMethodAccessor57.invoke(Unknown Source)
at sun.reflect.DelegatingMethodAccessorImpl.invoke(DelegatingMethodAccessorImpl.java:43)
at java.lang.reflect.Method.invoke(Method.java:498)
at hudson.remoting.RemoteInvocationHandler$RPCRequest.perform(RemoteInvocationHandler.java:929)
at hudson.remoting.RemoteInvocationHandler$RPCRequest.call(RemoteInvocationHandler.java:903)
at hudson.remoting.RemoteInvocationHandler$RPCRequest.call(RemoteInvocationHandler.java:855)
at hudson.remoting.UserRequest.perform(UserRequest.java:212)
at hudson.remoting.UserRequest.perform(UserRequest.java:54)
at hudson.remoting.Request$2.run(Request.java:369)
at hudson.remoting.InterceptingExecutorService$1.call(InterceptingExecutorService.java:72)
at java.util.concurrent.FutureTask.run(FutureTask.java:266)
at java.util.concurrent.ThreadPoolExecutor.runWorker(ThreadPoolExecutor.java:1142)
at java.util.concurrent.ThreadPoolExecutor$Worker.run(ThreadPoolExecutor.java:617)
at java.lang.Thread.run(Thread.java:748)
Caused by: java.lang.OutOfMemoryError: unable to create new native thread
at java.lang.Thread.start0(Native Method)
at java.lang.Thread.start(Thread.java:717)
at hudson.Proc$LocalProc.<init>(Proc.java:281)
at hudson.Proc$LocalProc.<init>(Proc.java:218)
at hudson.Launcher$LocalLauncher.launch(Launcher.java:936)
at hudson.Launcher$ProcStarter.start(Launcher.java:455)
at org.jenkinsci.plugins.gitclient.CliGitAPIImpl.launchCommandIn(CliGitAPIImpl.java:2038)
... 20 more
Cloning the remote Git repository
Cloning repository https://gitbox.apache.org/repos/asf/karaf.git
> git init <https://builds.apache.org/job/karaf-4.2.x/ws/> # timeout=10
ERROR: Error cloning remote repo 'origin'
hudson.plugins.git.GitException: Could not init <https://builds.apache.org/job/karaf-4.2.x/ws/>
at org.jenkinsci.plugins.gitclient.CliGitAPIImpl$5.execute(CliGitAPIImpl.java:813)
at org.jenkinsci.plugins.gitclient.CliGitAPIImpl$2.execute(CliGitAPIImpl.java:605)
at org.jenkinsci.plugins.gitclient.RemoteGitImpl$CommandInvocationHandler$1.call(RemoteGitImpl.java:153)
at org.jenkinsci.plugins.gitclient.RemoteGitImpl$CommandInvocationHandler$1.call(RemoteGitImpl.java:146)
at hudson.remoting.UserRequest.perform(UserRequest.java:212)
at hudson.remoting.UserRequest.perform(UserRequest.java:54)
at hudson.remoting.Request$2.run(Request.java:369)
at hudson.remoting.InterceptingExecutorService$1.call(InterceptingExecutorService.java:72)
at java.util.concurrent.FutureTask.run(FutureTask.java:266)
at java.util.concurrent.ThreadPoolExecutor.runWorker(ThreadPoolExecutor.java:1142)
at java.util.concurrent.ThreadPoolExecutor$Worker.run(ThreadPoolExecutor.java:617)
at java.lang.Thread.run(Thread.java:748)
Suppressed: hudson.remoting.Channel$CallSiteStackTrace: Remote call to H41
at hudson.remoting.Channel.attachCallSiteStackTrace(Channel.java:1741)
at hudson.remoting.UserRequest$ExceptionResponse.retrieve(UserRequest.java:357)
at hudson.remoting.Channel.call(Channel.java:955)
at org.jenkinsci.plugins.gitclient.RemoteGitImpl$CommandInvocationHandler.execute(RemoteGitImpl.java:146)
at sun.reflect.GeneratedMethodAccessor1084.invoke(Unknown Source)
at sun.reflect.DelegatingMethodAccessorImpl.invoke(DelegatingMethodAccessorImpl.java:43)
at java.lang.reflect.Method.invoke(Method.java:498)
at org.jenkinsci.plugins.gitclient.RemoteGitImpl$CommandInvocationHandler.invoke(RemoteGitImpl.java:132)
at com.sun.proxy.$Proxy135.execute(Unknown Source)
at hudson.plugins.git.GitSCM.retrieveChanges(GitSCM.java:1152)
at hudson.plugins.git.GitSCM.checkout(GitSCM.java:1192)
at hudson.scm.SCM.checkout(SCM.java:504)
at hudson.model.AbstractProject.checkout(AbstractProject.java:1208)
at hudson.model.AbstractBuild$AbstractBuildExecution.defaultCheckout(AbstractBuild.java:574)
at jenkins.scm.SCMCheckoutStrategy.checkout(SCMCheckoutStrategy.java:86)
at hudson.model.AbstractBuild$AbstractBuildExecution.run(AbstractBuild.java:499)
at hudson.model.Run.execute(Run.java:1810)
at hudson.maven.MavenModuleSetBuild.run(MavenModuleSetBuild.java:543)
at hudson.model.ResourceController.execute(ResourceController.java:97)
at hudson.model.Executor.run(Executor.java:429)
Caused by: hudson.plugins.git.GitException: Error performing git command
at org.jenkinsci.plugins.gitclient.CliGitAPIImpl.launchCommandIn(CliGitAPIImpl.java:2051)
at org.jenkinsci.plugins.gitclient.CliGitAPIImpl.launchCommandIn(CliGitAPIImpl.java:2010)
at org.jenkinsci.plugins.gitclient.CliGitAPIImpl.launchCommandIn(CliGitAPIImpl.java:2006)
at org.jenkinsci.plugins.gitclient.CliGitAPIImpl.launchCommand(CliGitAPIImpl.java:1638)
at org.jenkinsci.plugins.gitclient.CliGitAPIImpl$5.execute(CliGitAPIImpl.java:811)
... 11 more
Caused by: java.lang.OutOfMemoryError: unable to create new native thread
at java.lang.Thread.start0(Native Method)
at java.lang.Thread.start(Thread.java:717)
at hudson.Proc$LocalProc.<init>(Proc.java:281)
at hudson.Proc$LocalProc.<init>(Proc.java:218)
at hudson.Launcher$LocalLauncher.launch(Launcher.java:936)
at hudson.Launcher$ProcStarter.start(Launcher.java:455)
at org.jenkinsci.plugins.gitclient.CliGitAPIImpl.launchCommandIn(CliGitAPIImpl.java:2038)
... 15 more
ERROR: Error cloning remote repo 'origin'
Build failed in Jenkins: karaf-4.2.x #398
Posted by Apache Jenkins Server <je...@builds.apache.org>.
See <https://builds.apache.org/job/karaf-4.2.x/398/display/redirect>
------------------------------------------
Started by timer
[EnvInject] - Loading node environment variables.
Building remotely on H40 (ubuntu xenial) in workspace <https://builds.apache.org/job/karaf-4.2.x/ws/>
No credentials specified
> git rev-parse --is-inside-work-tree # timeout=10
Fetching changes from the remote Git repository
> git config remote.origin.url https://gitbox.apache.org/repos/asf/karaf.git # timeout=10
Fetching upstream changes from https://gitbox.apache.org/repos/asf/karaf.git
> git --version # timeout=10
> git fetch --tags --progress https://gitbox.apache.org/repos/asf/karaf.git +refs/heads/*:refs/remotes/origin/*
> git rev-parse refs/remotes/origin/karaf-4.2.x^{commit} # timeout=10
> git rev-parse refs/remotes/origin/origin/karaf-4.2.x^{commit} # timeout=10
Checking out Revision 3e7f42ed9309b30bf55383388374c1030dbf2e74 (refs/remotes/origin/karaf-4.2.x)
> git config core.sparsecheckout # timeout=10
> git checkout -f 3e7f42ed9309b30bf55383388374c1030dbf2e74
Commit message: "[maven-release-plugin] prepare for next development iteration"
> git rev-list --no-walk 3e7f42ed9309b30bf55383388374c1030dbf2e74 # timeout=10
Parsing POMs
Established TCP socket on 40571
maven35-agent.jar already up to date
maven35-interceptor.jar already up to date
maven3-interceptor-commons.jar already up to date
[karaf-4.2.x] $ /home/jenkins/tools/java/latest1.8/bin/java -Xmx4g -Xms4g -cp /home/jenkins/jenkins-slave/maven35-agent.jar:/home/jenkins/tools/maven/apache-maven-3.6.0/boot/plexus-classworlds-2.5.2.jar:/home/jenkins/tools/maven/apache-maven-3.6.0/conf/logging jenkins.maven3.agent.Maven35Main /home/jenkins/tools/maven/apache-maven-3.6.0 /home/jenkins/jenkins-slave/remoting.jar /home/jenkins/jenkins-slave/maven35-interceptor.jar /home/jenkins/jenkins-slave/maven3-interceptor-commons.jar 40571
#
# There is insufficient memory for the Java Runtime Environment to continue.
# Cannot create GC thread. Out of system resources.
# An error report file with more information is saved as:
# <https://builds.apache.org/job/karaf-4.2.x/ws/hs_err_pid48880.log>
ERROR: Failed to launch Maven. Exit code = 1