You are viewing a plain text version of this content. The canonical link for it is here.
Posted to dev@lucene.apache.org by Policeman Jenkins Server <je...@thetaphi.de> on 2016/04/26 05:27:10 UTC
[JENKINS] Lucene-Solr-5.5-Linux (32bit/jdk1.8.0_72) - Build # 231 -
Still Failing!
Build: http://jenkins.thetaphi.de/job/Lucene-Solr-5.5-Linux/231/
Java: 32bit/jdk1.8.0_72 -client -XX:+UseG1GC
1 tests failed.
FAILED: org.apache.solr.update.DirectUpdateHandlerTest.testExpungeDeletes
Error Message:
expected:<5> but was:<4>
Stack Trace:
java.lang.AssertionError: expected:<5> but was:<4>
at __randomizedtesting.SeedInfo.seed([1D1CCC4D13A9E042:316588C8661028E7]:0)
at org.junit.Assert.fail(Assert.java:93)
at org.junit.Assert.failNotEquals(Assert.java:647)
at org.junit.Assert.assertEquals(Assert.java:128)
at org.junit.Assert.assertEquals(Assert.java:472)
at org.junit.Assert.assertEquals(Assert.java:456)
at org.apache.solr.update.DirectUpdateHandlerTest.testExpungeDeletes(DirectUpdateHandlerTest.java:299)
at sun.reflect.NativeMethodAccessorImpl.invoke0(Native Method)
at sun.reflect.NativeMethodAccessorImpl.invoke(NativeMethodAccessorImpl.java:62)
at sun.reflect.DelegatingMethodAccessorImpl.invoke(DelegatingMethodAccessorImpl.java:43)
at java.lang.reflect.Method.invoke(Method.java:498)
at com.carrotsearch.randomizedtesting.RandomizedRunner.invoke(RandomizedRunner.java:1764)
at com.carrotsearch.randomizedtesting.RandomizedRunner$8.evaluate(RandomizedRunner.java:871)
at com.carrotsearch.randomizedtesting.RandomizedRunner$9.evaluate(RandomizedRunner.java:907)
at com.carrotsearch.randomizedtesting.RandomizedRunner$10.evaluate(RandomizedRunner.java:921)
at com.carrotsearch.randomizedtesting.rules.SystemPropertiesRestoreRule$1.evaluate(SystemPropertiesRestoreRule.java:57)
at org.apache.lucene.util.TestRuleSetupTeardownChained$1.evaluate(TestRuleSetupTeardownChained.java:49)
at org.apache.lucene.util.AbstractBeforeAfterRule$1.evaluate(AbstractBeforeAfterRule.java:45)
at org.apache.lucene.util.TestRuleThreadAndTestName$1.evaluate(TestRuleThreadAndTestName.java:48)
at org.apache.lucene.util.TestRuleIgnoreAfterMaxFailures$1.evaluate(TestRuleIgnoreAfterMaxFailures.java:64)
at org.apache.lucene.util.TestRuleMarkFailure$1.evaluate(TestRuleMarkFailure.java:47)
at com.carrotsearch.randomizedtesting.rules.StatementAdapter.evaluate(StatementAdapter.java:36)
at com.carrotsearch.randomizedtesting.ThreadLeakControl$StatementRunner.run(ThreadLeakControl.java:367)
at com.carrotsearch.randomizedtesting.ThreadLeakControl.forkTimeoutingTask(ThreadLeakControl.java:809)
at com.carrotsearch.randomizedtesting.ThreadLeakControl$3.evaluate(ThreadLeakControl.java:460)
at com.carrotsearch.randomizedtesting.RandomizedRunner.runSingleTest(RandomizedRunner.java:880)
at com.carrotsearch.randomizedtesting.RandomizedRunner$5.evaluate(RandomizedRunner.java:781)
at com.carrotsearch.randomizedtesting.RandomizedRunner$6.evaluate(RandomizedRunner.java:816)
at com.carrotsearch.randomizedtesting.RandomizedRunner$7.evaluate(RandomizedRunner.java:827)
at com.carrotsearch.randomizedtesting.rules.StatementAdapter.evaluate(StatementAdapter.java:36)
at com.carrotsearch.randomizedtesting.rules.SystemPropertiesRestoreRule$1.evaluate(SystemPropertiesRestoreRule.java:57)
at org.apache.lucene.util.AbstractBeforeAfterRule$1.evaluate(AbstractBeforeAfterRule.java:45)
at com.carrotsearch.randomizedtesting.rules.StatementAdapter.evaluate(StatementAdapter.java:36)
at org.apache.lucene.util.TestRuleStoreClassName$1.evaluate(TestRuleStoreClassName.java:41)
at com.carrotsearch.randomizedtesting.rules.NoShadowingOrOverridesOnMethodsRule$1.evaluate(NoShadowingOrOverridesOnMethodsRule.java:40)
at com.carrotsearch.randomizedtesting.rules.NoShadowingOrOverridesOnMethodsRule$1.evaluate(NoShadowingOrOverridesOnMethodsRule.java:40)
at com.carrotsearch.randomizedtesting.rules.StatementAdapter.evaluate(StatementAdapter.java:36)
at com.carrotsearch.randomizedtesting.rules.StatementAdapter.evaluate(StatementAdapter.java:36)
at com.carrotsearch.randomizedtesting.rules.StatementAdapter.evaluate(StatementAdapter.java:36)
at org.apache.lucene.util.TestRuleAssertionsRequired$1.evaluate(TestRuleAssertionsRequired.java:53)
at org.apache.lucene.util.TestRuleMarkFailure$1.evaluate(TestRuleMarkFailure.java:47)
at org.apache.lucene.util.TestRuleIgnoreAfterMaxFailures$1.evaluate(TestRuleIgnoreAfterMaxFailures.java:64)
at org.apache.lucene.util.TestRuleIgnoreTestSuites$1.evaluate(TestRuleIgnoreTestSuites.java:54)
at com.carrotsearch.randomizedtesting.rules.StatementAdapter.evaluate(StatementAdapter.java:36)
at com.carrotsearch.randomizedtesting.ThreadLeakControl$StatementRunner.run(ThreadLeakControl.java:367)
at java.lang.Thread.run(Thread.java:745)
Build Log:
[...truncated 11653 lines...]
[junit4] Suite: org.apache.solr.update.DirectUpdateHandlerTest
[junit4] 2> Creating dataDir: /home/jenkins/workspace/Lucene-Solr-5.5-Linux@7/solr/build/solr-core/test/J1/temp/solr.update.DirectUpdateHandlerTest_1D1CCC4D13A9E042-001/init-core-data-001
[junit4] 2> 1353943 INFO (SUITE-DirectUpdateHandlerTest-seed#[1D1CCC4D13A9E042]-worker) [ ] o.a.s.SolrTestCaseJ4 Randomized ssl (false) and clientAuth (true)
[junit4] 2> 1353943 INFO (SUITE-DirectUpdateHandlerTest-seed#[1D1CCC4D13A9E042]-worker) [ ] o.a.s.SolrTestCaseJ4 ####initCore
[junit4] 2> 1353943 INFO (SUITE-DirectUpdateHandlerTest-seed#[1D1CCC4D13A9E042]-worker) [ ] o.a.s.c.SolrResourceLoader new SolrResourceLoader for directory: '/home/jenkins/workspace/Lucene-Solr-5.5-Linux@7/solr/core/src/test-files/solr/collection1'
[junit4] 2> 1353943 INFO (SUITE-DirectUpdateHandlerTest-seed#[1D1CCC4D13A9E042]-worker) [ ] o.a.s.c.SolrResourceLoader JNDI not configured for solr (NoInitialContextEx)
[junit4] 2> 1353944 INFO (SUITE-DirectUpdateHandlerTest-seed#[1D1CCC4D13A9E042]-worker) [ ] o.a.s.c.SolrResourceLoader using system property solr.solr.home: /home/jenkins/workspace/Lucene-Solr-5.5-Linux@7/solr/core/src/test-files/solr
[junit4] 2> 1353944 INFO (SUITE-DirectUpdateHandlerTest-seed#[1D1CCC4D13A9E042]-worker) [ ] o.a.s.c.SolrResourceLoader Adding 'file:/home/jenkins/workspace/Lucene-Solr-5.5-Linux@7/solr/core/src/test-files/solr/collection1/lib/classes/' to classloader
[junit4] 2> 1353944 INFO (SUITE-DirectUpdateHandlerTest-seed#[1D1CCC4D13A9E042]-worker) [ ] o.a.s.c.SolrResourceLoader Adding 'file:/home/jenkins/workspace/Lucene-Solr-5.5-Linux@7/solr/core/src/test-files/solr/collection1/lib/README' to classloader
[junit4] 2> 1353992 INFO (SUITE-DirectUpdateHandlerTest-seed#[1D1CCC4D13A9E042]-worker) [ ] o.a.s.c.SolrConfig current version of requestparams : -1
[junit4] 2> 1354027 INFO (SUITE-DirectUpdateHandlerTest-seed#[1D1CCC4D13A9E042]-worker) [ ] o.a.s.c.SolrConfig Using Lucene MatchVersion: 5.5.0
[junit4] 2> 1354049 INFO (SUITE-DirectUpdateHandlerTest-seed#[1D1CCC4D13A9E042]-worker) [ ] o.a.s.c.SolrConfig Loaded SolrConfig: solrconfig.xml
[junit4] 2> 1354060 INFO (SUITE-DirectUpdateHandlerTest-seed#[1D1CCC4D13A9E042]-worker) [ ] o.a.s.s.IndexSchema [null] Schema name=test
[junit4] 2> 1354136 INFO (SUITE-DirectUpdateHandlerTest-seed#[1D1CCC4D13A9E042]-worker) [ ] o.a.s.s.IndexSchema default search field in schema is text
[junit4] 2> 1354137 INFO (SUITE-DirectUpdateHandlerTest-seed#[1D1CCC4D13A9E042]-worker) [ ] o.a.s.s.IndexSchema unique key field: id
[junit4] 2> 1354138 WARN (SUITE-DirectUpdateHandlerTest-seed#[1D1CCC4D13A9E042]-worker) [ ] o.a.s.s.IndexSchema Field text is not multivalued and destination for multiple copyFields (2)
[junit4] 2> 1354146 INFO (SUITE-DirectUpdateHandlerTest-seed#[1D1CCC4D13A9E042]-worker) [ ] o.a.s.s.FileExchangeRateProvider Reloading exchange rates from file currency.xml
[junit4] 2> 1354148 INFO (SUITE-DirectUpdateHandlerTest-seed#[1D1CCC4D13A9E042]-worker) [ ] o.a.s.s.FileExchangeRateProvider Reloading exchange rates from file currency.xml
[junit4] 2> 1354150 INFO (SUITE-DirectUpdateHandlerTest-seed#[1D1CCC4D13A9E042]-worker) [ ] o.a.s.c.SolrResourceLoader JNDI not configured for solr (NoInitialContextEx)
[junit4] 2> 1354150 INFO (SUITE-DirectUpdateHandlerTest-seed#[1D1CCC4D13A9E042]-worker) [ ] o.a.s.c.SolrResourceLoader using system property solr.solr.home: /home/jenkins/workspace/Lucene-Solr-5.5-Linux@7/solr/core/src/test-files/solr
[junit4] 2> 1354150 INFO (SUITE-DirectUpdateHandlerTest-seed#[1D1CCC4D13A9E042]-worker) [ ] o.a.s.c.SolrResourceLoader new SolrResourceLoader for directory: '/home/jenkins/workspace/Lucene-Solr-5.5-Linux@7/solr/core/src/test-files/solr'
[junit4] 2> 1354150 INFO (SUITE-DirectUpdateHandlerTest-seed#[1D1CCC4D13A9E042]-worker) [ ] o.a.s.c.SolrResourceLoader JNDI not configured for solr (NoInitialContextEx)
[junit4] 2> 1354150 INFO (SUITE-DirectUpdateHandlerTest-seed#[1D1CCC4D13A9E042]-worker) [ ] o.a.s.c.SolrResourceLoader using system property solr.solr.home: /home/jenkins/workspace/Lucene-Solr-5.5-Linux@7/solr/core/src/test-files/solr
[junit4] 2> 1354150 INFO (SUITE-DirectUpdateHandlerTest-seed#[1D1CCC4D13A9E042]-worker) [ ] o.a.s.c.CoreContainer New CoreContainer 20170048
[junit4] 2> 1354150 INFO (SUITE-DirectUpdateHandlerTest-seed#[1D1CCC4D13A9E042]-worker) [ ] o.a.s.c.CoreContainer Loading cores into CoreContainer [instanceDir=/home/jenkins/workspace/Lucene-Solr-5.5-Linux@7/solr/core/src/test-files/solr]
[junit4] 2> 1354150 WARN (SUITE-DirectUpdateHandlerTest-seed#[1D1CCC4D13A9E042]-worker) [ ] o.a.s.c.CoreContainer Couldn't add files from /home/jenkins/workspace/Lucene-Solr-5.5-Linux@7/solr/core/src/test-files/solr/lib to classpath: /home/jenkins/workspace/Lucene-Solr-5.5-Linux@7/solr/core/src/test-files/solr/lib
[junit4] 2> 1354150 INFO (SUITE-DirectUpdateHandlerTest-seed#[1D1CCC4D13A9E042]-worker) [ ] o.a.s.h.c.HttpShardHandlerFactory created with socketTimeout : 600000,connTimeout : 60000,maxConnectionsPerHost : 20,maxConnections : 10000,corePoolSize : 0,maximumPoolSize : 2147483647,maxThreadIdleTime : 5,sizeOfQueue : -1,fairnessPolicy : false,useRetries : false,
[junit4] 2> 1354152 INFO (SUITE-DirectUpdateHandlerTest-seed#[1D1CCC4D13A9E042]-worker) [ ] o.a.s.u.UpdateShardHandler Creating UpdateShardHandler HTTP client with params: socketTimeout=30000&connTimeout=30000&retry=true
[junit4] 2> 1354152 INFO (SUITE-DirectUpdateHandlerTest-seed#[1D1CCC4D13A9E042]-worker) [ ] o.a.s.l.LogWatcher SLF4J impl is org.slf4j.impl.Log4jLoggerFactory
[junit4] 2> 1354152 INFO (SUITE-DirectUpdateHandlerTest-seed#[1D1CCC4D13A9E042]-worker) [ ] o.a.s.l.LogWatcher Registering Log Listener [Log4j (org.slf4j.impl.Log4jLoggerFactory)]
[junit4] 2> 1354152 INFO (SUITE-DirectUpdateHandlerTest-seed#[1D1CCC4D13A9E042]-worker) [ ] o.a.s.c.CoreContainer Security conf doesn't exist. Skipping setup for authorization module.
[junit4] 2> 1354152 INFO (SUITE-DirectUpdateHandlerTest-seed#[1D1CCC4D13A9E042]-worker) [ ] o.a.s.c.CoreContainer No authentication plugin used.
[junit4] 2> 1354153 INFO (SUITE-DirectUpdateHandlerTest-seed#[1D1CCC4D13A9E042]-worker) [ ] o.a.s.c.CoreDescriptor Created CoreDescriptor: {name=collection1, config=solrconfig.xml, transient=false, schema=schema12.xml, loadOnStartup=true, configSetProperties=configsetprops.json, collection=collection1, dataDir=/home/jenkins/workspace/Lucene-Solr-5.5-Linux@7/solr/build/solr-core/test/J1/temp/solr.update.DirectUpdateHandlerTest_1D1CCC4D13A9E042-001/init-core-data-001, shard=shard1}
[junit4] 2> 1354153 INFO (coreLoadExecutor-4812-thread-1) [ ] o.a.s.c.SolrResourceLoader new SolrResourceLoader for directory: '/home/jenkins/workspace/Lucene-Solr-5.5-Linux@7/solr/core/src/test-files/solr/collection1'
[junit4] 2> 1354153 INFO (coreLoadExecutor-4812-thread-1) [ ] o.a.s.c.SolrResourceLoader JNDI not configured for solr (NoInitialContextEx)
[junit4] 2> 1354154 INFO (coreLoadExecutor-4812-thread-1) [ ] o.a.s.c.SolrResourceLoader using system property solr.solr.home: /home/jenkins/workspace/Lucene-Solr-5.5-Linux@7/solr/core/src/test-files/solr
[junit4] 2> 1354154 INFO (coreLoadExecutor-4812-thread-1) [ ] o.a.s.c.SolrResourceLoader Adding 'file:/home/jenkins/workspace/Lucene-Solr-5.5-Linux@7/solr/core/src/test-files/solr/collection1/lib/classes/' to classloader
[junit4] 2> 1354154 INFO (coreLoadExecutor-4812-thread-1) [ ] o.a.s.c.SolrResourceLoader Adding 'file:/home/jenkins/workspace/Lucene-Solr-5.5-Linux@7/solr/core/src/test-files/solr/collection1/lib/README' to classloader
[junit4] 2> 1354178 INFO (coreLoadExecutor-4812-thread-1) [ ] o.a.s.c.SolrConfig current version of requestparams : -1
[junit4] 2> 1354187 INFO (coreLoadExecutor-4812-thread-1) [ ] o.a.s.c.SolrConfig Using Lucene MatchVersion: 5.5.0
[junit4] 2> 1354206 INFO (coreLoadExecutor-4812-thread-1) [ ] o.a.s.c.SolrConfig Loaded SolrConfig: solrconfig.xml
[junit4] 2> 1354211 INFO (coreLoadExecutor-4812-thread-1) [ ] o.a.s.s.IndexSchema [collection1] Schema name=test
[junit4] 2> 1354318 INFO (coreLoadExecutor-4812-thread-1) [ ] o.a.s.s.IndexSchema default search field in schema is text
[junit4] 2> 1354319 INFO (coreLoadExecutor-4812-thread-1) [ ] o.a.s.s.IndexSchema unique key field: id
[junit4] 2> 1354320 WARN (coreLoadExecutor-4812-thread-1) [ ] o.a.s.s.IndexSchema Field text is not multivalued and destination for multiple copyFields (2)
[junit4] 2> 1354327 INFO (coreLoadExecutor-4812-thread-1) [ ] o.a.s.s.FileExchangeRateProvider Reloading exchange rates from file currency.xml
[junit4] 2> 1354329 INFO (coreLoadExecutor-4812-thread-1) [ ] o.a.s.s.FileExchangeRateProvider Reloading exchange rates from file currency.xml
[junit4] 2> 1354331 INFO (coreLoadExecutor-4812-thread-1) [ ] o.a.s.c.ConfigSetProperties Did not find ConfigSet properties, assuming default properties: Can't find resource 'configsetprops.json' in classpath or '/home/jenkins/workspace/Lucene-Solr-5.5-Linux@7/solr/core/src/test-files/solr/collection1'
[junit4] 2> 1354331 INFO (coreLoadExecutor-4812-thread-1) [ ] o.a.s.c.CoreContainer Creating SolrCore 'collection1' using configuration from instancedir /home/jenkins/workspace/Lucene-Solr-5.5-Linux@7/solr/core/src/test-files/solr/collection1
[junit4] 2> 1354332 INFO (coreLoadExecutor-4812-thread-1) [ x:collection1] o.a.s.c.SolrCore org.apache.solr.core.MockFSDirectoryFactory
[junit4] 2> 1354333 INFO (coreLoadExecutor-4812-thread-1) [ x:collection1] o.a.s.c.SolrCore [[collection1] ] Opening new SolrCore at [/home/jenkins/workspace/Lucene-Solr-5.5-Linux@7/solr/core/src/test-files/solr/collection1], dataDir=[/home/jenkins/workspace/Lucene-Solr-5.5-Linux@7/solr/build/solr-core/test/J1/temp/solr.update.DirectUpdateHandlerTest_1D1CCC4D13A9E042-001/init-core-data-001/]
[junit4] 2> 1354333 INFO (coreLoadExecutor-4812-thread-1) [ x:collection1] o.a.s.c.JmxMonitoredMap JMX monitoring is enabled. Adding Solr mbeans to JMX Server: com.sun.jmx.mbeanserver.JmxMBeanServer@1ae9d12
[junit4] 2> 1354334 INFO (coreLoadExecutor-4812-thread-1) [ x:collection1] o.a.s.c.CachingDirectoryFactory return new directory for /home/jenkins/workspace/Lucene-Solr-5.5-Linux@7/solr/build/solr-core/test/J1/temp/solr.update.DirectUpdateHandlerTest_1D1CCC4D13A9E042-001/init-core-data-001
[junit4] 2> 1354334 INFO (coreLoadExecutor-4812-thread-1) [ x:collection1] o.a.s.c.SolrCore New index directory detected: old=null new=/home/jenkins/workspace/Lucene-Solr-5.5-Linux@7/solr/build/solr-core/test/J1/temp/solr.update.DirectUpdateHandlerTest_1D1CCC4D13A9E042-001/init-core-data-001/index/
[junit4] 2> 1354334 WARN (coreLoadExecutor-4812-thread-1) [ x:collection1] o.a.s.c.SolrCore [collection1] Solr index directory '/home/jenkins/workspace/Lucene-Solr-5.5-Linux@7/solr/build/solr-core/test/J1/temp/solr.update.DirectUpdateHandlerTest_1D1CCC4D13A9E042-001/init-core-data-001/index' doesn't exist. Creating new index...
[junit4] 2> 1354335 INFO (coreLoadExecutor-4812-thread-1) [ x:collection1] o.a.s.c.CachingDirectoryFactory return new directory for /home/jenkins/workspace/Lucene-Solr-5.5-Linux@7/solr/build/solr-core/test/J1/temp/solr.update.DirectUpdateHandlerTest_1D1CCC4D13A9E042-001/init-core-data-001/index
[junit4] 2> 1354335 INFO (coreLoadExecutor-4812-thread-1) [ x:collection1] o.a.s.u.RandomMergePolicy RandomMergePolicy wrapping class org.apache.lucene.index.TieredMergePolicy: [TieredMergePolicy: maxMergeAtOnce=18, maxMergeAtOnceExplicit=46, maxMergedSegmentMB=95.9892578125, floorSegmentMB=2.072265625, forceMergeDeletesPctAllowed=27.626539312090625, segmentsPerTier=14.0, maxCFSSegmentSizeMB=8.796093022207999E12, noCFSRatio=1.0
[junit4] 2> 1354373 INFO (coreLoadExecutor-4812-thread-1) [ x:collection1] o.a.s.c.SolrDeletionPolicy SolrDeletionPolicy.onCommit: commits: num=1
[junit4] 2> commit{dir=MockDirectoryWrapper(SimpleFSDirectory@/home/jenkins/workspace/Lucene-Solr-5.5-Linux@7/solr/build/solr-core/test/J1/temp/solr.update.DirectUpdateHandlerTest_1D1CCC4D13A9E042-001/init-core-data-001/index lockFactory=org.apache.lucene.store.SingleInstanceLockFactory@c6587b),segFN=segments_1,generation=1}
[junit4] 2> 1354373 INFO (coreLoadExecutor-4812-thread-1) [ x:collection1] o.a.s.c.SolrDeletionPolicy newest commit generation = 1
[junit4] 2> 1354374 INFO (OldIndexDirectoryCleanupThreadForCore-collection1) [ x:collection1] o.a.s.c.SolrCore Looking for old index directories to cleanup for core collection1 in /home/jenkins/workspace/Lucene-Solr-5.5-Linux@7/solr/build/solr-core/test/J1/temp/solr.update.DirectUpdateHandlerTest_1D1CCC4D13A9E042-001/init-core-data-001/
[junit4] 2> 1354379 INFO (coreLoadExecutor-4812-thread-1) [ x:collection1] o.a.s.u.p.UpdateRequestProcessorChain creating updateRequestProcessorChain "dedupe"
[junit4] 2> 1354379 INFO (coreLoadExecutor-4812-thread-1) [ x:collection1] o.a.s.u.p.UpdateRequestProcessorChain inserting DistributedUpdateProcessorFactory into updateRequestProcessorChain "dedupe"
[junit4] 2> 1354379 INFO (coreLoadExecutor-4812-thread-1) [ x:collection1] o.a.s.u.p.UpdateRequestProcessorChain creating updateRequestProcessorChain "dedupe-allfields"
[junit4] 2> 1354379 INFO (coreLoadExecutor-4812-thread-1) [ x:collection1] o.a.s.u.p.UpdateRequestProcessorChain inserting DistributedUpdateProcessorFactory into updateRequestProcessorChain "dedupe-allfields"
[junit4] 2> 1354379 INFO (coreLoadExecutor-4812-thread-1) [ x:collection1] o.a.s.u.p.UpdateRequestProcessorChain creating updateRequestProcessorChain "stored_sig"
[junit4] 2> 1354379 INFO (coreLoadExecutor-4812-thread-1) [ x:collection1] o.a.s.u.p.UpdateRequestProcessorChain inserting DistributedUpdateProcessorFactory into updateRequestProcessorChain "stored_sig"
[junit4] 2> 1354379 INFO (coreLoadExecutor-4812-thread-1) [ x:collection1] o.a.s.u.p.UpdateRequestProcessorChain creating updateRequestProcessorChain "uniq-fields"
[junit4] 2> 1354379 INFO (coreLoadExecutor-4812-thread-1) [ x:collection1] o.a.s.u.p.UpdateRequestProcessorChain inserting DistributedUpdateProcessorFactory into updateRequestProcessorChain "uniq-fields"
[junit4] 2> 1354379 INFO (coreLoadExecutor-4812-thread-1) [ x:collection1] o.a.s.u.p.UpdateRequestProcessorChain creating updateRequestProcessorChain "distrib-dup-test-chain-explicit"
[junit4] 2> 1354380 INFO (coreLoadExecutor-4812-thread-1) [ x:collection1] o.a.s.u.p.UpdateRequestProcessorChain creating updateRequestProcessorChain "distrib-dup-test-chain-implicit"
[junit4] 2> 1354380 INFO (coreLoadExecutor-4812-thread-1) [ x:collection1] o.a.s.u.p.UpdateRequestProcessorChain inserting DistributedUpdateProcessorFactory into updateRequestProcessorChain "distrib-dup-test-chain-implicit"
[junit4] 2> 1354380 INFO (coreLoadExecutor-4812-thread-1) [ x:collection1] o.a.s.c.SolrCore no updateRequestProcessorChain defined as default, creating implicit default
[junit4] 2> 1354381 INFO (coreLoadExecutor-4812-thread-1) [ x:collection1] o.a.s.h.l.XMLLoader xsltCacheLifetimeSeconds=60
[junit4] 2> 1354382 INFO (coreLoadExecutor-4812-thread-1) [ x:collection1] o.a.s.h.l.XMLLoader xsltCacheLifetimeSeconds=60
[junit4] 2> 1354384 INFO (coreLoadExecutor-4812-thread-1) [ x:collection1] o.a.s.h.l.XMLLoader xsltCacheLifetimeSeconds=60
[junit4] 2> 1354385 INFO (coreLoadExecutor-4812-thread-1) [ x:collection1] o.a.s.h.l.XMLLoader xsltCacheLifetimeSeconds=60
[junit4] 2> 1354390 INFO (coreLoadExecutor-4812-thread-1) [ x:collection1] o.a.s.c.PluginBag requestHandler : 'lazy' created with startup=lazy
[junit4] 2> 1354393 INFO (coreLoadExecutor-4812-thread-1) [ x:collection1] o.a.s.c.RequestHandlers Registered paths: /admin/mbeans,standard,spellCheckCompRH,lazy,/update/json/docs,/admin/luke,spellCheckWithWordbreak_Direct,tvrh,/get,/admin/properties,/update/json,mltrh,/admin/threads,/search-facet-def,/update/csv,/search-facet-invariants,/admin/segments,spellCheckCompRH1,/mlt,/admin/system,/replication,dismax,defaults,/config,/schema,/admin/plugins,/admin/logging,spellCheckWithWordbreak,mock,/admin/ping,/update,/admin/file,/terms,spellCheckCompRH_Direct,/debug/dump
[junit4] 2> 1354394 WARN (coreLoadExecutor-4812-thread-1) [ x:collection1] o.a.s.c.SolrCore solrconfig.xml uses deprecated <admin/gettableFiles>, Please update your config to use the ShowFileRequestHandler.
[junit4] 2> 1354394 INFO (coreLoadExecutor-4812-thread-1) [ x:collection1] o.a.s.c.SolrCore Using default statsCache cache: org.apache.solr.search.stats.LocalStatsCache
[junit4] 2> 1354395 INFO (coreLoadExecutor-4812-thread-1) [ x:collection1] o.a.s.u.CommitTracker Hard AutoCommit: disabled
[junit4] 2> 1354395 INFO (coreLoadExecutor-4812-thread-1) [ x:collection1] o.a.s.u.CommitTracker Soft AutoCommit: disabled
[junit4] 2> 1354395 INFO (coreLoadExecutor-4812-thread-1) [ x:collection1] o.a.s.u.RandomMergePolicy RandomMergePolicy wrapping class org.apache.lucene.index.TieredMergePolicy: [TieredMergePolicy: maxMergeAtOnce=24, maxMergeAtOnceExplicit=38, maxMergedSegmentMB=9.7578125, floorSegmentMB=1.984375, forceMergeDeletesPctAllowed=17.26163967173938, segmentsPerTier=38.0, maxCFSSegmentSizeMB=8.796093022207999E12, noCFSRatio=0.5693526248681824
[junit4] 2> 1354396 INFO (coreLoadExecutor-4812-thread-1) [ x:collection1] o.a.s.c.SolrDeletionPolicy SolrDeletionPolicy.onInit: commits: num=1
[junit4] 2> commit{dir=MockDirectoryWrapper(SimpleFSDirectory@/home/jenkins/workspace/Lucene-Solr-5.5-Linux@7/solr/build/solr-core/test/J1/temp/solr.update.DirectUpdateHandlerTest_1D1CCC4D13A9E042-001/init-core-data-001/index lockFactory=org.apache.lucene.store.SingleInstanceLockFactory@c6587b),segFN=segments_1,generation=1}
[junit4] 2> 1354396 INFO (coreLoadExecutor-4812-thread-1) [ x:collection1] o.a.s.c.SolrDeletionPolicy newest commit generation = 1
[junit4] 2> 1354396 INFO (coreLoadExecutor-4812-thread-1) [ x:collection1] o.a.s.s.SolrIndexSearcher Opening Searcher@bc2437[collection1] main
[junit4] 2> 1354397 INFO (coreLoadExecutor-4812-thread-1) [ x:collection1] o.a.s.r.RestManager Initializing RestManager with initArgs: {storageIO=org.apache.solr.rest.ManagedResourceStorage$InMemoryStorageIO}
[junit4] 2> 1354397 INFO (coreLoadExecutor-4812-thread-1) [ x:collection1] o.a.s.r.ManagedResourceStorage Reading _rest_managed.json using InMemoryStorage
[junit4] 2> 1354397 INFO (coreLoadExecutor-4812-thread-1) [ x:collection1] o.a.s.r.RestManager Initializing 0 registered ManagedResources
[junit4] 2> 1354397 INFO (coreLoadExecutor-4812-thread-1) [ x:collection1] o.a.s.h.c.SpellCheckComponent Initializing spell checkers
[junit4] 2> 1354420 INFO (coreLoadExecutor-4812-thread-1) [ x:collection1] o.a.s.s.DirectSolrSpellChecker init: {name=direct,classname=DirectSolrSpellChecker,field=lowerfilt,minQueryLength=3}
[junit4] 2> 1354543 INFO (coreLoadExecutor-4812-thread-1) [ x:collection1] o.a.s.h.ReplicationHandler Commits will be reserved for 10000
[junit4] 2> 1354543 INFO (searcherExecutor-4813-thread-1-processing-x:collection1) [ x:collection1] o.a.s.h.c.SpellCheckComponent Loading spell index for spellchecker: default
[junit4] 2> 1354543 INFO (searcherExecutor-4813-thread-1-processing-x:collection1) [ x:collection1] o.a.s.h.c.SpellCheckComponent Loading spell index for spellchecker: direct
[junit4] 2> 1354543 INFO (searcherExecutor-4813-thread-1-processing-x:collection1) [ x:collection1] o.a.s.h.c.SpellCheckComponent Loading spell index for spellchecker: wordbreak
[junit4] 2> 1354543 INFO (searcherExecutor-4813-thread-1-processing-x:collection1) [ x:collection1] o.a.s.h.c.SpellCheckComponent Loading spell index for spellchecker: multipleFields
[junit4] 2> 1354544 INFO (searcherExecutor-4813-thread-1-processing-x:collection1) [ x:collection1] o.a.s.h.c.SpellCheckComponent Loading spell index for spellchecker: jarowinkler
[junit4] 2> 1354544 INFO (searcherExecutor-4813-thread-1-processing-x:collection1) [ x:collection1] o.a.s.h.c.SpellCheckComponent Loading spell index for spellchecker: external
[junit4] 2> 1354544 INFO (searcherExecutor-4813-thread-1-processing-x:collection1) [ x:collection1] o.a.s.h.c.SpellCheckComponent Loading spell index for spellchecker: freq
[junit4] 2> 1354544 INFO (searcherExecutor-4813-thread-1-processing-x:collection1) [ x:collection1] o.a.s.h.c.SpellCheckComponent Loading spell index for spellchecker: fqcn
[junit4] 2> 1354545 INFO (searcherExecutor-4813-thread-1-processing-x:collection1) [ x:collection1] o.a.s.h.c.SpellCheckComponent Loading spell index for spellchecker: perDict
[junit4] 2> 1354545 INFO (coreLoadExecutor-4812-thread-1) [ x:collection1] o.a.s.c.CoreContainer registering core: collection1
[junit4] 2> 1354546 INFO (searcherExecutor-4813-thread-1-processing-x:collection1) [ x:collection1] o.a.s.c.SolrCore [collection1] Registered new searcher Searcher@bc2437[collection1] main{ExitableDirectoryReader(UninvertingDirectoryReader())}
[junit4] 2> 1354547 INFO (SUITE-DirectUpdateHandlerTest-seed#[1D1CCC4D13A9E042]-worker) [ ] o.a.s.SolrTestCaseJ4 ####initCore end
[junit4] 2> 1354548 INFO (TEST-DirectUpdateHandlerTest.testDeleteRollback-seed#[1D1CCC4D13A9E042]) [ ] o.a.s.SolrTestCaseJ4 ###Starting testDeleteRollback
[junit4] 2> 1354549 INFO (TEST-DirectUpdateHandlerTest.testDeleteRollback-seed#[1D1CCC4D13A9E042]) [ ] o.a.s.u.DirectUpdateHandler2 [collection1] REMOVING ALL DOCUMENTS FROM INDEX
[junit4] 2> 1354549 INFO (TEST-DirectUpdateHandlerTest.testDeleteRollback-seed#[1D1CCC4D13A9E042]) [ ] o.a.s.u.p.LogUpdateProcessorFactory [collection1] webapp=null path=null params={}{deleteByQuery=*:*} 0 0
[junit4] 2> 1354551 INFO (TEST-DirectUpdateHandlerTest.testDeleteRollback-seed#[1D1CCC4D13A9E042]) [ ] o.a.s.u.DirectUpdateHandler2 start commit{,optimize=false,openSearcher=true,waitSearcher=true,expungeDeletes=false,softCommit=false,prepareCommit=false}
[junit4] 2> 1354567 INFO (TEST-DirectUpdateHandlerTest.testDeleteRollback-seed#[1D1CCC4D13A9E042]) [ ] o.a.s.c.SolrDeletionPolicy SolrDeletionPolicy.onCommit: commits: num=2
[junit4] 2> commit{dir=MockDirectoryWrapper(SimpleFSDirectory@/home/jenkins/workspace/Lucene-Solr-5.5-Linux@7/solr/build/solr-core/test/J1/temp/solr.update.DirectUpdateHandlerTest_1D1CCC4D13A9E042-001/init-core-data-001/index lockFactory=org.apache.lucene.store.SingleInstanceLockFactory@c6587b),segFN=segments_1,generation=1}
[junit4] 2> commit{dir=MockDirectoryWrapper(SimpleFSDirectory@/home/jenkins/workspace/Lucene-Solr-5.5-Linux@7/solr/build/solr-core/test/J1/temp/solr.update.DirectUpdateHandlerTest_1D1CCC4D13A9E042-001/init-core-data-001/index lockFactory=org.apache.lucene.store.SingleInstanceLockFactory@c6587b),segFN=segments_2,generation=2}
[junit4] 2> 1354567 INFO (TEST-DirectUpdateHandlerTest.testDeleteRollback-seed#[1D1CCC4D13A9E042]) [ ] o.a.s.c.SolrDeletionPolicy newest commit generation = 2
[junit4] 2> 1354568 INFO (TEST-DirectUpdateHandlerTest.testDeleteRollback-seed#[1D1CCC4D13A9E042]) [ ] o.a.s.s.SolrIndexSearcher Opening Searcher@783c61[collection1] main
[junit4] 2> 1354568 INFO (TEST-DirectUpdateHandlerTest.testDeleteRollback-seed#[1D1CCC4D13A9E042]) [ ] o.a.s.u.DirectUpdateHandler2 end_commit_flush
[junit4] 2> 1354571 INFO (searcherExecutor-4813-thread-1) [ ] o.a.s.c.SolrCore [collection1] Registered new searcher Searcher@783c61[collection1] main{ExitableDirectoryReader(UninvertingDirectoryReader())}
[junit4] 2> 1354571 INFO (TEST-DirectUpdateHandlerTest.testDeleteRollback-seed#[1D1CCC4D13A9E042]) [ ] o.a.s.u.p.LogUpdateProcessorFactory [collection1] webapp=null path=null params={}{commit=} 0 19
[junit4] 2> 1354571 INFO (TEST-DirectUpdateHandlerTest.testDeleteRollback-seed#[1D1CCC4D13A9E042]) [ ] o.a.s.SolrTestCaseJ4 ###deleteCore
[junit4] 2> 1354571 INFO (TEST-DirectUpdateHandlerTest.testDeleteRollback-seed#[1D1CCC4D13A9E042]) [ ] o.a.s.c.CoreContainer Shutting down CoreContainer instance=20170048
[junit4] 2> 1354572 INFO (coreCloseExecutor-4817-thread-1) [ x:collection1] o.a.s.c.SolrCore [collection1] CLOSING SolrCore org.apache.solr.core.SolrCore@b325f4
[junit4] 2> 1354572 INFO (coreCloseExecutor-4817-thread-1) [ x:collection1] o.a.s.u.DirectUpdateHandler2 closing DirectUpdateHandler2{commits=1,autocommits=0,soft autocommits=0,optimizes=0,rollbacks=0,expungeDeletes=0,docsPending=0,adds=0,deletesById=0,deletesByQuery=0,errors=0,cumulative_adds=0,cumulative_deletesById=0,cumulative_deletesByQuery=1,cumulative_errors=0}
[junit4] 2> 1354573 INFO (coreCloseExecutor-4817-thread-1) [ x:collection1] o.a.s.u.SolrCoreState Closing SolrCoreState
[junit4] 2> 1354573 INFO (coreCloseExecutor-4817-thread-1) [ x:collection1] o.a.s.u.DefaultSolrCoreState SolrCoreState ref count has reached 0 - closing IndexWriter
[junit4] 2> 1354573 INFO (coreCloseExecutor-4817-thread-1) [ x:collection1] o.a.s.u.DefaultSolrCoreState closing IndexWriter with IndexWriterCloser
[junit4] 2> 1354574 INFO (coreCloseExecutor-4817-thread-1) [ x:collection1] o.a.s.c.SolrCore [collection1] Closing main searcher on request.
[junit4] 2> 1354595 INFO (coreCloseExecutor-4817-thread-1) [ x:collection1] o.a.s.c.CachingDirectoryFactory Closing MockFSDirectoryFactory - 2 directories currently being tracked
[junit4] 2> 1354596 INFO (coreCloseExecutor-4817-thread-1) [ x:collection1] o.a.s.c.CachingDirectoryFactory looking to close /home/jenkins/workspace/Lucene-Solr-5.5-Linux@7/solr/build/solr-core/test/J1/temp/solr.update.DirectUpdateHandlerTest_1D1CCC4D13A9E042-001/init-core-data-001 [CachedDir<<refCount=0;path=/home/jenkins/workspace/Lucene-Solr-5.5-Linux@7/solr/build/solr-core/test/J1/temp/solr.update.DirectUpdateHandlerTest_1D1CCC4D13A9E042-001/init-core-data-001;done=false>>]
[junit4] 2> 1354596 INFO (coreCloseExecutor-4817-thread-1) [ x:collection1] o.a.s.c.CachingDirectoryFactory Closing directory: /home/jenkins/workspace/Lucene-Solr-5.5-Linux@7/solr/build/solr-core/test/J1/temp/solr.update.DirectUpdateHandlerTest_1D1CCC4D13A9E042-001/init-core-data-001
[junit4] 2> 1354596 INFO (coreCloseExecutor-4817-thread-1) [ x:collection1] o.a.s.c.CachingDirectoryFactory looking to close /home/jenkins/workspace/Lucene-Solr-5.5-Linux@7/solr/build/solr-core/test/J1/temp/solr.update.DirectUpdateHandlerTest_1D1CCC4D13A9E042-001/init-core-data-001/index [CachedDir<<refCount=0;path=/home/jenkins/workspace/Lucene-Solr-5.5-Linux@7/solr/build/solr-core/test/J1/temp/solr.update.DirectUpdateHandlerTest_1D1CCC4D13A9E042-001/init-core-data-001/index;done=false>>]
[junit4] 2> 1354596 INFO (coreCloseExecutor-4817-thread-1) [ x:collection1] o.a.s.c.CachingDirectoryFactory Closing directory: /home/jenkins/workspace/Lucene-Solr-5.5-Linux@7/solr/build/solr-core/test/J1/temp/solr.update.DirectUpdateHandlerTest_1D1CCC4D13A9E042-001/init-core-data-001/index
[junit4] 2> 1354597 INFO (TEST-DirectUpdateHandlerTest.testDeleteRollback-seed#[1D1CCC4D13A9E042]) [ ] o.a.s.SolrTestCaseJ4 ####initCore
[junit4] 2> 1354597 INFO (TEST-DirectUpdateHandlerTest.testDeleteRollback-seed#[1D1CCC4D13A9E042]) [ ] o.a.s.c.SolrResourceLoader new SolrResourceLoader for directory: '/home/jenkins/workspace/Lucene-Solr-5.5-Linux@7/solr/core/src/test-files/solr/collection1'
[junit4] 2> 1354597 INFO (TEST-DirectUpdateHandlerTest.testDeleteRollback-seed#[1D1CCC4D13A9E042]) [ ] o.a.s.c.SolrResourceLoader JNDI not configured for solr (NoInitialContextEx)
[junit4] 2> 1354597 INFO (TEST-DirectUpdateHandlerTest.testDeleteRollback-seed#[1D1CCC4D13A9E042]) [ ] o.a.s.c.SolrResourceLoader using system property solr.solr.home: /home/jenkins/workspace/Lucene-Solr-5.5-Linux@7/solr/core/src/test-files/solr
[junit4] 2> 1354598 INFO (TEST-DirectUpdateHandlerTest.testDeleteRollback-seed#[1D1CCC4D13A9E042]) [ ] o.a.s.c.SolrResourceLoader Adding 'file:/home/jenkins/workspace/Lucene-Solr-5.5-Linux@7/solr/core/src/test-files/solr/collection1/lib/classes/' to classloader
[junit4] 2> 1354598 INFO (TEST-DirectUpdateHandlerTest.testDeleteRollback-seed#[1D1CCC4D13A9E042]) [ ] o.a.s.c.SolrResourceLoader Adding 'file:/home/jenkins/workspace/Lucene-Solr-5.5-Linux@7/solr/core/src/test-files/solr/collection1/lib/README' to classloader
[junit4] 2> 1354623 INFO (TEST-DirectUpdateHandlerTest.testDeleteRollback-seed#[1D1CCC4D13A9E042]) [ ] o.a.s.c.SolrConfig current version of requestparams : -1
[junit4] 2> 1354631 INFO (TEST-DirectUpdateHandlerTest.testDeleteRollback-seed#[1D1CCC4D13A9E042]) [ ] o.a.s.c.SolrConfig Using Lucene MatchVersion: 5.5.0
[junit4] 2> 1354650 INFO (TEST-DirectUpdateHandlerTest.testDeleteRollback-seed#[1D1CCC4D13A9E042]) [ ] o.a.s.c.SolrConfig Loaded SolrConfig: solrconfig.xml
[junit4] 2> 1354655 INFO (TEST-DirectUpdateHandlerTest.testDeleteRollback-seed#[1D1CCC4D13A9E042]) [ ] o.a.s.s.IndexSchema [null] Schema name=test
[junit4] 2> 1354732 INFO (TEST-DirectUpdateHandlerTest.testDeleteRollback-seed#[1D1CCC4D13A9E042]) [ ] o.a.s.s.IndexSchema default search field in schema is text
[junit4] 2> 1354733 INFO (TEST-DirectUpdateHandlerTest.testDeleteRollback-seed#[1D1CCC4D13A9E042]) [ ] o.a.s.s.IndexSchema unique key field: id
[junit4] 2> 1354733 WARN (TEST-DirectUpdateHandlerTest.testDeleteRollback-seed#[1D1CCC4D13A9E042]) [ ] o.a.s.s.IndexSchema Field text is not multivalued and destination for multiple copyFields (2)
[junit4] 2> 1354739 INFO (TEST-DirectUpdateHandlerTest.testDeleteRollback-seed#[1D1CCC4D13A9E042]) [ ] o.a.s.s.FileExchangeRateProvider Reloading exchange rates from file currency.xml
[junit4] 2> 1354740 INFO (TEST-DirectUpdateHandlerTest.testDeleteRollback-seed#[1D1CCC4D13A9E042]) [ ] o.a.s.s.FileExchangeRateProvider Reloading exchange rates from file currency.xml
[junit4] 2> 1354742 INFO (TEST-DirectUpdateHandlerTest.testDeleteRollback-seed#[1D1CCC4D13A9E042]) [ ] o.a.s.c.SolrResourceLoader JNDI not configured for solr (NoInitialContextEx)
[junit4] 2> 1354742 INFO (TEST-DirectUpdateHandlerTest.testDeleteRollback-seed#[1D1CCC4D13A9E042]) [ ] o.a.s.c.SolrResourceLoader using system property solr.solr.home: /home/jenkins/workspace/Lucene-Solr-5.5-Linux@7/solr/core/src/test-files/solr
[junit4] 2> 1354742 INFO (TEST-DirectUpdateHandlerTest.testDeleteRollback-seed#[1D1CCC4D13A9E042]) [ ] o.a.s.c.SolrResourceLoader new SolrResourceLoader for directory: '/home/jenkins/workspace/Lucene-Solr-5.5-Linux@7/solr/core/src/test-files/solr'
[junit4] 2> 1354742 INFO (TEST-DirectUpdateHandlerTest.testDeleteRollback-seed#[1D1CCC4D13A9E042]) [ ] o.a.s.c.SolrResourceLoader JNDI not configured for solr (NoInitialContextEx)
[junit4] 2> 1354742 INFO (TEST-DirectUpdateHandlerTest.testDeleteRollback-seed#[1D1CCC4D13A9E042]) [ ] o.a.s.c.SolrResourceLoader using system property solr.solr.home: /home/jenkins/workspace/Lucene-Solr-5.5-Linux@7/solr/core/src/test-files/solr
[junit4] 2> 1354742 INFO (TEST-DirectUpdateHandlerTest.testDeleteRollback-seed#[1D1CCC4D13A9E042]) [ ] o.a.s.c.CoreContainer New CoreContainer 20425398
[junit4] 2> 1354742 INFO (TEST-DirectUpdateHandlerTest.testDeleteRollback-seed#[1D1CCC4D13A9E042]) [ ] o.a.s.c.CoreContainer Loading cores into CoreContainer [instanceDir=/home/jenkins/workspace/Lucene-Solr-5.5-Linux@7/solr/core/src/test-files/solr]
[junit4] 2> 1354742 WARN (TEST-DirectUpdateHandlerTest.testDeleteRollback-seed#[1D1CCC4D13A9E042]) [ ] o.a.s.c.CoreContainer Couldn't add files from /home/jenkins/workspace/Lucene-Solr-5.5-Linux@7/solr/core/src/test-files/solr/lib to classpath: /home/jenkins/workspace/Lucene-Solr-5.5-Linux@7/solr/core/src/test-files/solr/lib
[junit4] 2> 1354743 INFO (TEST-DirectUpdateHandlerTest.testDeleteRollback-seed#[1D1CCC4D13A9E042]) [ ] o.a.s.h.c.HttpShardHandlerFactory created with socketTimeout : 600000,connTimeout : 60000,maxConnectionsPerHost : 20,maxConnections : 10000,corePoolSize : 0,maximumPoolSize : 2147483647,maxThreadIdleTime : 5,sizeOfQueue : -1,fairnessPolicy : false,useRetries : false,
[junit4] 2> 1354744 INFO (TEST-DirectUpdateHandlerTest.testDeleteRollback-seed#[1D1CCC4D13A9E042]) [ ] o.a.s.u.UpdateShardHandler Creating UpdateShardHandler HTTP client with params: socketTimeout=30000&connTimeout=30000&retry=true
[junit4] 2> 1354744 INFO (TEST-DirectUpdateHandlerTest.testDeleteRollback-seed#[1D1CCC4D13A9E042]) [ ] o.a.s.l.LogWatcher SLF4J impl is org.slf4j.impl.Log4jLoggerFactory
[junit4] 2> 1354744 INFO (TEST-DirectUpdateHandlerTest.testDeleteRollback-seed#[1D1CCC4D13A9E042]) [ ] o.a.s.l.LogWatcher Registering Log Listener [Log4j (org.slf4j.impl.Log4jLoggerFactory)]
[junit4] 2> 1354744 INFO (TEST-DirectUpdateHandlerTest.testDeleteRollback-seed#[1D1CCC4D13A9E042]) [ ] o.a.s.c.CoreContainer Security conf doesn't exist. Skipping setup for authorization module.
[junit4] 2> 1354744 INFO (TEST-DirectUpdateHandlerTest.testDeleteRollback-seed#[1D1CCC4D13A9E042]) [ ] o.a.s.c.CoreContainer No authentication plugin used.
[junit4] 2> 1354745 INFO (TEST-DirectUpdateHandlerTest.testDeleteRollback-seed#[1D1CCC4D13A9E042]) [ ] o.a.s.c.CoreDescriptor Created CoreDescriptor: {name=collection1, config=solrconfig.xml, transient=false, schema=schema12.xml, loadOnStartup=true, configSetProperties=configsetprops.json, collection=collection1, dataDir=/home/jenkins/workspace/Lucene-Solr-5.5-Linux@7/solr/build/solr-core/test/J1/temp/solr.update.DirectUpdateHandlerTest_1D1CCC4D13A9E042-001/init-core-data-001, shard=shard1}
[junit4] 2> 1354745 INFO (coreLoadExecutor-4824-thread-1) [ ] o.a.s.c.SolrResourceLoader new SolrResourceLoader for directory: '/home/jenkins/workspace/Lucene-Solr-5.5-Linux@7/solr/core/src/test-files/solr/collection1'
[junit4] 2> 1354745 INFO (coreLoadExecutor-4824-thread-1) [ ] o.a.s.c.SolrResourceLoader JNDI not configured for solr (NoInitialContextEx)
[junit4] 2> 1354745 INFO (coreLoadExecutor-4824-thread-1) [ ] o.a.s.c.SolrResourceLoader using system property solr.solr.home: /home/jenkins/workspace/Lucene-Solr-5.5-Linux@7/solr/core/src/test-files/solr
[junit4] 2> 1354746 INFO (coreLoadExecutor-4824-thread-1) [ ] o.a.s.c.SolrResourceLoader Adding 'file:/home/jenkins/workspace/Lucene-Solr-5.5-Linux@7/solr/core/src/test-files/solr/collection1/lib/classes/' to classloader
[junit4] 2> 1354746 INFO (coreLoadExecutor-4824-thread-1) [ ] o.a.s.c.SolrResourceLoader Adding 'file:/home/jenkins/workspace/Lucene-Solr-5.5-Linux@7/solr/core/src/test-files/solr/collection1/lib/README' to classloader
[junit4] 2> 1354766 INFO (coreLoadExecutor-4824-thread-1) [ ] o.a.s.c.SolrConfig current version of requestparams : -1
[junit4] 2> 1354775 INFO (coreLoadExecutor-4824-thread-1) [ ] o.a.s.c.SolrConfig Using Lucene MatchVersion: 5.5.0
[junit4] 2> 1354793 INFO (coreLoadExecutor-4824-thread-1) [ ] o.a.s.c.SolrConfig Loaded SolrConfig: solrconfig.xml
[junit4] 2> 1354798 INFO (coreLoadExecutor-4824-thread-1) [ ] o.a.s.s.IndexSchema [collection1] Schema name=test
[junit4] 2> 1354900 INFO (coreLoadExecutor-4824-thread-1) [ ] o.a.s.s.IndexSchema default search field in schema is text
[junit4] 2> 1354901 INFO (coreLoadExecutor-4824-thread-1) [ ] o.a.s.s.IndexSchema unique key field: id
[junit4] 2> 1354901 WARN (coreLoadExecutor-4824-thread-1) [ ] o.a.s.s.IndexSchema Field text is not multivalued and destination for multiple copyFields (2)
[junit4] 2> 1354906 INFO (coreLoadExecutor-4824-thread-1) [ ] o.a.s.s.FileExchangeRateProvider Reloading exchange rates from file currency.xml
[junit4] 2> 1354907 INFO (coreLoadExecutor-4824-thread-1) [ ] o.a.s.s.FileExchangeRateProvider Reloading exchange rates from file currency.xml
[junit4] 2> 1354910 INFO (coreLoadExecutor-4824-thread-1) [ ] o.a.s.c.ConfigSetProperties Did not find ConfigSet properties, assuming default properties: Can't find resource 'configsetprops.json' in classpath or '/home/jenkins/workspace/Lucene-Solr-5.5-Linux@7/solr/core/src/test-files/solr/collection1'
[junit4] 2> 1354910 INFO (coreLoadExecutor-4824-thread-1) [ ] o.a.s.c.CoreContainer Creating SolrCore 'collection1' using configuration from instancedir /home/jenkins/workspace/Lucene-Solr-5.5-Linux@7/solr/core/src/test-files/solr/collection1
[junit4] 2> 1354910 INFO (coreLoadExecutor-4824-thread-1) [ x:collection1] o.a.s.c.SolrCore org.apache.solr.core.MockFSDirectoryFactory
[junit4] 2> 1354910 INFO (coreLoadExecutor-4824-thread-1) [ x:collection1] o.a.s.c.SolrCore [[collection1] ] Opening new SolrCore at [/home/jenkins/workspace/Lucene-Solr-5.5-Linux@7/solr/core/src/test-files/solr/collection1], dataDir=[/home/jenkins/workspace/Lucene-Solr-5.5-Linux@7/solr/build/solr-core/test/J1/temp/solr.update.DirectUpdateHandlerTest_1D1CCC4D13A9E042-001/init-core-data-001/]
[junit4] 2> 1354910 INFO (coreLoadExecutor-4824-thread-1) [ x:collection1] o.a.s.c.JmxMonitoredMap JMX monitoring is enabled. Adding Solr mbeans to JMX Server: com.sun.jmx.mbeanserver.JmxMBeanServer@1ae9d12
[junit4] 2> 1354911 INFO (coreLoadExecutor-4824-thread-1) [ x:collection1] o.a.s.c.CachingDirectoryFactory return new directory for /home/jenkins/workspace/Lucene-Solr-5.5-Linux@7/solr/build/solr-core/test/J1/temp/solr.update.DirectUpdateHandlerTest_1D1CCC4D13A9E042-001/init-core-data-001
[junit4] 2> 1354911 INFO (coreLoadExecutor-4824-thread-1) [ x:collection1] o.a.s.c.SolrCore New index directory detected: old=null new=/home/jenkins/workspace/Lucene-Solr-5.5-Linux@7/solr/build/solr-core/test/J1/temp/solr.update.DirectUpdateHandlerTest_1D1CCC4D13A9E042-001/init-core-data-001/index/
[junit4] 2> 1354912 INFO (OldIndexDirectoryCleanupThreadForCore-collection1) [ x:collection1] o.a.s.c.SolrCore Looking for old index directories to cleanup for core collection1 in /home/jenkins/workspace/Lucene-Solr-5.5-Linux@7/solr/build/solr-core/test/J1/temp/solr.update.DirectUpdateHandlerTest_1D1CCC4D13A9E042-001/init-core-data-001/
[junit4] 2> 1354915 INFO (coreLoadExecutor-4824-thread-1) [ x:collection1] o.a.s.u.p.UpdateRequestProcessorChain creating updateRequestProcessorChain "dedupe"
[junit4] 2> 1354915 INFO (coreLoadExecutor-4824-thread-1) [ x:collection1] o.a.s.u.p.UpdateRequestProcessorChain inserting DistributedUpdateProcessorFactory into updateRequestProcessorChain "dedupe"
[junit4] 2> 1354916 INFO (coreLoadExecutor-4824-thread-1) [ x:collection1] o.a.s.u.p.UpdateRequestProcessorChain creating updateRequestProcessorChain "dedupe-allfields"
[junit4] 2> 1354916 INFO (coreLoadExecutor-4824-thread-1) [ x:collection1] o.a.s.u.p.UpdateRequestProcessorChain inserting DistributedUpdateProcessorFactory into updateRequestProcessorChain "dedupe-allfields"
[junit4] 2> 1354916 INFO (coreLoadExecutor-4824-thread-1) [ x:collection1] o.a.s.u.p.UpdateRequestProcessorChain creating updateRequestProcessorChain "stored_sig"
[junit4] 2> 1354916 INFO (coreLoadExecutor-4824-thread-1) [ x:collection1] o.a.s.u.p.UpdateRequestProcessorChain inserting DistributedUpdateProcessorFactory into updateRequestProcessorChain "stored_sig"
[junit4] 2> 1354916 INFO (coreLoadExecutor-4824-thread-1) [ x:collection1] o.a.s.u.p.UpdateRequestProcessorChain creating updateRequestProcessorChain "uniq-fields"
[junit4] 2> 1354916 INFO (coreLoadExecutor-4824-thread-1) [ x:collection1] o.a.s.u.p.UpdateRequestProcessorChain inserting DistributedUpdateProcessorFactory into updateRequestProcessorChain "uniq-fields"
[junit4] 2> 1354916 INFO (coreLoadExecutor-4824-thread-1) [ x:collection1] o.a.s.u.p.UpdateRequestProcessorChain creating updateRequestProcessorChain "distrib-dup-test-chain-explicit"
[junit4] 2> 1354916 INFO (coreLoadExecutor-4824-thread-1) [ x:collection1] o.a.s.u.p.UpdateRequestProcessorChain creating updateRequestProcessorChain "distrib-dup-test-chain-implicit"
[junit4] 2> 1354916 INFO (coreLoadExecutor-4824-thread-1) [ x:collection1] o.a.s.u.p.UpdateRequestProcessorChain inserting DistributedUpdateProcessorFactory into updateRequestProcessorChain "distrib-dup-test-chain-implicit"
[junit4] 2> 1354916 INFO (coreLoadExecutor-4824-thread-1) [ x:collection1] o.a.s.c.SolrCore no updateRequestProcessorChain defined as default, creating implicit default
[junit4] 2> 1354918 INFO (coreLoadExecutor-4824-thread-1) [ x:collection1] o.a.s.h.l.XMLLoader xsltCacheLifetimeSeconds=60
[junit4] 2> 1354919 INFO (coreLoadExecutor-4824-thread-1) [ x:collection1] o.a.s.h.l.XMLLoader xsltCacheLifetimeSeconds=60
[junit4] 2> 1354920 INFO (coreLoadExecutor-4824-thread-1) [ x:collection1] o.a.s.h.l.XMLLoader xsltCacheLifetimeSeconds=60
[junit4] 2> 1354921 INFO (coreLoadExecutor-4824-thread-1) [ x:collection1] o.a.s.h.l.XMLLoader xsltCacheLifetimeSeconds=60
[junit4] 2> 1354928 INFO (coreLoadExecutor-4824-thread-1) [ x:collection1] o.a.s.c.PluginBag requestHandler : 'lazy' created with startup=lazy
[junit4] 2> 1354930 INFO (coreLoadExecutor-4824-thread-1) [ x:collection1] o.a.s.c.RequestHandlers Registered paths: /admin/mbeans,standard,spellCheckCompRH,lazy,/update/json/docs,/admin/luke,spellCheckWithWordbreak_Direct,tvrh,/get,/admin/properties,/update/json,mltrh,/admin/threads,/search-facet-def,/update/csv,/search-facet-invariants,/admin/segments,spellCheckCompRH1,/mlt,/admin/system,/replication,dismax,defaults,/config,/schema,/admin/plugins,/admin/logging,spellCheckWithWordbreak,mock,/admin/ping,/update,/admin/file,/terms,spellCheckCompRH_Direct,/debug/dump
[junit4] 2> 1354931 WARN (coreLoadExecutor-4824-thread-1) [ x:collection1] o.a.s.c.SolrCore solrconfig.xml uses deprecated <admin/gettableFiles>, Please update your config to use the ShowFileRequestHandler.
[junit4] 2> 1354931 INFO (coreLoadExecutor-4824-thread-1) [ x:collection1] o.a.s.c.SolrCore Using default statsCache cache: org.apache.solr.search.stats.LocalStatsCache
[junit4] 2> 1354931 INFO (coreLoadExecutor-4824-thread-1) [ x:collection1] o.a.s.u.CommitTracker Hard AutoCommit: disabled
[junit4] 2> 1354932 INFO (coreLoadExecutor-4824-thread-1) [ x:collection1] o.a.s.u.CommitTracker Soft AutoCommit: disabled
[junit4] 2> 1354932 INFO (coreLoadExecutor-4824-thread-1) [ x:collection1] o.a.s.c.CachingDirectoryFactory return new directory for /home/jenkins/workspace/Lucene-Solr-5.5-Linux@7/solr/build/solr-core/test/J1/temp/solr.update.DirectUpdateHandlerTest_1D1CCC4D13A9E042-001/init-core-data-001/index
[junit4] 2> 1354933 INFO (coreLoadExecutor-4824-thread-1) [ x:collection1] o.a.s.u.RandomMergePolicy RandomMergePolicy wrapping class org.apache.lucene.index.TieredMergePolicy: [TieredMergePolicy: maxMergeAtOnce=18, maxMergeAtOnceExplicit=46, maxMergedSegmentMB=95.9892578125, floorSegmentMB=2.072265625, forceMergeDeletesPctAllowed=27.626539312090625, segmentsPerTier=14.0, maxCFSSegmentSizeMB=8.796093022207999E12, noCFSRatio=1.0
[junit4] 2> 1354933 INFO (coreLoadExecutor-4824-thread-1) [ x:collection1] o.a.s.c.SolrDeletionPolicy SolrDeletionPolicy.onInit: commits: num=1
[junit4] 2> commit{dir=MockDirectoryWrapper(SimpleFSDirectory@/home/jenkins/workspace/Lucene-Solr-5.5-Linux@7/solr/build/solr-core/test/J1/temp/solr.update.DirectUpdateHandlerTest_1D1CCC4D13A9E042-001/init-core-data-001/index lockFactory=org.apache.lucene.store.SingleInstanceLockFactory@416251),segFN=segments_2,generation=2}
[junit4] 2> 1354933 INFO (coreLoadExecutor-4824-thread-1) [ x:collection1] o.a.s.c.SolrDeletionPolicy newest commit generation = 2
[junit4] 2> 1354933 INFO (coreLoadExecutor-4824-thread-1) [ x:collection1] o.a.s.s.SolrIndexSearcher Opening Searcher@9c750f[collection1] main
[junit4] 2> 1354934 INFO (coreLoadExecutor-4824-thread-1) [ x:collection1] o.a.s.r.RestManager Initializing RestManager with initArgs: {storageIO=org.apache.solr.rest.ManagedResourceStorage$InMemoryStorageIO}
[junit4] 2> 1354934 INFO (coreLoadExecutor-4824-thread-1) [ x:collection1] o.a.s.r.ManagedResourceStorage Reading _rest_managed.json using InMemoryStorage
[junit4] 2> 1354934 INFO (coreLoadExecutor-4824-thread-1) [ x:collection1] o.a.s.r.RestManager Initializing 0 registered ManagedResources
[junit4] 2> 1354934 INFO (coreLoadExecutor-4824-thread-1) [ x:collection1] o.a.s.h.c.SpellCheckComponent Initializing spell checkers
[junit4] 2> 1354934 INFO (coreLoadExecutor-4824-thread-1) [ x:collection1] o.a.s.s.DirectSolrSpellChecker init: {name=direct,classname=DirectSolrSpellChecker,field=lowerfilt,minQueryLength=3}
[junit4] 2> 1354937 INFO (coreLoadExecutor-4824-thread-1) [ x:collection1] o.a.s.h.ReplicationHandler Commits will be reserved for 10000
[junit4] 2> 1354937 INFO (searcherExecutor-4825-thread-1-processing-x:collection1) [ x:collection1] o.a.s.h.c.SpellCheckComponent Loading spell index for spellchecker: default
[junit4] 2> 1354937 INFO (searcherExecutor-4825-thread-1-processing-x:collection1) [ x:collection1] o.a.s.h.c.SpellCheckComponent Loading spell index for spellchecker: direct
[junit4] 2> 1354937 INFO (searcherExecutor-4825-thread-1-processing-x:collection1) [ x:collection1] o.a.s.h.c.SpellCheckComponent Loading spell index for spellchecker: wordbreak
[junit4] 2> 1354937 INFO (searcherExecutor-4825-thread-1-processing-x:collection1) [ x:collection1] o.a.s.h.c.SpellCheckComponent Loading spell index for spellchecker: multipleFields
[junit4] 2> 1354937 INFO (searcherExecutor-4825-thread-1-processing-x:collection1) [ x:collection1] o.a.s.h.c.SpellCheckComponent Loading spell index for spellchecker: jarowinkler
[junit4] 2> 1354937 INFO (searcherExecutor-4825-thread-1-processing-x:collection1) [ x:collection1] o.a.s.h.c.SpellCheckComponent Loading spell index for spellchecker: external
[junit4] 2> 1354937 INFO (searcherExecutor-4825-thread-1-processing-x:collection1) [ x:collection1] o.a.s.h.c.SpellCheckComponent Loading spell index for spellchecker: freq
[junit4] 2> 1354938 INFO (searcherExecutor-4825-thread-1-processing-x:collection1) [ x:collection1] o.a.s.h.c.SpellCheckComponent Loading spell index for spellchecker: fqcn
[junit4] 2> 1354938 INFO (coreLoadExecutor-4824-thread-1) [ x:collection1] o.a.s.c.CoreContainer registering core: collection1
[junit4] 2> 1354938 INFO (searcherExecutor-4825-thread-1-processing-x:collection1) [ x:collection1] o.a.s.h.c.SpellCheckComponent Loading spell index for spellchecker: perDict
[junit4] 2> 1354939 INFO (TEST-DirectUpdateHandlerTest.testDeleteRollback-seed#[1D1CCC4D13A9E042]) [ ] o.a.s.SolrTestCaseJ4 ####initCore end
[junit4] 2> 1354940 INFO (searcherExecutor-4825-thread-1-processing-x:collection1) [ x:collection1] o.a.s.c.SolrCore [collection1] Registered new searcher Searcher@9c750f[collection1] main{ExitableDirectoryReader(UninvertingDirectoryReader())}
[junit4] 2> 1354941 INFO (TEST-DirectUpdateHandlerTest.testDeleteRollback-seed#[1D1CCC4D13A9E042]) [ ] o.a.s.u.p.LogUpdateProcessorFactory [collection1] webapp=null path=null params={}{add=[A]} 0 1
[junit4] 2> 1354941 INFO (TEST-DirectUpdateHandlerTest.testDeleteRollback-seed#[1D1CCC4D13A9E042]) [ ] o.a.s.u.p.LogUpdateProcessorFactory [collection1] webapp=null path=null params={}{add=[B]} 0 0
[junit4] 2> 1354942 INFO (TEST-DirectUpdateHandlerTest.testDeleteRollback-seed#[1D1CCC4D13A9E042]) [ ] o.a.s.u.DirectUpdateHandler2 start commit{,optimize=false,openSearcher=true,waitSearcher=true,expungeDeletes=false,softCommit=false,prepareCommit=false}
[junit4] 2> 1355064 INFO (TEST-DirectUpdateHandlerTest.testDeleteRollback-seed#[1D1CCC4D13A9E042]) [ ] o.a.s.c.SolrDeletionPolicy SolrDeletionPolicy.onCommit: commits: num=2
[junit4] 2> commit{dir=MockDirectoryWrapper(SimpleFSDirectory@/home/jenkins/workspace/Lucene-Solr-5.5-Linux@7/solr/build/solr-core/test/J1/temp/solr.update.DirectUpdateHandlerTest_1D1CCC4D13A9E042-001/init-core-data-001/index lockFactory=org.apache.lucene.store.SingleInstanceLockFactory@416251),segFN=segments_2,generation=2}
[junit4] 2> commit{dir=MockDirectoryWrapper(SimpleFSDirectory@/home/jenkins/workspace/Lucene-Solr-5.5-Linux@7/solr/build/solr-core/test/J1/temp/solr.update.DirectUpdateHandlerTest_1D1CCC4D13A9E042-001/init-core-data-001/index lockFactory=org.apache.lucene.store.SingleInstanceLockFactory@416251),segFN=segments_3,generation=3}
[junit4] 2> 1355065 INFO (TEST-DirectUpdateHandlerTest.testDeleteRollback-seed#[1D1CCC4D13A9E042]) [ ] o.a.s.c.SolrDeletionPolicy newest commit generation = 3
[junit4] 2> 1355067 INFO (TEST-DirectUpdateHandlerTest.testDeleteRollback-seed#[1D1CCC4D13A9E042]) [ ] o.a.s.s.SolrIndexSearcher Opening Searcher@8ef342[collection1] main
[junit4] 2> 1355067 INFO (TEST-DirectUpdateHandlerTest.testDeleteRollback-seed#[1D1CCC4D13A9E042]) [ ] o.a.s.u.DirectUpdateHandler2 end_commit_flush
[junit4] 2> 1355069 INFO (searcherExecutor-4825-thread-1) [ ] o.a.s.c.SolrCore [collection1] Registered new searcher Searcher@8ef342[collection1] main{ExitableDirectoryReader(UninvertingDirectoryReader(Uninverting(_0(5.5.0):C2)))}
[junit4] 2> 1355071 INFO (TEST-DirectUpdateHandlerTest.testDeleteRollback-seed#[1D1CCC4D13A9E042]) [ ] o.a.s.c.S.Request [collection1] webapp=null path=null params={q=id:A+OR+id:B&indent=true} hits=2 status=0 QTime=0
[junit4] 2> 1355073 INFO (TEST-DirectUpdateHandlerTest.testDeleteRollback-seed#[1D1CCC4D13A9E042]) [ ] o.a.s.u.p.LogUpdateProcessorFactory [collection1] webapp=null path=null params={}{delete=[B]} 0 0
[junit4] 2> 1355074 INFO (TEST-DirectUpdateHandlerTest.testDeleteRollback-seed#[1D1CCC4D13A9E042]) [ ] o.a.s.c.S.Request [collection1] webapp=null path=null params={q=id:A+OR+id:B&indent=true} hits=2 status=0 QTime=3
[junit4] 2> 1355074 INFO (TEST-DirectUpdateHandlerTest.testDeleteRollback-seed#[1D1CCC4D13A9E042]) [ ] o.a.s.u.DirectUpdateHandler2 start rollback{}
[junit4] 2> 1355074 INFO (TEST-DirectUpdateHandlerTest.testDeleteRollback-seed#[1D1CCC4D13A9E042]) [ ] o.a.s.u.DefaultSolrCoreState Rollback old IndexWriter... core=collection1
[junit4] 2> 1355075 INFO (TEST-DirectUpdateHandlerTest.testDeleteRollback-seed#[1D1CCC4D13A9E042]) [ ] o.a.s.u.RandomMergePolicy RandomMergePolicy wrapping class org.apache.lucene.index.TieredMergePolicy: [TieredMergePolicy: maxMergeAtOnce=19, maxMergeAtOnceExplicit=21, maxMergedSegmentMB=92.9697265625, floorSegmentMB=0.8984375, forceMergeDeletesPctAllowed=21.632571719753543, segmentsPerTier=45.0, maxCFSSegmentSizeMB=8.796093022207999E12, noCFSRatio=0.39498462949823976
[junit4] 2> 1355076 INFO (TEST-DirectUpdateHandlerTest.testDeleteRollback-seed#[1D1CCC4D13A9E042]) [ ] o.a.s.c.SolrDeletionPolicy SolrDeletionPolicy.onInit: commits: num=1
[junit4] 2> commit{dir=MockDirectoryWrapper(SimpleFSDirectory@/home/jenkins/workspace/Lucene-Solr-5.5-Linux@7/solr/build/solr-core/test/J1/temp/solr.update.DirectUpdateHandlerTest_1D1CCC4D13A9E042-001/init-core-data-001/index lockFactory=org.apache.lucene.store.SingleInstanceLockFactory@416251),segFN=segments_3,generation=3}
[junit4] 2> 1355076 INFO (TEST-DirectUpdateHandlerTest.testDeleteRollback-seed#[1D1CCC4D13A9E042]) [ ] o.a.s.c.SolrDeletionPolicy newest commit generation = 3
[junit4] 2> 1355077 INFO (TEST-DirectUpdateHandlerTest.testDeleteRollback-seed#[1D1CCC4D13A9E042]) [ ] o.a.s.u.DefaultSolrCoreState New IndexWriter is ready to be used.
[junit4] 2> 1355077 INFO (TEST-DirectUpdateHandlerTest.testDeleteRollback-seed#[1D1CCC4D13A9E042]) [ ] o.a.s.u.DirectUpdateHandler2 end_rollback
[junit4] 2> 1355077 INFO (TEST-DirectUpdateHandlerTest.testDeleteRollback-seed#[1D1CCC4D13A9E042]) [ ] o.a.s.c.S.Request [collection1] webapp=null path=null params={q=id:A+OR+id:B&indent=true} hits=2 status=0 QTime=7
[junit4] 2> 1355078 INFO (TEST-DirectUpdateHandlerTest.testDeleteRollback-seed#[1D1CCC4D13A9E042]) [ ] o.a.s.u.p.LogUpdateProcessorFactory [collection1] webapp=null path=null params={}{add=[ZZZ]} 0 0
[junit4] 2> 1355079 INFO (TEST-DirectUpdateHandlerTest.testDeleteRollback-seed#[1D1CCC4D13A9E042]) [ ] o.a.s.u.DirectUpdateHandler2 start commit{,optimize=false,openSearcher=true,waitSearcher=true,expungeDeletes=false,softCommit=false,prepareCommit=false}
[junit4] 2> 1355204 INFO (TEST-DirectUpdateHandlerTest.testDeleteRollback-seed#[1D1CCC4D13A9E042]) [ ] o.a.s.c.SolrDeletionPolicy SolrDeletionPolicy.onCommit: commits: num=2
[junit4] 2> commit{dir=MockDirectoryWrapper(SimpleFSDirectory@/home/jenkins/workspace/Lucene-Solr-5.5-Linux@7/solr/build/solr-core/test/J1/temp/solr.update.DirectUpdateHandlerTest_1D1CCC4D13A9E042-001/init-core-data-001/index lockFactory=org.apache.lucene.store.SingleInstanceLockFactory@416251),segFN=segments_3,generation=3}
[junit4] 2> commit{dir=MockDirectoryWrapper(SimpleFSDirectory@/home/jenkins/workspace/Lucene-Solr-5.5-Linux@7/solr/build/solr-core/test/J1/temp/solr.update.DirectUpdateHandlerTest_1D1CCC4D13A9E042-001/init-core-data-001/index lockFactory=org.apache.lucene.store.SingleInstanceLockFactory@416251),segFN=segments_4,generation=4}
[junit4] 2> 1355205 INFO (TEST-DirectUpdateHandlerTest.testDeleteRollback-seed#[1D1CCC4D13A9E042]) [ ] o.a.s.c.SolrDeletionPolicy newest commit generation = 4
[junit4] 2> 1355207 INFO (TEST-DirectUpdateHandlerTest.testDeleteRollback-seed#[1D1CCC4D13A9E042]) [ ] o.a.s.s.SolrIndexSearcher Opening Searcher@4f918b[collection1] main
[junit4] 2> 1355207 INFO (TEST-DirectUpdateHandlerTest.testDeleteRollback-seed#[1D1CCC4D13A9E042]) [ ] o.a.s.u.DirectUpdateHandler2 end_commit_flush
[junit4] 2> 1355210 INFO (searcherExecutor-4825-thread-1) [ ] o.a.s.c.SolrCore [collection1] Registered new searcher Searcher@4f918b[collection1] main{ExitableDirectoryReader(UninvertingDirectoryReader(Uninverting(_0(5.5.0):C2) Uninverting(_1(5.5.0):C1)))}
[junit4] 2> 1355211 INFO (TEST-DirectUpdateHandlerTest.testDeleteRollback-seed#[1D1CCC4D13A9E042]) [ ] o.a.s.u.p.LogUpdateProcessorFactory [collection1] webapp=null path=null params={}{commit=} 0 132
[junit4] 2> 1355212 INFO (TEST-DirectUpdateHandlerTest.testDeleteRollback-seed#[1D1CCC4D13A9E042]) [ ] o.a.s.c.S.Request [collection1] webapp=null path=null params={q=id:ZZZ&wt=xml} hits=1 status=0 QTime=0
[junit4] 2> 1355213 INFO (TEST-DirectUpdateHandlerTest.testDeleteRollback-seed#[1D1CCC4D13A9E042]) [ ] o.a.s.SolrTestCaseJ4 ###Ending testDeleteRollback
[junit4] 2> 1355215 INFO (TEST-DirectUpdateHandlerTest.testBasics-seed#[1D1CCC4D13A9E042]) [ ] o.a.s.SolrTestCaseJ4 ###Starting testBasics
[junit4] 2> 1355215 INFO (TEST-DirectUpdateHandlerTest.testBasics-seed#[1D1CCC4D13A9E042]) [ ] o.a.s.u.DirectUpdateHandler2 [collection1] REMOVING ALL DOCUMENTS FROM INDEX
[junit4] 2> 1355216 INFO (TEST-DirectUpdateHandlerTest.testBasics-seed#[1D1CCC4D13A9E042]) [ ] o.a.s.u.p.LogUpdateProcessorFactory [collection1] webapp=null path=null params={}{deleteByQuery=*:*} 0 0
[junit4] 2> 1355216 INFO (TEST-DirectUpdateHandlerTest.testBasics-seed#[1D1CCC4D13A9E042]) [ ] o.a.s.u.DirectUpdateHandler2 start commit{,optimize=false,openSearcher=true,waitSearcher=true,expungeDeletes=false,softCommit=false,prepareCommit=false}
[junit4] 2> 1355225 INFO (TEST-DirectUpdateHandlerTest.testBasics-seed#[1D1CCC4D13A9E042]) [ ] o.a.s.c.SolrDeletionPolicy SolrDeletionPolicy.onCommit: commits: num=2
[junit4] 2> commit{dir=MockDirectoryWrapper(SimpleFSDirectory@/home/jenkins/workspace/Lucene-Solr-5.5-Linux@7/solr/build/solr-core/test/J1/temp/solr.update.DirectUpdateHandlerTest_1D1CCC4D13A9E042-001/init-core-data-001/index lockFactory=org.apache.lucene.store.SingleInstanceLockFactory@416251),segFN=segments_4,generation=4}
[junit4] 2> commit{dir=MockDirectoryWrapper(SimpleFSDirectory@/home/jenkins/workspace/Lucene-Solr-5.5-Linux@7/solr/build/solr-core/test/J1/temp/solr.update.DirectUpdateHandlerTest_1D1CCC4D13A9E042-001/init-core-data-001/index lockFactory=org.apache.lucene.store.SingleInstanceLockFactory@416251),segFN=segments_5,generation=5}
[junit4] 2> 1355225 INFO (TEST-DirectUpdateHandlerTest.testBasics-seed#[1D1CCC4D13A9E042]) [ ] o.a.s.c.SolrDeletionPolicy newest commit generation = 5
[junit4] 2> 1355225 INFO (TEST-DirectUpdateHandlerTest.testBasics-seed#[1D1CCC4D13A9E042]) [ ] o.a.s.s.SolrIndexSearcher Opening Searcher@1710f82[collection1] main
[junit4] 2> 1355225 INFO (TEST-DirectUpdateHandlerTest.testBasics-seed#[1D1CCC4D13A9E042]) [ ] o.a.s.u.DirectUpdateHandler2 end_commit_flush
[junit4] 2> 1355227 INFO (searcherExecutor-4825-thread-1) [ ] o.a.s.c.SolrCore [collection1] Registered new searcher Searcher@1710f82[collection1] main{ExitableDirectoryReader(UninvertingDirectoryReader())}
[junit4] 2> 1355229 INFO (TEST-DirectUpdateHandlerTest.testBasics-seed#[1D1CCC4D13A9E042]) [ ] o.a.s.u.p.LogUpdateProcessorFactory [collection1] webapp=null path=null params={}{commit=} 0 12
[junit4] 2> 1355230 INFO (TEST-DirectUpdateHandlerTest.testBasics-seed#[1D1CCC4D13A9E042]) [ ] o.a.s.u.p.LogUpdateProcessorFactory [collection1] webapp=null path=null params={}{add=[5]} 0 0
[junit4] 2> 1355230 INFO (TEST-DirectUpdateHandlerTest.testBasics-seed#[1D1CCC4D13A9E042]) [ ] o.a.s.u.p.LogUpdateProcessorFactory [collection1] webapp=null path=null params={}{add=[6]} 0 0
[junit4] 2> 1355231 INFO (TEST-DirectUpdateHandlerTest.testBasics-seed#[1D1CCC4D13A9E042]) [ ] o.a.s.c.S.Request [collection1] webapp=null path=null params={q=id:5&wt=xml} hits=0 status=0 QTime=0
[junit4] 2> 1355231 INFO (TEST-DirectUpdateHandlerTest.testBasics-seed#[1D1CCC4D13A9E042]) [ ] o.a.s.c.S.Request [collection1] webapp=null path=null params={q=id:6&wt=xml} hits=0 status=0 QTime=0
[junit4] 2> 1355232 INFO (TEST-DirectUpdateHandlerTest.testBasics-seed#[1D1CCC4D13A9E042]) [ ] o.a.s.u.DirectUpdateHandler2 start commit{,optimize=false,openSearcher=true,waitSearcher=true,expungeDeletes=false,softCommit=false,prepareCommit=false}
[junit4] 2> 1355374 INFO (TEST-DirectUpdateHandlerTest.testBasics-seed#[1D1CCC4D13A9E042]) [ ] o.a.s.c.SolrDeletionPolicy SolrDeletionPolicy.onCommit: commits: num=2
[junit4] 2> commit{dir=MockDirectoryWrapper(SimpleFSDirectory@/home/jenkins/workspace/Lucene-Solr-5.5-Linux@7/solr/build/solr-core/test/J1/temp/solr.update.DirectUpdateHandlerTest_1D1CCC4D13A9E042-001/init-core-data-001/index lockFactory=org.apache.lucene.store.SingleInstanceLockFactory@416251),segFN=segments_5,generation=5}
[junit4] 2> commit{dir=MockDirectoryWrapper(SimpleFSDirectory@/home/jenkins/workspace/Lucene-Solr-5.5-Linux@7/solr/build/solr-core/test/J1/temp/solr.update.DirectUpdateHandlerTest_1D1CCC4D13A9E042-001/init-core-data-001/index lockFactory=org.apache.lucene.store.SingleInstanceLockFactory@416251),segFN=segments_6,generation=6}
[junit4] 2> 1355374 INFO (TEST-DirectUpdateHandlerTest.testBasics-seed#[1D1CCC4D13A9E042]) [ ] o.a.s.c.SolrDeletionPolicy newest commit generation = 6
[junit4] 2> 1355376 INFO (TEST-DirectUpdateHandlerTest.testBasics-seed#[1D1CCC4D13A9E042]) [ ] o.a.s.s.SolrIndexSearcher Opening Searcher@1de9bf0[collection1] main
[junit4] 2> 1355377 INFO (TEST-DirectUpdateHandlerTest.testBasics-seed#[1D1CCC4D13A9E042]) [ ] o.a.s.u.DirectUpdateHandler2 end_commit_flush
[junit4] 2> 1355379 INFO (searcherExecutor-4825-thread-1) [ ] o.a.s.c.SolrCore [collection1] Registered new searcher Searcher@1de9bf0[collection1] main{ExitableDirectoryReader(UninvertingDirectoryReader(Uninverting(_2(5.5.0):C2)))}
[junit4] 2> 1355380 INFO (TEST-DirectUpdateHandlerTest.testBasics-seed#[1D1CCC4D13A9E042]) [ ] o.a.s.u.p.LogUpdateProcessorFactory [collection1] webapp=null path=null params={}{commit=} 0 148
[junit4] 2> 1355381 INFO (TEST-DirectUpdateHandlerTest.testBasics-seed#[1D1CCC4D13A9E042]) [ ] o.a.s.c.S.Request [collection1] webapp=null path=null params={q=id:5&wt=xml} hits=1 status=0 QTime=0
[junit4] 2> 1355381 INFO (TEST-DirectUpdateHandlerTest.testBasics-seed#[1D1CCC4D13A9E042]) [ ] o.a.s.c.S.Request [collection1] webapp=null path=null params={q=id:6&wt=xml} hits=1 status=0 QTime=0
[junit4] 2> 1355382 INFO (TEST-DirectUpdateHandlerTest.testBasics-seed#[1D1CCC4D13A9E042]) [ ] o.a.s.u.p.LogUpdateProcessorFactory [collection1] webapp=null path=null params={}{delete=[5]} 0 0
[junit4] 2> 1355382 INFO (TEST-DirectUpdateHandlerTest.testBasics-seed#[1D1CCC4D13A9E042]) [ ] o.a.s.c.S.Request [collection1] webapp=null path=null params={q=id:5&wt=xml} hits=1 status=0 QTime=0
[junit4] 2> 1355383 INFO (TEST-DirectUpdateHandlerTest.testBasics-seed#[1D1CCC4D13A9E042]) [ ] o.a.s.u.DirectUpdateHandler2 start commit{,optimize=false,openSearcher=true,waitSearcher=true,expungeDeletes=false,softCommit=false,prepareCommit=false}
[junit4] 2> 1355423 INFO (TEST-DirectUpdateHandlerTest.testBasics-seed#[1D1CCC4D13A9E042]) [ ] o.a.s.c.SolrDeletionPolicy SolrDeletionPolicy.onCommit: commits: num=2
[junit4] 2> commit{dir=MockDirectoryWrapper(SimpleFSDirectory@/home/jenkins/workspace/Lucene-Solr-5.5-Linux@7/solr/build/solr-core/test/J1/temp/solr.update.DirectUpdateHandlerTest_1D1CCC4D13A9E042-001/init-core-data-001/index lockFactory=org.apache.lucene.store.SingleInstanceLockFactory@416251),segFN=segments_6,generation=6}
[junit4] 2> commit{dir=MockDirectoryWrapper(SimpleFSDirectory@/home/jenkins/workspace/Lucene-Solr-5.5-Linux@7/solr/build/solr-core/test/J1/temp/solr.update.DirectUpdateHandlerTest_1D1CCC4D13A9E042-001/init-core-data-001/index lockFactory=org.apache.lucene.store.SingleInstanceLockFactory@416251),segFN=segments_7,generation=7}
[junit4] 2> 1355423 INFO (TEST-DirectUpdateHandlerTest.testBasics-seed#[1D1CCC4D13A9E042]) [ ] o.a.s.c.SolrDeletionPolicy newest commit generation = 7
[junit4] 2> 1355424 INFO (TEST-DirectUpdateHandlerTest.testBasics-seed#[1D1CCC4D13A9E042]) [ ] o.a.s.s.SolrIndexSearcher Opening Searcher@e6fd6d[collection1] main
[junit4] 2> 1355424 INFO (TEST-DirectUpdateHandlerTest.testBasics-seed#[1D1CCC4D13A9E042]) [ ] o.a.s.u.DirectUpdateHandler2 end_commit_flush
[junit4] 2> 1355427 INFO (searcherExecutor-4825-thread-1) [ ] o.a.s.c.SolrCore [collection1] Registered new searcher Searcher@e6fd6d[collection1] main{ExitableDirectoryReader(UninvertingDirectoryReader(Uninverting(_2(5.5.0):C2/1:delGen=1)))}
[junit4] 2> 1355427 INFO (TEST-DirectUpdateHandlerTest.testBasics-seed#[1D1CCC4D13A9E042]) [ ] o.a.s.u.p.LogUpdateProcessorFactory [collection1] webapp=null path=null params={}{commit=} 0 44
[junit4] 2> 1355428 INFO (TEST-DirectUpdateHandlerTest.testBasics-seed#[1D1CCC4D13A9E042]) [ ] o.a.s.c.S.Request [collection1] webapp=null path=null params={q=id:5&wt=xml} hits=0 status=0 QTime=0
[junit4] 2> 1355429 INFO (TEST-DirectUpdateHandlerTest.testBasics-seed#[1D1CCC4D13A9E042]) [ ] o.a.s.c.S.Request [collection1] webapp=null path=null params={q=id:6&wt=xml} hits=1 status=0 QTime=0
[junit4] 2> 1355429 INFO (TEST-DirectUpdateHandlerTest.testBasics-seed#[1D1CCC4D13A9E042]) [ ] o.a.s.u.DirectUpdateHandler2 [collection1] REMOVING ALL DOCUMENTS FROM INDEX
[junit4] 2> 1355429 INFO (TEST-DirectUpdateHandlerTest.testBasics-seed#[1D1CCC4D13A9E042]) [ ] o.a.s.u.p.LogUpdateProcessorFactory [collection1] webapp=null path=null params={}{deleteByQuery=*:*} 0 0
[junit4] 2> 1355430 INFO (TEST-DirectUpdateHandlerTest.testBasics-seed#[1D1CCC4D13A9E042]) [ ] o.a.s.c.S.Request [collection1] webapp=null path=null params={q=id:6&wt=xml} hits=1 status=0 QTime=0
[junit4] 2> 1355430 INFO (TEST-DirectUpdateHandlerTest.testBasics-seed#[1D1CCC4D13A9E042]) [ ] o.a.s.u.DirectUpdateHandler2 start commit{,optimize=false,openSearcher=true,waitSearcher=true,expungeDeletes=false,softCommit=false,prepareCommit=false}
[junit4] 2> 1355438 INFO (TEST-DirectUpdateHandlerTest.testBasics-seed#[1D1CCC4D13A9E042]) [ ] o.a.s.c.SolrDeletionPolicy SolrDeletionPolicy.onCommit: commits: num=2
[junit4] 2> commit{dir=MockDirectoryWrapper(SimpleFSDirectory@/home/jenkins/workspace/Lucene-Solr-5.5-Linux@7/solr/build/solr-core/test/J1/temp/solr.update.DirectUpdateHandlerTest_1D1CCC4D13A9E042-001/init-core-data-001/index lockFactory=org.apache.lucene.store.SingleInstanceLockFactory@416251),segFN=segments_7,generation=7}
[junit4] 2> commit{dir=MockDirectoryWrapper(SimpleFSDirectory@/home/jenkins/workspace/Lucene-Solr-5.5-Linux@7/solr/build/solr-core/test/J1/temp/solr.update.DirectUpdateHandlerTest_1D1CCC4D13A9E042-001/init-core-data-001/index lockFactory=org.apache.lucene.store.SingleInstanceLockFactory@416251),segFN=segments_8,generation=8}
[junit4] 2> 1355439 INFO (TEST-DirectUpdateHandlerTest.testBasics-seed#[1D1CCC4D13A9E042]) [ ] o.a.s.c.SolrDeletionPolicy newest commit generation = 8
[junit4] 2> 1355439 INFO (TEST-DirectUpdateHandlerTest.testBasics-seed#[1D1CCC4D13A9E042]) [ ] o.a.s.s.SolrIndexSearcher Opening Searcher@14fef15[collection1] main
[junit4] 2> 1355439 INFO (TEST-DirectUpdateHandlerTest.testBasics-seed#[1D1CCC4D13A9E042]) [ ] o.a.s.u.DirectUpdateHandler2 end_commit_flush
[junit4] 2> 1355442 INFO (searcherExecutor-4825-thread-1) [ ] o.a.s.c.SolrCore [collection1] Registered new searcher Searcher@14fef15[collection1] main{ExitableDirectoryReader(UninvertingDirectoryReader())}
[junit4] 2> 1355443 INFO (TEST-DirectUpdateHandlerTest.testBasics-seed#[1D1CCC4D13A9E042]) [ ] o.a.s.u.p.LogUpdateProcessorFactory [collection1] webapp=null path=null params={}{commit=} 0 12
[junit4] 2> 1355444 INFO (TEST-DirectUpdateHandlerTest.testBasics-seed#[1D1CCC4D13A9E042]) [ ] o.a.s.c.S.Request [collection1] webapp=null path=null params={q=id:6&wt=xml} hits=0 status=0 QTime=0
[junit4] 2> 1355444 INFO (TEST-DirectUpdateHandlerTest.testBasics-seed#[1D1CCC4D13A9E042]) [ ] o.a.s.SolrTestCaseJ4 ###Ending testBasics
[junit4] 2> 1355446 INFO (TEST-DirectUpdateHandlerTest.testRequireUniqueKey-seed#[1D1CCC4D13A9E042]) [ ] o.a.s.SolrTestCaseJ4 ###Starting testRequireUniqueKey
[junit4] 2> 1355446 INFO (TEST-DirectUpdateHandlerTest.testRequireUniqueKey-seed#[1D1CCC4D13A9E042]) [ ] o.a.s.u.DirectUpdateHandler2 [collection1] REMOVING ALL DOCUMENTS FROM INDEX
[junit4] 2> 1355446 INFO (TEST-DirectUpdateHandlerTest.testRequireUniqueKey-seed#[1D1CCC4D13A9E042]) [ ] o.a.s.u.p.LogUpdateProcessorFactory [collection1] webapp=null path=null params={}{deleteByQuery=*:*} 0 0
[junit4] 2> 1355447 INFO (TEST-DirectUpdateHandlerTest.testRequireUniqueKey-seed#[1D1CCC4D13A9E042]) [ ] o.a.s.u.DirectUpdateHandler2 start commit{,optimize=false,openSearcher=true,waitSearcher=true,expungeDeletes=false,softCommit=false,prepareCommit=false}
[junit4] 2> 1355479 INFO (TEST-DirectUpdateHandlerTest.testRequireUniqueKey-seed#[1D1CCC4D13A9E042]) [ ] o.a.s.c.SolrDeletionPolicy SolrDeletionPolicy.onCommit: commits: num=2
[junit4] 2> commit{dir=MockDirectoryWrapper(SimpleFSDirectory@/home/jenkins/workspace/Lucene-Solr-5.5-Linux@7/solr/build/solr-core/test/J1/temp/solr.update.DirectUpdateHandlerTest_1D1CCC4D13A9E042-001/init-core-data-001/index lockFactory=org.apache.lucene.store.SingleInstanceLockFactory@416251),segFN=segments_8,generation=8}
[junit4] 2> commit{dir=MockDirectoryWrapper(SimpleFSDirectory@/home/jenkins/workspace/Lucene-Solr-5.5-Linux@7/solr/build/solr-core/test/J1/temp/solr.update.DirectUpdateHandlerTest_1D1CCC4D13A9E042-001/init-core-data-001/index lockFactory=org.apache.lucene.store.SingleInstanceLockFactory@416251),segFN=segments_9,generation=9}
[junit4] 2> 1355479 INFO (TEST-DirectUpdateHandlerTest.testRequireUniqueKey-seed#[1D1CCC4D13A9E042]) [ ] o.a.s.c.SolrDeletionPolicy newest commit generation = 9
[junit4] 2> 1355480 INFO (TEST-DirectUpdateHandlerTest.testRequireUniqueKey-seed#[1D1CCC4D13A9E042]) [ ] o.a.s.s.SolrIndexSearcher Opening Searcher@18a8a7b[collection1] main
[junit4] 2> 1355480 INFO (TEST-DirectUpdateHandlerTest.testRequireUniqueKey-seed#[1D1CCC4D13A9E042]) [ ] o.a.s.u.DirectUpdateHandler2 end_commit_flush
[junit4] 2> 1355482 INFO (searcherExecutor-4825-thread-1) [ ] o.a.s.c.SolrCore [collection1] Registered new searcher Searcher@18a8a7b[collection1] main{ExitableDirectoryReader(UninvertingDirectoryReader())}
[junit4] 2> 1355483 INFO (TEST-DirectUpdateHandlerTest.testRequireUniqueKey-seed#[1D1CCC4D13A9E042]) [ ] o.a.s.u.p.LogUpdateProcessorFactory [collection1] webapp=null path=null params={}{commit=} 0 35
[junit4] 2> 1355484 INFO (TEST-DirectUpdateHandlerTest.testRequireUniqueKey-seed#[1D1CCC4D13A9E042]) [ ] o.a.s.u.p.LogUpdateProcessorFactory [collection1] webapp=null path=null params={}{add=[1]} 0 0
[junit4] 2> 1355484 INFO (TEST-DirectUpdateHandlerTest.testRequireUniqueKey-seed#[1D1CCC4D13A9E042]) [ ] o.a.s.u.p.LogUpdateProcessorFactory [collection1] webapp=null path=null params={}{} 0 0
[junit4] 2> 1355485 INFO (TEST-DirectUpdateHandlerTest.testRequireUniqueKey-seed#[1D1CCC4D13A9E042]) [ ] o.a.s.h.RequestHandlerBase Ignoring exception matching ignore_exception
[junit4] 2> 1355485 INFO (TEST-DirectUpdateHandlerTest.testRequireUniqueKey-seed#[1D1CCC4D13A9E042]) [ ] o.a.s.u.p.LogUpdateProcessorFactory [collection1] webapp=null path=null params={}{} 0 0
[junit4] 2> 1355485 INFO (TEST-DirectUpdateHandlerTest.testRequireUniqueKey-seed#[1D1CCC4D13A9E042]) [ ] o.a.s.h.RequestHandlerBase Ignoring exception matching id
[junit4] 2> 1355485 INFO (TEST-DirectUpdateHandlerTest.testRequireUniqueKey-seed#[1D1CCC4D13A9E042]) [ ] o.a.s.SolrTestCaseJ4 ###Ending testRequireUniqueKey
[junit4] 2> 1355487 INFO (TEST-DirectUpdateHandlerTest.testPrepareCommit-seed#[1D1CCC4D13A9E042]) [ ] o.a.s.SolrTestCaseJ4 ###Starting testPrepareCommit
[junit4] 2> 1355487 INFO (TEST-DirectUpdateHandlerTest.testPrepareCommit-seed#[1D1CCC4D13A9E042]) [ ] o.a.s.u.DirectUpdateHandler2 [collection1] REMOVING ALL DOCUMENTS FROM INDEX
[junit4] 2> 1355487 INFO (TEST-DirectUpdateHandlerTest.testPrepareCommit-seed#[1D1CCC4D13A9E042]) [ ] o.a.s.u.p.LogUpdateProcessorFactory [collection1] webapp=null path=null params={}{deleteByQuery=*:*} 0 0
[junit4] 2> 1355488 INFO (TEST-DirectUpdateHandlerTest.testPrepareCommit-seed#[1D1CCC4D13A9E042]) [ ] o.a.s.u.DirectUpdateHandler2 start commit{,optimize=false,openSearcher=true,waitSearcher=true,expungeDeletes=false,softCommit=false,prepareCommit=false}
[junit4] 2> 1355496 INFO (TEST-DirectUpdateHandlerTest.testPrepareCommit-seed#[1D1CCC4D13A9E042]) [ ] o.a.s.c.SolrDeletionPolicy SolrDeletionPolicy.onCommit: commits: num=2
[junit4] 2> commit{dir=MockDirectoryWrapper(SimpleFSDirectory@/home/jenkins/workspace/Lucene-Solr-5.5-Linux@7/solr/build/solr-core/test/J1/temp/solr.update.DirectUpdateHandlerTest_1D1CCC4D13A9E042-001/init-core-data-001/index lockFactory=org.apache.lucene.store.SingleInstanceLockFactory@416251),segFN=segments_9,generation=9}
[junit4] 2> commit{dir=MockDirectoryWrapper(SimpleFSDirectory@/home/jenkins/workspace/Lucene-Solr-5.5-Linux@7/solr/build/solr-core/test/J1/temp/solr.update.DirectUpdateHandlerTest_1D1CCC4D13A9E042-001/init-core-data-001/index lockFactory=org.apache.lucene.store.SingleInstanceLockFactory@416251),segFN=segments_a,generation=10}
[junit4] 2> 1355497 INFO (TEST-DirectUpdateHandlerTest.testPrepareCommit-seed#[1D1CCC4D13A9E042]) [ ] o.a.s.c.SolrDeletionPolicy newest commit generation = 10
[junit4] 2> 1355497 INFO (TEST-DirectUpdateHandlerTest.testPrepareCommit-seed#[1D1CCC4D13A9E042]) [ ] o.a.s.s.SolrIndexSearcher Opening Searcher@322a37[collection1] main
[junit4] 2> 1355497 INFO (TEST-DirectUpdateHandlerTest.testPrepareCommit-seed#[1D1CCC4D13A9E042]) [ ] o.a.s.u.DirectUpdateHandler2 end_commit_flush
[junit4] 2> 1355500 INFO (searcherExecutor-4825-thread-1) [ ] o.a.s.c.SolrCore [collection1] Registered new searcher Searcher@322a37[collection1] main{ExitableDirectoryReader(UninvertingDirectoryReader())}
[junit4] 2> 1355500 INFO (TEST-DirectUpdateHandlerTest.testPrepareCommit-seed#[1D1CCC4D13A9E042]) [ ] o.a.s.u.p.LogUpdateProcessorFactory [collection1] webapp=null path=null params={}{commit=} 0 11
[junit4] 2> 1355501 INFO (TEST-DirectUpdateHandlerTest.testPrepareCommit-seed#[1D1CCC4D13A9E042]) [ ] o.a.s.u.p.LogUpdateProcessorFactory [collection1] webapp=null path=null params={}{add=[999]} 0 0
[junit4] 2> 1355502 INFO (TEST-DirectUpdateHandlerTest.testPrepareCommit-seed#[1D1CCC4D13A9E042]) [ ] o.a.s.u.DirectUpdateHandler2 start commit{,optimize=true,openSearcher=true,waitSearcher=true,expungeDeletes=false,softCommit=false,prepareCommit=false}
[junit4] 2> 1355502 WARN (TEST-DirectUpdateHandlerTest.testPrepareCommit-seed#[1D1CCC4D13A9E042]) [ ] o.a.s.u.DirectUpdateHandler2 Starting optimize... Reading and rewriting the entire index! Use with care.
[junit4] 2> 1355610 INFO (TEST-DirectUpdateHandlerTest.testPrepareCommit-seed#[1D1CCC4D13A9E042]) [ ] o.a.s.c.SolrDeletionPolicy SolrDeletionPolicy.onCommit: commits: num=2
[junit4] 2> commit{dir=MockDirectoryWrapper(SimpleFSDirectory@/home/jenkins/workspace/Lucene-Solr-5.5-Linux@7/solr/build/solr-core/test/J1/temp/solr.update.DirectUpdateHandlerTest_1D1CCC4D13A9E042-001/init-core-data-001/index lockFactory=org.apache.lucene.store.SingleInstanceLockFactory@416251),segFN=segments_a,generation=10}
[junit4] 2> commit{dir=MockDirectoryWrapper(SimpleFSDirectory@/home/jenkins/workspace/Lucene-Solr-5.5-Linux@7/solr/build/solr-core/test/J1/temp/solr.update.DirectUpdateHandlerTest_1D1CCC4D13A9E042-001/init-core-data-001/index lockFactory=org.apache.lucene.store.SingleInstanceLockFactory@416251),segFN=segments_b,generation=11}
[junit4] 2> 1355610 INFO (TEST-DirectUpdateHandlerTest.testPrepareCommit-seed#[1D1CCC4D13A9E042]) [ ] o.a.s.c.SolrDeletionPolicy newest commit generation = 11
[junit4] 2> 1355612 INFO (TEST-DirectUpdateHandlerTest.testPrepareCommit-seed#[1D1CCC4D13A9E042]) [ ] o.a.s.s.SolrIndexSearcher Opening Searcher@1be46d8[collection1] main
[junit4] 2> 1355612 INFO (TEST-DirectUpdateHandlerTest.testPrepareCommit-seed#[1D1CCC4D13A9E042]) [ ] o.a.s.u.DirectUpdateHandler2 end_commit_flush
[junit4] 2> 1355615 INFO (searcherExecutor-4825-thread-1) [ ] o.a.s.c.SolrCore [collection1] Registered new searcher Searcher@1be46d8[collection1] main{ExitableDirectoryReader(UninvertingDirectoryReader(Uninverting(_4(5.5.0):C1)))}
[junit4] 2> 1355615 INFO (TEST-DirectUpdateHandlerTest.testPrepareCommit-seed#[1D1CCC4D13A9E042]) [ ] o.a.s.u.p.LogUpdateProcessorFactory [collection1] webapp=null path=null params={}{optimize=} 0 113
[junit4] 2> 1355616 INFO (TEST-DirectUpdateHandlerTest.testPrepareCommit-seed#[1D1CCC4D13A9E042]) [ ] o.a.s.u.DirectUpdateHandler2 start commit{,optimize=false,openSearcher=true,waitSearcher=true,expungeDeletes=false,softCommit=false,prepareCommit=false}
[junit4] 2> 1355616 INFO (TEST-DirectUpdateHandlerTest.testPrepareCommit-seed#[1D1CCC4D13A9E042]) [ ] o.a.s.u.DirectUpdateHandler2 No uncommitted changes. Skipping IW.commit.
[junit4] 2> 1355616 INFO (TEST-DirectUpdateHandlerTest.testPrepareCommit-seed#[1D1CCC4D13A9E042]) [ ] o.a.s.c.SolrCore SolrIndexSearcher has not changed - not re-opening: org.apache.solr.search.SolrIndexSearcher
[junit4] 2> 1355616 INFO (TEST-DirectUpdateHandlerTest.testPrepareCommit-seed#[1D1CCC4D13A9E042]) [ ] o.a.s.u.DirectUpdateHandler2 end_commit_flush
[junit4] 2> 1355616 INFO (TEST-DirectUpdateHandlerTest.testPrepareCommit-seed#[1D1CCC4D13A9E042]) [ ] o.a.s.u.p.LogUpdateProcessorFactory [collection1] webapp=null path=null params={}{commit=} 0 0
[junit4] 2> 1355616 INFO (TEST-DirectUpdateHandlerTest.testPrepareCommit-seed#[1D1CCC4D13A9E042]) [ ] o.a.s.u.DirectUpdateHandlerTest FILES before addDoc=[_4_Asserting_0.tim, _4_Asserting_0.doc, _4_Asserting_0.tip, _4.nvm, _4.nvd, _3.fdx, _4.fnm, _3.fdt, segments_b, _4.si, _4.fdx, _4.fdt]
[junit4] 2> 1355617 INFO (TEST-DirectUpdateHandlerTest.testPrepareCommit-seed#[1D1CCC4D13A9E042]) [ ] o.a.s.u.p.LogUpdateProcessorFactory [collection1] webapp=null path=null params={}{add=[1]} 0 0
[junit4] 2> 1355618 INFO (TEST-DirectUpdateHandlerTest.testPrepareCommit-seed#[1D1CCC4D13A9E042]) [ ] o.a.s.u.DirectUpdateHandlerTest FILES before prepareCommit=[_4_Asserting_0.tim, _4_Asserting_0.doc, _5.fdx, _4_Asserting_0.tip, _4.nvm, _4.nvd, _3.fdx, _4.fnm, _5.fdt, _3.fdt, segments_b, _4.si, _4.fdx, _4.fdt]
[junit4] 2> 1355618 INFO (TEST-DirectUpdateHandlerTest.testPrepareCommit-seed#[1D1CCC4D13A9E042]) [ ] o.a.s.u.DirectUpdateHandler2 start commit{,optimize=false,openSearcher=true,waitSearcher=true,expungeDeletes=false,softCommit=false,prepareCommit=true}
[junit4] 2> 1355726 INFO (TEST-DirectUpdateHandlerTest.testPrepareCommit-seed#[1D1CCC4D13A9E042]) [ ] o.a.s.u.DirectUpdateHandler2 end_prepareCommit
[junit4] 2> 1355726 INFO (TEST-DirectUpdateHandlerTest.testPrepareCommit-seed#[1D1CCC4D13A9E042]) [ ] o.a.s.u.p.LogUpdateProcessorFactory [collection1] webapp=null path=null params={prepareCommit=true&wt=json&indent=true}{commit=} 0 108
[junit4] 2> 1355726 INFO (TEST-DirectUpdateHandlerTest.testPrepareCommit-seed#[1D1CCC4D13A9E042]) [ ] o.a.s.u.DirectUpdateHandlerTest FILES after prepareCommit=[_4_Asserting_0.tim, _5.nvm, pending_segments_c, _4_Asserting_0.doc, _5.fdx, _4_Asserting_0.tip, _5_Asserting_0.tim, _4.nvm, _4.nvd, _3.fdx, _5_Asserting_0.doc, _4.fnm, _5.fdt, _5_Asserting_0.tip, _3.fdt, segments_b, _5.si, _4.si, _5.nvd, _4.fdx, _4.fdt, _5.fnm]
[junit4] 2> 1355726 INFO (TEST-DirectUpdateHandlerTest.testPrepareCommit-seed#[1D1CCC4D13A9E042]) [ ] o.a.s.c.S.Request [collection1] webapp=null path=null params={q=id:1&wt=xml} hits=0 status=0 QTime=0
[junit4] 2> 1355727 INFO (TEST-DirectUpdateHandlerTest.testPrepareCommit-seed#[1D1CCC4D13A9E042]) [ ] o.a.s.u.DirectUpdateHandler2 start rollback{}
[junit4] 2> 1355727 INFO (TEST-DirectUpdateHandlerTest.testPrepareCommit-seed#[1D1CCC4D13A9E042]) [ ] o.a.s.u.DefaultSolrCoreState Rollback old IndexWriter... core=collection1
[junit4] 2> 1355728 INFO (TEST-DirectUpdateHandlerTest.testPrepareCommit-seed#[1D1CCC4D13A9E042]) [ ] o.a.s.u.RandomMergePolicy RandomMergePolicy wrapping class org.apache.lucene.index.MockRandomMergePolicy: org.apache.lucene.index.MockRandomMergePolicy@1a00bff
[junit4] 2> 1355729 INFO (TEST-DirectUpdateHandlerTest.testPrepareCommit-seed#[1D1CCC4D13A9E042]) [ ] o.a.s.c.SolrDeletionPolicy SolrDeletionPolicy.onInit: commits: num=1
[junit4] 2> commit{dir=MockDirectoryWrapper(SimpleFSDirectory@/home/jenkins/workspace/Lucene-Solr-5.5-Linux@7/solr/build/solr-core/test/J1/temp/solr.update.DirectUpdateHandlerTest_1D1CCC4D13A9E042-001/init-core-data-001/index lockFactory=org.apache.lucene.store.SingleInstanceLockFactory@416251),segFN=segments_b,generation=11}
[junit4] 2> 1355729 INFO (TEST-DirectUpdateHandlerTest.testPrepareCommit-seed#[1D1CCC4D13A9E042]) [ ] o.a.s.c.SolrDeletionPolicy newest commit generation = 11
[junit4] 2> 1355729 INFO (TEST-DirectUpdateHandlerTest.testPrepareCommit-seed#[1D1CCC4D13A9E042]) [ ] o.a.s.u.DefaultSolrCoreState New IndexWriter is ready to be used.
[junit4] 2> 1355729 INFO (TEST-DirectUpdateHandlerTest.testPrepareCommit-seed#[1D1CCC4D13A9E042]) [ ] o.a.s.u.DirectUpdateHandler2 end_rollback
[junit4] 2> 1355730 INFO (TEST-DirectUpdateHandlerTest.testPrepareCommit-seed#[1D1CCC4D13A9E042]) [ ] o.a.s.u.p.LogUpdateProcessorFactory [collection1] webapp=null path=null params={rollback=true&wt=json&indent=true}{rollback=} 0 2
[junit4] 2> 1355730 INFO (TEST-DirectUpdateHandlerTest.testPrepareCommit-seed#[1D1CCC4D13A9E042]) [ ] o.a.s.u.DirectUpdateHandler2 start commit{,optimize=false,openSearcher=true,waitSearcher=true,expungeDeletes=false,softCommit=false,prepareCommit=false}
[junit4] 2> 1355730 INFO (TEST-DirectUpdateHandlerTest.testPrepareCommit-seed#[1D1CCC4D13A9E042]) [ ] o.a.s.u.DirectUpdateHandler2 No uncommitted changes. Skipping IW.commit.
[junit4] 2> 1355731 INFO (TEST-DirectUpdateHandlerTest.testPrepareCommit-seed#[1D1CCC4D13A9E042]) [ ] o.a.s.s.SolrIndexSearcher Opening Searcher@16b62b4[collection1] main
[junit4] 2> 1355732 INFO (TEST-DirectUpdateHandlerTest.testPrepareCommit-seed#[1D1CCC4D13A9E042]) [ ] o.a.s.u.DirectUpdateHandler2 end_commit_flush
[junit4] 2> 1355734 INFO (searcherExecutor-4825-thread-1) [ ] o.a.s.c.SolrCore [collection1] Registered new searcher Searcher@16b62b4[collection1] main{ExitableDirectoryReader(UninvertingDirectoryReader(Uninverting(_4(5.5.0):C1)))}
[junit4] 2> 1355734 INFO (TEST-DirectUpdateHandlerTest.testPrepareCommit-seed#[1D1CCC4D13A9E042]) [ ] o.a.s.u.p.LogUpdateProcessorFactory [collection1] webapp=null path=null params={}{commit=} 0 4
[junit4] 2> 1355735 INFO (TEST-DirectUpdateHandlerTest.testPrepareCommit-seed#[1D1CCC4D13A9E042]) [ ] o.a.s.c.S.Request [collection1] webapp=null path=null params={q=id:1&wt=xml} hits=0 status=0 QTime=0
[junit4] 2> 1355736 INFO (TEST-DirectUpdateHandlerTest.testPrepareCommit-seed#[1D1CCC4D13A9E042]) [ ] o.a.s.u.p.LogUpdateProcessorFactory [collection1] webapp=null path=null params={}{add=[1]} 0 0
[junit4] 2> 1355736 INFO (TEST-DirectUpdateHandlerTest.testPrepareCommit-seed#[1D1CCC4D13A9E042]) [ ] o.a.s.u.DirectUpdateHandler2 start commit{,optimize=false,openSearcher=true,waitSearcher=true,expungeDeletes=false,softCommit=false,prepareCommit=true}
[junit4] 2> 1355879 INFO (TEST-DirectUpdateHandlerTest.testPrepareCommit-seed#[1D1CCC4D13A9E042]) [ ] o.a.s.u.DirectUpdateHandler2 end_prepareCommit
[junit4] 2> 1355879 INFO (TEST-DirectUpdateHandlerTest.testPrepareCommit-seed#[1D1CCC4D13A9E042]) [ ] o.a.s.u.p.LogUpdateProcessorFactory [collection1] webapp=null path=null params={prepareCommit=true&wt=json&indent=true}{commit=} 0 143
[junit4] 2> 1355880 INFO (TEST-DirectUpdateHandlerTest.testPrepareCommit-seed#[1D1CCC4D13A9E042]) [ ] o.a.s.c.S.Request [collection1] webapp=null path=null params={q=id:1&wt=xml} hits=0 status=0 QTime=0
[junit4] 2> 1355880 INFO (TEST-DirectUpdateHandlerTest.testPrepareCommit-seed#[1D1CCC4D13A9E042]) [ ] o.a.s.u.DirectUpdateHandler2 start commit{,optimize=false,openSearcher=true,waitSearcher=true,expungeDeletes=false,softCommit=false,prepareCommit=false}
[junit4] 2> 1355890 INFO (TEST-DirectUpdateHandlerTest.testPrepareCommit-seed#[1D1CCC4D13A9E042]) [ ] o.a.s.c.SolrDeletionPolicy SolrDeletionPolicy.onCommit: commits: num=2
[junit4] 2> commit{dir=MockDirectoryWrapper(SimpleFSDirectory@/home/jenkins/workspace/Lucene-Solr-5.5-Linux@7/solr/build/solr-core/test/J1/temp/solr.update.DirectUpdateHandlerTest_1D1CCC4D13A9E042-001/init-core-data-001/index lockFactory=org.apache.lucene.store.SingleInstanceLockFactory@416251),segFN=segments_b,generation=11}
[junit4] 2> commit{dir=MockDirectoryWrapper(SimpleFSDirectory@/home/jenkins/workspace/Lucene-Solr-5.5-Linux@7/solr/build/solr-core/test/J1/temp/solr.update.DirectUpdateHandlerTest_1D1CCC4D13A9E042-001/init-core-data-001/index lockFactory=org.apache.lucene.store.SingleInstanceLockFactory@416251),segFN=segments_c,generation=12}
[junit4] 2> 1355890 INFO (TEST-DirectUpdateHandlerTest.testPrepareCommit-seed#[1D1CCC4D13A9E042]) [ ] o.a.s.c.SolrDeletionPolicy newest commit generation = 12
[junit4] 2> 1355891 INFO (TEST-DirectUpdateHandlerTest.testPrepareCommit-seed#[1D1CCC4D13A9E042]) [ ] o.a.s.s.SolrIndexSearcher Opening Searcher@1579f0f[collection1] main
[junit4] 2> 1355891 INFO (TEST-DirectUpdateHandlerTest.testPrepareCommit-seed#[1D1CCC4D13A9E042]) [ ] o.a.s.u.DirectUpdateHandler2 end_commit_flush
[junit4] 2> 1355894 INFO (searcherExecutor-4825-thread-1) [ ] o.a.s.c.SolrCore [collection1] Registered new
[...truncated too long message...]
eletes=false,softCommit=false,prepareCommit=false}
[junit4] 2> 1369204 INFO (TEST-DirectUpdateHandlerTest.testAddRollback-seed#[1D1CCC4D13A9E042]) [ ] o.a.s.c.SolrDeletionPolicy SolrDeletionPolicy.onCommit: commits: num=2
[junit4] 2> commit{dir=MockDirectoryWrapper(SimpleFSDirectory@/home/jenkins/workspace/Lucene-Solr-5.5-Linux@7/solr/build/solr-core/test/J1/temp/solr.update.DirectUpdateHandlerTest_1D1CCC4D13A9E042-001/init-core-data-001/index lockFactory=org.apache.lucene.store.SingleInstanceLockFactory@a2f4ef),segFN=segments_i,generation=18}
[junit4] 2> commit{dir=MockDirectoryWrapper(SimpleFSDirectory@/home/jenkins/workspace/Lucene-Solr-5.5-Linux@7/solr/build/solr-core/test/J1/temp/solr.update.DirectUpdateHandlerTest_1D1CCC4D13A9E042-001/init-core-data-001/index lockFactory=org.apache.lucene.store.SingleInstanceLockFactory@a2f4ef),segFN=segments_j,generation=19}
[junit4] 2> 1369204 INFO (TEST-DirectUpdateHandlerTest.testAddRollback-seed#[1D1CCC4D13A9E042]) [ ] o.a.s.c.SolrDeletionPolicy newest commit generation = 19
[junit4] 2> 1369207 INFO (TEST-DirectUpdateHandlerTest.testAddRollback-seed#[1D1CCC4D13A9E042]) [ ] o.a.s.s.SolrIndexSearcher Opening Searcher@ee4d1[collection1] main
[junit4] 2> 1369207 INFO (TEST-DirectUpdateHandlerTest.testAddRollback-seed#[1D1CCC4D13A9E042]) [ ] o.a.s.u.DirectUpdateHandler2 end_commit_flush
[junit4] 2> 1369212 INFO (searcherExecutor-4837-thread-1) [ ] o.a.s.c.SolrCore [collection1] Registered new searcher Searcher@ee4d1[collection1] main{ExitableDirectoryReader(UninvertingDirectoryReader(Uninverting(_9(5.5.0):C1) Uninverting(_a(5.5.0):C1)))}
[junit4] 2> 1369212 INFO (TEST-DirectUpdateHandlerTest.testAddRollback-seed#[1D1CCC4D13A9E042]) [ ] o.a.s.u.p.LogUpdateProcessorFactory [collection1] webapp=null path=null params={}{commit=} 0 99
[junit4] 2> 1369213 INFO (TEST-DirectUpdateHandlerTest.testAddRollback-seed#[1D1CCC4D13A9E042]) [ ] o.a.s.c.S.Request [collection1] webapp=null path=null params={q=id:ZZZ&wt=xml} hits=1 status=0 QTime=0
[junit4] 2> 1369214 INFO (TEST-DirectUpdateHandlerTest.testAddRollback-seed#[1D1CCC4D13A9E042]) [ ] o.a.s.SolrTestCaseJ4 ###Ending testAddRollback
[junit4] 2> 1369215 INFO (SUITE-DirectUpdateHandlerTest-seed#[1D1CCC4D13A9E042]-worker) [ ] o.a.s.SolrTestCaseJ4 ###deleteCore
[junit4] 2> 1369215 INFO (SUITE-DirectUpdateHandlerTest-seed#[1D1CCC4D13A9E042]-worker) [ ] o.a.s.c.CoreContainer Shutting down CoreContainer instance=24744562
[junit4] 2> 1369215 INFO (coreCloseExecutor-4841-thread-1) [ x:collection1] o.a.s.c.SolrCore [collection1] CLOSING SolrCore org.apache.solr.core.SolrCore@13339d
[junit4] 2> 1369215 INFO (coreCloseExecutor-4841-thread-1) [ x:collection1] o.a.s.u.DirectUpdateHandler2 closing DirectUpdateHandler2{commits=2,autocommits=0,soft autocommits=0,optimizes=0,rollbacks=1,expungeDeletes=0,docsPending=0,adds=0,deletesById=0,deletesByQuery=0,errors=0,cumulative_adds=2,cumulative_deletesById=0,cumulative_deletesByQuery=0,cumulative_errors=0}
[junit4] 2> 1369216 INFO (coreCloseExecutor-4841-thread-1) [ x:collection1] o.a.s.u.SolrCoreState Closing SolrCoreState
[junit4] 2> 1369216 INFO (coreCloseExecutor-4841-thread-1) [ x:collection1] o.a.s.u.DefaultSolrCoreState SolrCoreState ref count has reached 0 - closing IndexWriter
[junit4] 2> 1369216 INFO (coreCloseExecutor-4841-thread-1) [ x:collection1] o.a.s.u.DefaultSolrCoreState closing IndexWriter with IndexWriterCloser
[junit4] 2> 1369217 INFO (coreCloseExecutor-4841-thread-1) [ x:collection1] o.a.s.c.SolrCore [collection1] Closing main searcher on request.
[junit4] 2> 1369245 INFO (coreCloseExecutor-4841-thread-1) [ x:collection1] o.a.s.c.CachingDirectoryFactory Closing MockFSDirectoryFactory - 2 directories currently being tracked
[junit4] 2> 1369245 INFO (coreCloseExecutor-4841-thread-1) [ x:collection1] o.a.s.c.CachingDirectoryFactory looking to close /home/jenkins/workspace/Lucene-Solr-5.5-Linux@7/solr/build/solr-core/test/J1/temp/solr.update.DirectUpdateHandlerTest_1D1CCC4D13A9E042-001/init-core-data-001 [CachedDir<<refCount=0;path=/home/jenkins/workspace/Lucene-Solr-5.5-Linux@7/solr/build/solr-core/test/J1/temp/solr.update.DirectUpdateHandlerTest_1D1CCC4D13A9E042-001/init-core-data-001;done=false>>]
[junit4] 2> 1369245 INFO (coreCloseExecutor-4841-thread-1) [ x:collection1] o.a.s.c.CachingDirectoryFactory Closing directory: /home/jenkins/workspace/Lucene-Solr-5.5-Linux@7/solr/build/solr-core/test/J1/temp/solr.update.DirectUpdateHandlerTest_1D1CCC4D13A9E042-001/init-core-data-001
[junit4] 2> 1369246 INFO (coreCloseExecutor-4841-thread-1) [ x:collection1] o.a.s.c.CachingDirectoryFactory looking to close /home/jenkins/workspace/Lucene-Solr-5.5-Linux@7/solr/build/solr-core/test/J1/temp/solr.update.DirectUpdateHandlerTest_1D1CCC4D13A9E042-001/init-core-data-001/index [CachedDir<<refCount=0;path=/home/jenkins/workspace/Lucene-Solr-5.5-Linux@7/solr/build/solr-core/test/J1/temp/solr.update.DirectUpdateHandlerTest_1D1CCC4D13A9E042-001/init-core-data-001/index;done=false>>]
[junit4] 2> 1369246 INFO (coreCloseExecutor-4841-thread-1) [ x:collection1] o.a.s.c.CachingDirectoryFactory Closing directory: /home/jenkins/workspace/Lucene-Solr-5.5-Linux@7/solr/build/solr-core/test/J1/temp/solr.update.DirectUpdateHandlerTest_1D1CCC4D13A9E042-001/init-core-data-001/index
[junit4] 2> NOTE: leaving temporary files on disk at: /home/jenkins/workspace/Lucene-Solr-5.5-Linux@7/solr/build/solr-core/test/J1/temp/solr.update.DirectUpdateHandlerTest_1D1CCC4D13A9E042-001
[junit4] 2> NOTE: test params are: codec=Asserting(Lucene54), sim=DefaultSimilarity, locale=he, timezone=America/St_Lucia
[junit4] 2> NOTE: Linux 4.2.0-35-generic i386/Oracle Corporation 1.8.0_72 (32-bit)/cpus=12,threads=1,free=178024256,total=536870912
[junit4] 2> NOTE: All tests run in this JVM: [TestQueryUtils, TestBinaryResponseWriter, TestFileDictionaryLookup, ZkCLITest, TestDownShardTolerantSearch, TestReloadDeadlock, TestLMJelinekMercerSimilarityFactory, VMParamsZkACLAndCredentialsProvidersTest, MinimalSchemaTest, TestFieldTypeCollectionResource, DateRangeFieldTest, TestMacros, TestRandomRequestDistribution, SecurityConfHandlerTest, DOMUtilTest, LeaderInitiatedRecoveryOnCommitTest, SortByFunctionTest, HighlighterTest, TestPivotHelperCode, TermsComponentTest, UpdateRequestProcessorFactoryTest, TestRuleBasedAuthorizationPlugin, TestCloudManagedSchemaConcurrent, SSLMigrationTest, DistribJoinFromCollectionTest, TestLeaderInitiatedRecoveryThread, HdfsNNFailoverTest, SpatialFilterTest, AsyncMigrateRouteKeyTest, TestSortByMinMaxFunction, SuggestComponentTest, TestManagedSchemaFieldResource, TestManagedSynonymFilterFactory, ClusterStateUpdateTest, TestQuerySenderNoQuery, TestQueryTypes, NotRequiredUniqueKeyTest, ShardRoutingTest, TestStressVersions, TestCoreContainer, TestExceedMaxTermLength, TestManagedSchema, DeleteStatusTest, TestBM25SimilarityFactory, RuleEngineTest, SparseHLLTest, TestSolrCoreProperties, TestSystemIdResolver, FastVectorHighlighterTest, TestSimpleTrackingShardHandler, AddSchemaFieldsUpdateProcessorFactoryTest, SimplePostToolTest, TimeZoneUtilsTest, SoftAutoCommitTest, SolrCmdDistributorTest, TestRestManager, FacetPivotSmallTest, SimpleMLTQParserTest, TestClusterStateMutator, TestSolrCloudWithKerberosAlt, LoggingHandlerTest, ZkControllerTest, ChaosMonkeySafeLeaderTest, PreAnalyzedUpdateProcessorTest, NumericFieldsTest, OverseerCollectionConfigSetProcessorTest, CreateCollectionCleanupTest, TestTrie, MoreLikeThisHandlerTest, MultiThreadedOCPTest, IndexBasedSpellCheckerTest, SpellCheckCollatorTest, SchemaVersionSpecificBehaviorTest, DistributedFacetPivotSmallAdvancedTest, TestCustomSort, WordBreakSolrSpellCheckerTest, TestDFRSimilarityFactory, DeleteLastCustomShardedReplicaTest, SharedFSAutoReplicaFailoverTest, TestReplicationHandlerBackup, AliasIntegrationTest, TestRawResponseWriter, ConcurrentDeleteAndCreateCollectionTest, TestSolrCLIRunExample, UniqFieldsUpdateProcessorFactoryTest, ShardRoutingCustomTest, TestSolrQueryParserResource, ForceLeaderTest, SolrCloudExampleTest, HdfsChaosMonkeyNothingIsSafeTest, TestNRTOpen, TestCloudDeleteByQuery, TestWordDelimiterFilterFactory, UnloadDistributedZkTest, OpenCloseCoreStressTest, BasicZkTest, TestReplicationHandler, LeaderElectionTest, ZkSolrClientTest, TestZkChroot, TestDistributedSearch, TestHashPartitioner, TestRealTimeGet, DistributedTermsComponentTest, SpellCheckComponentTest, TestFunctionQuery, BasicFunctionalityTest, DirectUpdateHandlerTest]
[junit4] Completed [321/572 (1!)] on J1 in 15.33s, 7 tests, 1 failure <<< FAILURES!
[...truncated 786 lines...]
BUILD FAILED
/home/jenkins/workspace/Lucene-Solr-5.5-Linux@7/build.xml:750: The following error occurred while executing this line:
/home/jenkins/workspace/Lucene-Solr-5.5-Linux@7/build.xml:694: The following error occurred while executing this line:
/home/jenkins/workspace/Lucene-Solr-5.5-Linux@7/build.xml:59: The following error occurred while executing this line:
/home/jenkins/workspace/Lucene-Solr-5.5-Linux@7/solr/build.xml:233: The following error occurred while executing this line:
/home/jenkins/workspace/Lucene-Solr-5.5-Linux@7/solr/common-build.xml:534: The following error occurred while executing this line:
/home/jenkins/workspace/Lucene-Solr-5.5-Linux@7/lucene/common-build.xml:1477: The following error occurred while executing this line:
/home/jenkins/workspace/Lucene-Solr-5.5-Linux@7/lucene/common-build.xml:1033: There were test failures: 572 suites (7 ignored), 2290 tests, 1 failure, 85 ignored (40 assumptions) [seed: 1D1CCC4D13A9E042]
Total time: 58 minutes 8 seconds
Build step 'Invoke Ant' marked build as failure
Archiving artifacts
[WARNINGS] Skipping publisher since build result is FAILURE
Recording test results
Email was triggered for: Failure - Any
Sending email for trigger: Failure - Any