You are viewing a plain text version of this content. The canonical link for it is here.
Posted to builds@lucene.apache.org by Policeman Jenkins Server via builds <bu...@lucene.apache.org> on 2026/10/18 21:17:00 UTC
[JENKINS-EA] Lucene-nightly-main-Linux (64bit/hotspot/jdk-27-ea+32) - Build # 2140 - Unstable!
Build: https://jenkins.thetaphi.de/job/Lucene-nightly-main-Linux/2140/
Java: 64bit/hotspot/jdk-27-ea+32 -XX:+UseCompressedOops -XX:+UseParallelGC
1 tests failed.
FAILED: org.apache.lucene.index.TestCheckIndex.testCorruptSegmentInfoNamesTheSegment
Error Message:
java.lang.AssertionError: truncate-si: java.io.EOFException
Stack Trace:
java.lang.AssertionError: truncate-si: java.io.EOFException
at __randomizedtesting.SeedInfo.seed([20C407D19CCBCB53:A94F9C9BFADECBA0]:0)
at org.junit.Assert.fail(Assert.java:89)
at org.junit.Assert.assertTrue(Assert.java:42)
at org.apache.lucene.index.TestCheckIndex.testCorruptSegmentInfoNamesTheSegment(TestCheckIndex.java:345)