You are viewing a plain text version of this content. The canonical link for it is here.
Posted to builds@cassandra.apache.org by Apache Jenkins Server <je...@builds.apache.org> on 2023/08/07 16:57:25 UTC

Build complete: Cassandra-trunk #1661 [UNSTABLE] d24baecac986e90bbbb5b6281a256f41c0a27d3f

-------------------------------------------------------------------------------
Build Cassandra-trunk #1661 Still Unstable
URL: https://ci-cassandra.apache.org/job/Cassandra-trunk/1661/
-------------------------------------------------------------------------------
Changes:
[Stefan Miklosovic] Simplify pylib/cqlshlib/helptopics.py using associative array


-------------------------------------------------------------------------------
Failed Tests:
24 tests failed.
FAILED:  dtest-large.repair_tests.repair_test.TestRepairDataSystemTable.test_repair_table
FAILED:  dtest-novnode.transient_replication_test.TestTransientReplicationRepairStreamEntireSSTable.test_optimized_primary_range_repair_with_lcs
FAILED:  dtest-novnode.materialized_views_test.TestMaterializedViews.test_no_base_column_in_view_pk_complex_timestamp_with_flush
FAILED:  dtest-offheap.disk_balance_test.TestDiskBalance.test_disk_balance_after_joining_ring_stcs
FAILED:  dtest-offheap.replace_address_test.TestReplaceAddress.test_fail_when_seed
FAILED:  dtest.repair_tests.incremental_repair_test.TestIncRepair.test_multiple_full_repairs_lcs
FAILED:  dtest-upgrade.upgrade_tests.cql_tests.TestCQLNodes3RF3_Upgrade_indev_4_0_x_To_indev_trunk.test_negative_timestamp
FAILED:  dtest-upgrade.upgrade_tests.cql_tests.TestCQLNodes3RF3_Upgrade_indev_4_0_x_To_indev_trunk.test_negative_timestamp
FAILED:  dtest-upgrade.upgrade_tests.cql_tests.TestCQLNodes3RF3_Upgrade_current_4_0_x_To_indev_trunk.test_negative_timestamp
FAILED:  dtest-upgrade.upgrade_tests.cql_tests.TestCQLNodes3RF3_Upgrade_current_4_0_x_To_indev_trunk.test_negative_timestamp
FAILED:  dtest-upgrade.upgrade_tests.cql_tests.TestCQLNodes2RF1_Upgrade_indev_4_1_x_To_indev_trunk.test_negative_timestamp
FAILED:  dtest-upgrade.upgrade_tests.cql_tests.TestCQLNodes2RF1_Upgrade_indev_4_1_x_To_indev_trunk.test_negative_timestamp
FAILED:  dtest-upgrade.upgrade_tests.cql_tests.TestCQLNodes2RF1_Upgrade_current_4_0_x_To_indev_trunk.test_negative_timestamp
FAILED:  dtest-upgrade.upgrade_tests.cql_tests.TestCQLNodes2RF1_Upgrade_current_4_0_x_To_indev_trunk.test_negative_timestamp
FAILED:  dtest-upgrade.upgrade_tests.cql_tests.TestCQLNodes3RF3_Upgrade_current_4_1_x_To_indev_trunk.test_negative_timestamp
FAILED:  dtest-upgrade.upgrade_tests.cql_tests.TestCQLNodes3RF3_Upgrade_current_4_1_x_To_indev_trunk.test_negative_timestamp
FAILED:  dtest-upgrade.upgrade_tests.cql_tests.TestCQLNodes2RF1_Upgrade_current_4_1_x_To_indev_trunk.test_negative_timestamp
FAILED:  dtest-upgrade.upgrade_tests.cql_tests.TestCQLNodes2RF1_Upgrade_current_4_1_x_To_indev_trunk.test_negative_timestamp
FAILED:  dtest-upgrade.upgrade_tests.cql_tests.cls.test_negative_timestamp
FAILED:  dtest-upgrade.upgrade_tests.cql_tests.cls.test_negative_timestamp
FAILED:  dtest-upgrade.upgrade_tests.cql_tests.TestCQLNodes2RF1_Upgrade_indev_4_0_x_To_indev_trunk.test_negative_timestamp
FAILED:  dtest-upgrade.upgrade_tests.cql_tests.TestCQLNodes2RF1_Upgrade_indev_4_0_x_To_indev_trunk.test_negative_timestamp
FAILED:  dtest-upgrade.upgrade_tests.cql_tests.TestCQLNodes3RF3_Upgrade_indev_4_1_x_To_indev_trunk.test_negative_timestamp
FAILED:  dtest-upgrade.upgrade_tests.cql_tests.TestCQLNodes3RF3_Upgrade_indev_4_1_x_To_indev_trunk.test_negative_timestamp

-------------------------------------------------------------------------------
For complete test report and logs see https://nightlies.apache.org/cassandra/Cassandra-trunk/1661/