You are viewing a plain text version of this content. The canonical link for it is here.
Posted to notifications@jclouds.apache.org by je...@cloudbees.com on 2014/02/28 02:16:23 UTC

Build failed in Jenkins: jclouds-chef-1.6.x-branch #70

See <https://jclouds.ci.cloudbees.com/job/jclouds-chef-1.6.x-branch/70/>

------------------------------------------
[...truncated 2420 lines...]
-------------------------------------------------------
 T E S T S
-------------------------------------------------------

Results :

Tests run: 0, Failures: 0, Errors: 0, Skipped: 0

[JENKINS] Recording test results[INFO] 
[INFO] --- maven-install-plugin:2.3.1:install (default-install) @ chef-labs-project ---
[INFO] Installing <https://jclouds.ci.cloudbees.com/job/jclouds-chef-1.6.x-branch/ws/labs/pom.xml> to <https://jclouds.ci.cloudbees.com/job/jclouds-chef-1.6.x-branch/ws/.repository/org/apache/jclouds/labs/chef-labs-project/1.6.4-SNAPSHOT/chef-labs-project-1.6.4-SNAPSHOT.pom>

[INFO] Installing <https://jclouds.ci.cloudbees.com/job/jclouds-chef-1.6.x-branch/ws/labs/target/chef-labs-project-1.6.4-SNAPSHOT-tests.jar> to <https://jclouds.ci.cloudbees.com/job/jclouds-chef-1.6.x-branch/ws/.repository/org/apache/jclouds/labs/chef-labs-project/1.6.4-SNAPSHOT/chef-labs-project-1.6.4-SNAPSHOT-tests.jar>
[INFO] 
[INFO] --- maven-deploy-plugin:2.7:deploy (default-deploy) @ chef-labs-project ---
Downloading: https://repository.apache.org/content/repositories/snapshots/org/apache/jclouds/labs/chef-labs-project/1.6.4-SNAPSHOT/maven-metadata.xml
Downloaded: https://repository.apache.org/content/repositories/snapshots/org/apache/jclouds/labs/chef-labs-project/1.6.4-SNAPSHOT/maven-metadata.xml (832 B at 1.7 KB/sec)
Uploading: https://repository.apache.org/content/repositories/snapshots/org/apache/jclouds/labs/chef-labs-project/1.6.4-SNAPSHOT/chef-labs-project-1.6.4-20140228.011609-20.pom
Uploaded: https://repository.apache.org/content/repositories/snapshots/org/apache/jclouds/labs/chef-labs-project/1.6.4-SNAPSHOT/chef-labs-project-1.6.4-20140228.011609-20.pom (2 KB at 4.6 KB/sec)
Downloading: https://repository.apache.org/content/repositories/snapshots/org/apache/jclouds/labs/chef-labs-project/maven-metadata.xml
Downloaded: https://repository.apache.org/content/repositories/snapshots/org/apache/jclouds/labs/chef-labs-project/maven-metadata.xml (521 B at 1.7 KB/sec)
Uploading: https://repository.apache.org/content/repositories/snapshots/org/apache/jclouds/labs/chef-labs-project/1.6.4-SNAPSHOT/maven-metadata.xml
Uploaded: https://repository.apache.org/content/repositories/snapshots/org/apache/jclouds/labs/chef-labs-project/1.6.4-SNAPSHOT/maven-metadata.xml (832 B at 2.0 KB/sec)
Uploading: https://repository.apache.org/content/repositories/snapshots/org/apache/jclouds/labs/chef-labs-project/maven-metadata.xml
Uploaded: https://repository.apache.org/content/repositories/snapshots/org/apache/jclouds/labs/chef-labs-project/maven-metadata.xml (521 B at 1.5 KB/sec)
Uploading: https://repository.apache.org/content/repositories/snapshots/org/apache/jclouds/labs/chef-labs-project/1.6.4-SNAPSHOT/chef-labs-project-1.6.4-20140228.011609-20-tests.jar
Uploaded: https://repository.apache.org/content/repositories/snapshots/org/apache/jclouds/labs/chef-labs-project/1.6.4-SNAPSHOT/chef-labs-project-1.6.4-20140228.011609-20-tests.jar (3 KB at 6.9 KB/sec)
Uploading: https://repository.apache.org/content/repositories/snapshots/org/apache/jclouds/labs/chef-labs-project/1.6.4-SNAPSHOT/maven-metadata.xml
Uploaded: https://repository.apache.org/content/repositories/snapshots/org/apache/jclouds/labs/chef-labs-project/1.6.4-SNAPSHOT/maven-metadata.xml (832 B at 2.6 KB/sec)
[INFO]                                                                         
[INFO] ------------------------------------------------------------------------
[INFO] Building Apache jclouds Chef 1.6.4-SNAPSHOT
[INFO] ------------------------------------------------------------------------
[INFO] 
[INFO] --- maven-clean-plugin:2.5:clean (default-clean) @ jclouds-chef ---
[INFO] Deleting <https://jclouds.ci.cloudbees.com/job/jclouds-chef-1.6.x-branch/ws/target>
[INFO] 
[INFO] --- maven-remote-resources-plugin:1.4:process (default) @ jclouds-chef ---
[INFO] 
[INFO] --- maven-site-plugin:3.2:attach-descriptor (attach-descriptor) @ jclouds-chef ---
[INFO] 
[INFO] --- apache-rat-plugin:0.8:check (default) @ jclouds-chef ---
[INFO] Exclude: **/src/test/resources/**/*.sh
[INFO] Exclude: **/src/test/resources/**/*.bat
[INFO] Exclude: **/src/test/resources/**/*.cmd
[INFO] Exclude: **/src/test/resources/**/*.txt
[INFO] Exclude: **/src/test/resources/**/*.gz
[INFO] Exclude: **/src/test/resources/**/*.xml
[INFO] Exclude: **/src/test/resources/**/*.json
[INFO] Exclude: **/LICENSE.txt
[INFO] Exclude: **/header.txt
[INFO] Exclude: **/NOTICE.txt
[INFO] Exclude: **/DISCLAIMER
[INFO] Exclude: **/BUILD.txt
[INFO] Exclude: **/CHANGES.txt
[INFO] Exclude: **/README.md
[INFO] Exclude: **/README.txt
[INFO] Exclude: **/DEPENDENCIES
[INFO] Exclude: **/*ProviderMetadata
[INFO] Exclude: **/*ApiMetadata
[INFO] Exclude: **/target/**
[INFO] Exclude: **/test-output/**
[INFO] Exclude: **/bin/**
[INFO] Exclude: **/.settings/**
[INFO] Exclude: **/.classpath
[INFO] Exclude: **/.dir-locals.el
[INFO] Exclude: **/.project
[INFO] Exclude: **/.idea/**
[INFO] Exclude: **/*.iml
[INFO] Exclude: **/*.eml
[INFO] Exclude: **/*.ipr
[INFO] Exclude: **/*.iws
[INFO] Exclude: **/*.DS_STORE
[INFO] Exclude: **/TAGS
[INFO] Exclude: **/.metadata/**
[INFO] Exclude: **/atlassian-ide-plugin.xml
[INFO] Exclude: **/.DS_Store
[INFO] Exclude: .mailmap
[INFO] Exclude: .git/**
[INFO] Exclude: **/.gitignore
[INFO] Exclude: **/.gitattributes
[INFO] Exclude: .repository/**
[INFO] Exclude: gc.log
[INFO] 
[INFO] --- maven-jar-plugin:2.4:test-jar (default) @ jclouds-chef ---
[WARNING] JAR will be empty - no content was marked for inclusion!
[INFO] Building jar: <https://jclouds.ci.cloudbees.com/job/jclouds-chef-1.6.x-branch/ws/target/jclouds-chef-1.6.4-SNAPSHOT-tests.jar>
[INFO] 
[INFO] --- maven-javadoc-plugin:2.8.1:jar (javadoc) @ jclouds-chef ---
[INFO] Not executing Javadoc as the project is not a Java classpath-capable package
[INFO] 
[INFO] --- maven-surefire-plugin:2.12:test (integration) @ jclouds-chef ---
[INFO] No tests to run.
[INFO] Surefire report directory: <https://jclouds.ci.cloudbees.com/job/jclouds-chef-1.6.x-branch/ws/target/surefire-reports>

-------------------------------------------------------
 T E S T S
-------------------------------------------------------

Results :

Tests run: 0, Failures: 0, Errors: 0, Skipped: 0

[INFO] 
[JENKINS] Recording test results
[INFO] --- maven-install-plugin:2.3.1:install (default-install) @ jclouds-chef ---
[INFO] Installing <https://jclouds.ci.cloudbees.com/job/jclouds-chef-1.6.x-branch/ws/pom.xml> to <https://jclouds.ci.cloudbees.com/job/jclouds-chef-1.6.x-branch/ws/.repository/org/apache/jclouds/chef/jclouds-chef/1.6.4-SNAPSHOT/jclouds-chef-1.6.4-SNAPSHOT.pom>
[INFO] Installing <https://jclouds.ci.cloudbees.com/job/jclouds-chef-1.6.x-branch/ws/target/jclouds-chef-1.6.4-SNAPSHOT-tests.jar> to <https://jclouds.ci.cloudbees.com/job/jclouds-chef-1.6.x-branch/ws/.repository/org/apache/jclouds/chef/jclouds-chef/1.6.4-SNAPSHOT/jclouds-chef-1.6.4-SNAPSHOT-tests.jar>
[INFO] 
[INFO] --- maven-deploy-plugin:2.7:deploy (default-deploy) @ jclouds-chef ---
Downloading: https://repository.apache.org/content/repositories/snapshots/org/apache/jclouds/chef/jclouds-chef/1.6.4-SNAPSHOT/maven-metadata.xml
Downloaded: https://repository.apache.org/content/repositories/snapshots/org/apache/jclouds/chef/jclouds-chef/1.6.4-SNAPSHOT/maven-metadata.xml (827 B at 1.9 KB/sec)
Uploading: https://repository.apache.org/content/repositories/snapshots/org/apache/jclouds/chef/jclouds-chef/1.6.4-SNAPSHOT/jclouds-chef-1.6.4-20140228.011615-20.pom
Uploaded: https://repository.apache.org/content/repositories/snapshots/org/apache/jclouds/chef/jclouds-chef/1.6.4-SNAPSHOT/jclouds-chef-1.6.4-20140228.011615-20.pom (5 KB at 13.2 KB/sec)
Downloading: https://repository.apache.org/content/repositories/snapshots/org/apache/jclouds/chef/jclouds-chef/maven-metadata.xml
Downloaded: https://repository.apache.org/content/repositories/snapshots/org/apache/jclouds/chef/jclouds-chef/maven-metadata.xml (516 B at 2.0 KB/sec)
Uploading: https://repository.apache.org/content/repositories/snapshots/org/apache/jclouds/chef/jclouds-chef/1.6.4-SNAPSHOT/maven-metadata.xml
Uploaded: https://repository.apache.org/content/repositories/snapshots/org/apache/jclouds/chef/jclouds-chef/1.6.4-SNAPSHOT/maven-metadata.xml (827 B at 2.1 KB/sec)
Uploading: https://repository.apache.org/content/repositories/snapshots/org/apache/jclouds/chef/jclouds-chef/maven-metadata.xml
Uploaded: https://repository.apache.org/content/repositories/snapshots/org/apache/jclouds/chef/jclouds-chef/maven-metadata.xml (516 B at 1.5 KB/sec)
Uploading: https://repository.apache.org/content/repositories/snapshots/org/apache/jclouds/chef/jclouds-chef/1.6.4-SNAPSHOT/jclouds-chef-1.6.4-20140228.011615-20-tests.jar
Uploaded: https://repository.apache.org/content/repositories/snapshots/org/apache/jclouds/chef/jclouds-chef/1.6.4-SNAPSHOT/jclouds-chef-1.6.4-20140228.011615-20-tests.jar (3 KB at 8.7 KB/sec)
Uploading: https://repository.apache.org/content/repositories/snapshots/org/apache/jclouds/chef/jclouds-chef/1.6.4-SNAPSHOT/maven-metadata.xml
Uploaded: https://repository.apache.org/content/repositories/snapshots/org/apache/jclouds/chef/jclouds-chef/1.6.4-SNAPSHOT/maven-metadata.xml (827 B at 2.6 KB/sec)
[INFO] ------------------------------------------------------------------------
[INFO] Reactor Summary:
[INFO] 
[INFO] Apache jclouds Chef :: Project POM ................ SUCCESS [33.198s]
[INFO] Apache jclouds Chef :: Core ....................... SUCCESS [2:04.848s]
[INFO] Apache jclouds Chef :: Servlet .................... SUCCESS [23.560s]
[INFO] Apache jclouds Chef :: Compute .................... SUCCESS [48.601s]
[INFO] Apache jclouds Chef :: Hosted Chef ................ SUCCESS [44.472s]
[INFO] Apache jclouds Chef :: Private Chef ............... SUCCESS [22.277s]
[INFO] Apache jclouds Chef :: Labs ....................... SUCCESS [3.332s]
[INFO] Apache jclouds Chef ............................... SUCCESS [4.745s]
[INFO] ------------------------------------------------------------------------
[INFO] BUILD SUCCESS
[INFO] ------------------------------------------------------------------------
[INFO] Total time: 5:18.162s
[INFO] Finished at: Thu Feb 27 20:16:18 EST 2014
[Unloading class GregorSamsa$0]
[Unloading class GregorSamsa$0]
[Unloading class GregorSamsa$2]
[Unloading class GregorSamsa$0]
[Unloading class GregorSamsa$1]
[Unloading class GregorSamsa]
[Unloading class GregorSamsa$0]
[Unloading class GregorSamsa$1]
[Unloading class GregorSamsa$1]
[Unloading class GregorSamsa$1]
[Unloading class GregorSamsa]
[Unloading class GregorSamsa$0]
[Unloading class GregorSamsa$1]
[Unloading class GregorSamsa$0]
[Unloading class GregorSamsa$0]
[Unloading class GregorSamsa$1]
[Unloading class GregorSamsa]
[Unloading class GregorSamsa$2]
[Unloading class GregorSamsa$2]
[Unloading class GregorSamsa]
[Unloading class GregorSamsa]
[Unloading class GregorSamsa$0]
[Unloading class GregorSamsa$0]
[Unloading class GregorSamsa]
[Unloading class GregorSamsa]
[Unloading class GregorSamsa$0]
[Unloading class GregorSamsa]
[Unloading class GregorSamsa$2]
[Unloading class GregorSamsa]
[Unloading class GregorSamsa$1]
[Unloading class GregorSamsa$2]
[Unloading class GregorSamsa$2]
[Unloading class GregorSamsa$2]
[Unloading class GregorSamsa$1]
[Unloading class GregorSamsa]
[INFO] Final Memory: 32M/103M
[INFO] ------------------------------------------------------------------------
[WARNING] The requested profile "src" could not be activated because it does not exist.
Waiting for Jenkins to finish collecting data
[JENKINS] Archiving <https://jclouds.ci.cloudbees.com/job/jclouds-chef-1.6.x-branch/ws/labs/hostedchef/pom.xml> to org.apache.jclouds.labs/hostedchef/1.6.4-SNAPSHOT/hostedchef-1.6.4-SNAPSHOT.pom
[JENKINS] Archiving <https://jclouds.ci.cloudbees.com/job/jclouds-chef-1.6.x-branch/ws/labs/hostedchef/target/hostedchef-1.6.4-SNAPSHOT.jar> to org.apache.jclouds.labs/hostedchef/1.6.4-20140228.011540-20/hostedchef-1.6.4-20140228.011540-20.jar
[JENKINS] Archiving <https://jclouds.ci.cloudbees.com/job/jclouds-chef-1.6.x-branch/ws/labs/hostedchef/target/hostedchef-1.6.4-SNAPSHOT-tests.jar> to org.apache.jclouds.labs/hostedchef/1.6.4-20140228.011540-20/hostedchef-1.6.4-20140228.011540-20-tests.jar
[JENKINS] Archiving <https://jclouds.ci.cloudbees.com/job/jclouds-chef-1.6.x-branch/ws/labs/hostedchef/target/hostedchef-1.6.4-SNAPSHOT-javadoc.jar> to org.apache.jclouds.labs/hostedchef/1.6.4-20140228.011540-20/hostedchef-1.6.4-20140228.011540-20-javadoc.jar
[JENKINS] Archiving <https://jclouds.ci.cloudbees.com/job/jclouds-chef-1.6.x-branch/ws/project/pom.xml> to org.apache.jclouds.chef/chef-project/1.6.4-SNAPSHOT/chef-project-1.6.4-SNAPSHOT.pom
[JENKINS] Archiving <https://jclouds.ci.cloudbees.com/job/jclouds-chef-1.6.x-branch/ws/project/target/chef-project-1.6.4-SNAPSHOT-tests.jar> to org.apache.jclouds.chef/chef-project/1.6.4-20140228.011135-21/chef-project-1.6.4-20140228.011135-21-tests.jar
[JENKINS] Archiving <https://jclouds.ci.cloudbees.com/job/jclouds-chef-1.6.x-branch/ws/labs/pom.xml> to org.apache.jclouds.labs/chef-labs-project/1.6.4-SNAPSHOT/chef-labs-project-1.6.4-SNAPSHOT.pom
[JENKINS] Archiving <https://jclouds.ci.cloudbees.com/job/jclouds-chef-1.6.x-branch/ws/labs/target/chef-labs-project-1.6.4-SNAPSHOT-tests.jar> to org.apache.jclouds.labs/chef-labs-project/1.6.4-20140228.011609-20/chef-labs-project-1.6.4-20140228.011609-20-tests.jar
[JENKINS] Archiving <https://jclouds.ci.cloudbees.com/job/jclouds-chef-1.6.x-branch/ws/compute/pom.xml> to org.apache.jclouds.chef/chef-compute/1.6.4-SNAPSHOT/chef-compute-1.6.4-SNAPSHOT.pom
[JENKINS] Archiving <https://jclouds.ci.cloudbees.com/job/jclouds-chef-1.6.x-branch/ws/compute/target/chef-compute-1.6.4-SNAPSHOT.jar> to org.apache.jclouds.chef/chef-compute/1.6.4-20140228.011456-20/chef-compute-1.6.4-20140228.011456-20.jar
[JENKINS] Archiving <https://jclouds.ci.cloudbees.com/job/jclouds-chef-1.6.x-branch/ws/compute/target/chef-compute-1.6.4-SNAPSHOT-tests.jar> to org.apache.jclouds.chef/chef-compute/1.6.4-20140228.011456-20/chef-compute-1.6.4-20140228.011456-20-tests.jar
[JENKINS] Archiving <https://jclouds.ci.cloudbees.com/job/jclouds-chef-1.6.x-branch/ws/servlet/pom.xml> to org.apache.jclouds.chef/chef-servlet/1.6.4-SNAPSHOT/chef-servlet-1.6.4-SNAPSHOT.pom
[JENKINS] Archiving <https://jclouds.ci.cloudbees.com/job/jclouds-chef-1.6.x-branch/ws/servlet/target/chef-servlet-1.6.4-SNAPSHOT.jar> to org.apache.jclouds.chef/chef-servlet/1.6.4-20140228.011406-20/chef-servlet-1.6.4-20140228.011406-20.jar
[JENKINS] Archiving <https://jclouds.ci.cloudbees.com/job/jclouds-chef-1.6.x-branch/ws/servlet/target/chef-servlet-1.6.4-SNAPSHOT-tests.jar> to org.apache.jclouds.chef/chef-servlet/1.6.4-20140228.011406-20/chef-servlet-1.6.4-20140228.011406-20-tests.jar
[JENKINS] Archiving <https://jclouds.ci.cloudbees.com/job/jclouds-chef-1.6.x-branch/ws/servlet/target/chef-servlet-1.6.4-SNAPSHOT-javadoc.jar> to org.apache.jclouds.chef/chef-servlet/1.6.4-20140228.011406-20/chef-servlet-1.6.4-20140228.011406-20-javadoc.jar
[JENKINS] Archiving <https://jclouds.ci.cloudbees.com/job/jclouds-chef-1.6.x-branch/ws/core/pom.xml> to org.apache.jclouds.api/chef/1.6.4-SNAPSHOT/chef-1.6.4-SNAPSHOT.pom
[JENKINS] Archiving <https://jclouds.ci.cloudbees.com/job/jclouds-chef-1.6.x-branch/ws/core/target/chef-1.6.4-SNAPSHOT.jar> to org.apache.jclouds.api/chef/1.6.4-20140228.011339-20/chef-1.6.4-20140228.011339-20.jar
[JENKINS] Archiving <https://jclouds.ci.cloudbees.com/job/jclouds-chef-1.6.x-branch/ws/core/target/chef-1.6.4-SNAPSHOT-tests.jar> to org.apache.jclouds.api/chef/1.6.4-20140228.011339-20/chef-1.6.4-20140228.011339-20-tests.jar
[JENKINS] Archiving <https://jclouds.ci.cloudbees.com/job/jclouds-chef-1.6.x-branch/ws/core/target/chef-1.6.4-SNAPSHOT-javadoc.jar> to org.apache.jclouds.api/chef/1.6.4-20140228.011339-20/chef-1.6.4-20140228.011339-20-javadoc.jar
[JENKINS] Archiving <https://jclouds.ci.cloudbees.com/job/jclouds-chef-1.6.x-branch/ws/pom.xml> to org.apache.jclouds.chef/jclouds-chef/1.6.4-SNAPSHOT/jclouds-chef-1.6.4-SNAPSHOT.pom
[JENKINS] Archiving <https://jclouds.ci.cloudbees.com/job/jclouds-chef-1.6.x-branch/ws/target/jclouds-chef-1.6.4-SNAPSHOT-tests.jar> to org.apache.jclouds.chef/jclouds-chef/1.6.4-20140228.011615-20/jclouds-chef-1.6.4-20140228.011615-20-tests.jar
[JENKINS] Archiving <https://jclouds.ci.cloudbees.com/job/jclouds-chef-1.6.x-branch/ws/labs/privatechef/pom.xml> to org.apache.jclouds.labs/privatechef/1.6.4-SNAPSHOT/privatechef-1.6.4-SNAPSHOT.pom
[JENKINS] Archiving <https://jclouds.ci.cloudbees.com/job/jclouds-chef-1.6.x-branch/ws/labs/privatechef/target/privatechef-1.6.4-SNAPSHOT.jar> to org.apache.jclouds.labs/privatechef/1.6.4-20140228.011603-20/privatechef-1.6.4-20140228.011603-20.jar
[JENKINS] Archiving <https://jclouds.ci.cloudbees.com/job/jclouds-chef-1.6.x-branch/ws/labs/privatechef/target/privatechef-1.6.4-SNAPSHOT-tests.jar> to org.apache.jclouds.labs/privatechef/1.6.4-20140228.011603-20/privatechef-1.6.4-20140228.011603-20-tests.jar
[JENKINS] Archiving <https://jclouds.ci.cloudbees.com/job/jclouds-chef-1.6.x-branch/ws/labs/privatechef/target/privatechef-1.6.4-SNAPSHOT-javadoc.jar> to org.apache.jclouds.labs/privatechef/1.6.4-20140228.011603-20/privatechef-1.6.4-20140228.011603-20-javadoc.jar
channel stopped
Maven RedeployPublisher use remote 793ef629 maven settings from : /private/jclouds/settings.xml
use transfertListener org.apache.maven.cli.transfer.BatchModeMavenTransferListener
[ERROR] uniqueVersion == false is not anymore supported in maven 3
[INFO] Deployment in dav:https://repository-jclouds.forge.cloudbees.com/snapshot (id=cloudbees-private-repository,uniqueVersion=false)
Deploying the main artifact chef-1.6.4-20140228.011339-20.jar
Downloading: dav:https://repository-jclouds.forge.cloudbees.com/snapshot/org/apache/jclouds/api/chef/1.6.4-SNAPSHOT/maven-metadata.xml
ERROR: Failed to retrieve remote metadata org.apache.jclouds.api:chef:1.6.4-SNAPSHOT/maven-metadata.xml: Could not transfer metadata org.apache.jclouds.api:chef:1.6.4-SNAPSHOT/maven-metadata.xml from/to cloudbees-private-repository (dav:https://repository-jclouds.forge.cloudbees.com/snapshot): Not authorized.
org.apache.maven.artifact.deployer.ArtifactDeploymentException: Failed to retrieve remote metadata org.apache.jclouds.api:chef:1.6.4-SNAPSHOT/maven-metadata.xml: Could not transfer metadata org.apache.jclouds.api:chef:1.6.4-SNAPSHOT/maven-metadata.xml from/to cloudbees-private-repository (dav:https://repository-jclouds.forge.cloudbees.com/snapshot): Not authorized.
	at org.apache.maven.artifact.deployer.DefaultArtifactDeployer.deploy(DefaultArtifactDeployer.java:143)
	at hudson.maven.reporters.MavenArtifactRecord.deploy(MavenArtifactRecord.java:193)
	at hudson.maven.RedeployPublisher.perform(RedeployPublisher.java:176)
	at hudson.tasks.BuildStepMonitor$1.perform(BuildStepMonitor.java:20)
	at hudson.model.AbstractBuild$AbstractBuildExecution.perform(AbstractBuild.java:795)
	at hudson.model.AbstractBuild$AbstractBuildExecution.performAllBuildSteps(AbstractBuild.java:767)
	at hudson.maven.MavenModuleSetBuild$MavenModuleSetBuildExecution.post2(MavenModuleSetBuild.java:1030)
	at hudson.model.AbstractBuild$AbstractBuildExecution.post(AbstractBuild.java:716)
	at hudson.model.Run.execute(Run.java:1690)
	at hudson.maven.MavenModuleSetBuild.run(MavenModuleSetBuild.java:519)
	at hudson.model.ResourceController.execute(ResourceController.java:88)
	at hudson.model.Executor.run(Executor.java:246)
Caused by: org.eclipse.aether.deployment.DeploymentException: Failed to retrieve remote metadata org.apache.jclouds.api:chef:1.6.4-SNAPSHOT/maven-metadata.xml: Could not transfer metadata org.apache.jclouds.api:chef:1.6.4-SNAPSHOT/maven-metadata.xml from/to cloudbees-private-repository (dav:https://repository-jclouds.forge.cloudbees.com/snapshot): Not authorized.
	at org.eclipse.aether.internal.impl.DefaultDeployer.upload(DefaultDeployer.java:470)
	at org.eclipse.aether.internal.impl.DefaultDeployer.deploy(DefaultDeployer.java:314)
	at org.eclipse.aether.internal.impl.DefaultDeployer.deploy(DefaultDeployer.java:269)
	at org.eclipse.aether.internal.impl.DefaultRepositorySystem.deploy(DefaultRepositorySystem.java:413)
	at org.apache.maven.artifact.deployer.DefaultArtifactDeployer.deploy(DefaultArtifactDeployer.java:139)
	... 11 more
Caused by: org.eclipse.aether.transfer.MetadataTransferException: Could not transfer metadata org.apache.jclouds.api:chef:1.6.4-SNAPSHOT/maven-metadata.xml from/to cloudbees-private-repository (dav:https://repository-jclouds.forge.cloudbees.com/snapshot): Not authorized.
	at org.eclipse.aether.connector.wagon.WagonRepositoryConnector$5.wrap(WagonRepositoryConnector.java:995)
	at org.eclipse.aether.connector.wagon.WagonRepositoryConnector$5.wrap(WagonRepositoryConnector.java:983)
	at org.eclipse.aether.connector.wagon.WagonRepositoryConnector$GetTask.run(WagonRepositoryConnector.java:725)
	at org.eclipse.aether.util.concurrency.RunnableErrorForwarder$1.run(RunnableErrorForwarder.java:67)
	at java.util.concurrent.ThreadPoolExecutor.runWorker(Unknown Source)
	at java.util.concurrent.ThreadPoolExecutor$Worker.run(Unknown Source)
	at java.lang.Thread.run(Unknown Source)
Caused by: org.apache.maven.wagon.authorization.AuthorizationException: Not authorized.
	at org.apache.maven.wagon.shared.http.AbstractHttpClientWagon.fillInputData(AbstractHttpClientWagon.java:671)
	at org.apache.maven.wagon.StreamWagon.getInputStream(StreamWagon.java:116)
	at org.apache.maven.wagon.StreamWagon.getIfNewer(StreamWagon.java:88)
	at org.apache.maven.wagon.StreamWagon.get(StreamWagon.java:61)
	at org.eclipse.aether.connector.wagon.WagonRepositoryConnector$GetTask.run(WagonRepositoryConnector.java:660)
	... 4 more
[INFO] Deployment failed after 0.96 sec
Build step 'Deploy artifacts to my Private CloudBees Repository' changed build result to FAILURE