You are viewing a plain text version of this content. The canonical link for it is here.
Posted to commits@karaf.apache.org by Apache Jenkins Server <je...@builds.apache.org> on 2016/07/15 14:22:45 UTC
Build failed in Jenkins: karaf-master #3922
See <https://builds.apache.org/job/karaf-master/3922/changes>
Changes:
[chris] [KARAF-4624] Karaf component to create ConnectionFactories out of
------------------------------------------
Started by an SCM change
[EnvInject] - Loading node environment variables.
Building remotely on ubuntu3 (Ubuntu ubuntu legacy-ubuntu) in workspace <https://builds.apache.org/job/karaf-master/ws/>
> git rev-parse --is-inside-work-tree # timeout=10
Fetching changes from the remote Git repository
> git config remote.origin.url https://git-wip-us.apache.org/repos/asf/karaf.git # timeout=10
Fetching upstream changes from https://git-wip-us.apache.org/repos/asf/karaf.git
> git --version # timeout=10
> git -c core.askpass=true fetch --tags --progress https://git-wip-us.apache.org/repos/asf/karaf.git +refs/heads/*:refs/remotes/origin/*
> git rev-parse refs/remotes/origin/master^{commit} # timeout=10
> git rev-parse refs/remotes/origin/origin/master^{commit} # timeout=10
Checking out Revision 6d46540ff5f4437327de39ecf72846c64063a32c (refs/remotes/origin/master)
> git config core.sparsecheckout # timeout=10
> git checkout -f 6d46540ff5f4437327de39ecf72846c64063a32c
> git rev-list 4854661f046ca91121d8c2661afcf5f3043a5e9d # timeout=10
Parsing POMs
Failed to transfer Could not find artifact org.apache:apache:pom:15 in servicemix (http://svn.apache.org/repos/asf/servicemix/m2-repo)
Failed to transfer Could not find artifact org.apache:apache:pom:15 in zodiac-repository (http://repository.springsource.com/maven/bundles/release)
Failed to transfer Could not find artifact org.apache:apache:pom:15 in spring-ebr-repository (http://repository.springsource.com/maven/bundles/external)
Downloaded artifact http://repo.maven.apache.org/maven2/org/apache/apache/15/apache-15.pom
ERROR: Failed to parse POMs
java.io.IOException: remote file operation failed: <https://builds.apache.org/job/karaf-master/ws/> at hudson.remoting.Channel@19adde34:ubuntu3: hudson.remoting.ProxyException: hudson.maven.MavenModuleSetBuild$MavenExecutionException: org.apache.maven.project.ProjectBuildingException: Some problems were encountered while processing the POMs:
[FATAL] Non-resolvable parent POM: Could not find artifact org.apache.karaf:karaf:pom:4.1.0-SNAPSHOT and 'parent.relativePath' points at wrong local POM @ line 24, column 13
at hudson.FilePath.act(FilePath.java:986)
at hudson.FilePath.act(FilePath.java:968)
at hudson.maven.MavenModuleSetBuild$MavenModuleSetBuildExecution.parsePoms(MavenModuleSetBuild.java:960)
at hudson.maven.MavenModuleSetBuild$MavenModuleSetBuildExecution.doRun(MavenModuleSetBuild.java:679)
at hudson.model.AbstractBuild$AbstractBuildExecution.run(AbstractBuild.java:534)
at hudson.model.Run.execute(Run.java:1738)
at hudson.maven.MavenModuleSetBuild.run(MavenModuleSetBuild.java:531)
at hudson.model.ResourceController.execute(ResourceController.java:98)
at hudson.model.Executor.run(Executor.java:410)
Caused by: hudson.remoting.ProxyException: hudson.maven.MavenModuleSetBuild$MavenExecutionException: org.apache.maven.project.ProjectBuildingException: Some problems were encountered while processing the POMs:
[FATAL] Non-resolvable parent POM: Could not find artifact org.apache.karaf:karaf:pom:4.1.0-SNAPSHOT and 'parent.relativePath' points at wrong local POM @ line 24, column 13
at hudson.maven.MavenModuleSetBuild$PomParser.invoke(MavenModuleSetBuild.java:1364)
at hudson.maven.MavenModuleSetBuild$PomParser.invoke(MavenModuleSetBuild.java:1098)
at hudson.FilePath$FileCallableWrapper.call(FilePath.java:2719)
at hudson.remoting.UserRequest.perform(UserRequest.java:120)
at hudson.remoting.UserRequest.perform(UserRequest.java:48)
at hudson.remoting.Request$2.run(Request.java:326)
at hudson.remoting.InterceptingExecutorService$1.call(InterceptingExecutorService.java:68)
at java.util.concurrent.FutureTask.run(FutureTask.java:262)
at java.util.concurrent.ThreadPoolExecutor.runWorker(ThreadPoolExecutor.java:1145)
at java.util.concurrent.ThreadPoolExecutor$Worker.run(ThreadPoolExecutor.java:615)
at java.lang.Thread.run(Thread.java:745)
at ......remote call to ubuntu3(Native Method)
at hudson.remoting.Channel.attachCallSiteStackTrace(Channel.java:1416)
at hudson.remoting.UserResponse.retrieve(UserRequest.java:220)
at hudson.remoting.Channel.call(Channel.java:781)
at hudson.FilePath.act(FilePath.java:979)
... 8 more
Caused by: hudson.remoting.ProxyException: org.apache.maven.project.ProjectBuildingException: Some problems were encountered while processing the POMs:
[FATAL] Non-resolvable parent POM: Could not find artifact org.apache.karaf:karaf:pom:4.1.0-SNAPSHOT and 'parent.relativePath' points at wrong local POM @ line 24, column 13
at org.apache.maven.project.DefaultProjectBuilder.build(DefaultProjectBuilder.java:364)
at hudson.maven.MavenEmbedder.buildProjects(MavenEmbedder.java:361)
at hudson.maven.MavenEmbedder.readProjects(MavenEmbedder.java:331)
at hudson.maven.MavenModuleSetBuild$PomParser.invoke(MavenModuleSetBuild.java:1301)
at hudson.maven.MavenModuleSetBuild$PomParser.invoke(MavenModuleSetBuild.java:1098)
at hudson.FilePath$FileCallableWrapper.call(FilePath.java:2719)
at hudson.remoting.UserRequest.perform(UserRequest.java:120)
at hudson.remoting.UserRequest.perform(UserRequest.java:48)
at hudson.remoting.Request$2.run(Request.java:326)
at hudson.remoting.InterceptingExecutorService$1.call(InterceptingExecutorService.java:68)
at java.util.concurrent.FutureTask.run(FutureTask.java:262)
at java.util.concurrent.ThreadPoolExecutor.runWorker(ThreadPoolExecutor.java:1145)
at java.util.concurrent.ThreadPoolExecutor$Worker.run(ThreadPoolExecutor.java:615)
at java.lang.Thread.run(Thread.java:745)
Build failed in Jenkins: karaf-master #3923
Posted by Apache Jenkins Server <je...@builds.apache.org>.
See <https://builds.apache.org/job/karaf-master/3923/changes>
Changes:
[jbonofre] [KARAF-4493] Add support of etc/branding-ssh.properties file to brand
------------------------------------------
Started by an SCM change
[EnvInject] - Loading node environment variables.
Building remotely on ubuntu3 (Ubuntu ubuntu legacy-ubuntu) in workspace <https://builds.apache.org/job/karaf-master/ws/>
> git rev-parse --is-inside-work-tree # timeout=10
Fetching changes from the remote Git repository
> git config remote.origin.url https://git-wip-us.apache.org/repos/asf/karaf.git # timeout=10
Fetching upstream changes from https://git-wip-us.apache.org/repos/asf/karaf.git
> git --version # timeout=10
> git -c core.askpass=true fetch --tags --progress https://git-wip-us.apache.org/repos/asf/karaf.git +refs/heads/*:refs/remotes/origin/*
> git rev-parse refs/remotes/origin/master^{commit} # timeout=10
> git rev-parse refs/remotes/origin/origin/master^{commit} # timeout=10
Checking out Revision 5bdea741071539ce2f32c4dc1d39fb28f2f6ae3b (refs/remotes/origin/master)
> git config core.sparsecheckout # timeout=10
> git checkout -f 5bdea741071539ce2f32c4dc1d39fb28f2f6ae3b
> git rev-list 6d46540ff5f4437327de39ecf72846c64063a32c # timeout=10
Parsing POMs
ERROR: Failed to parse POMs
java.io.IOException: remote file operation failed: <https://builds.apache.org/job/karaf-master/ws/> at hudson.remoting.Channel@19adde34:ubuntu3: hudson.remoting.ProxyException: hudson.maven.MavenModuleSetBuild$MavenExecutionException: org.apache.maven.project.ProjectBuildingException: Some problems were encountered while processing the POMs:
[FATAL] Non-resolvable parent POM: Could not find artifact org.apache.karaf:karaf:pom:4.1.0-SNAPSHOT and 'parent.relativePath' points at wrong local POM @ line 24, column 13
at hudson.FilePath.act(FilePath.java:986)
at hudson.FilePath.act(FilePath.java:968)
at hudson.maven.MavenModuleSetBuild$MavenModuleSetBuildExecution.parsePoms(MavenModuleSetBuild.java:960)
at hudson.maven.MavenModuleSetBuild$MavenModuleSetBuildExecution.doRun(MavenModuleSetBuild.java:679)
at hudson.model.AbstractBuild$AbstractBuildExecution.run(AbstractBuild.java:534)
at hudson.model.Run.execute(Run.java:1738)
at hudson.maven.MavenModuleSetBuild.run(MavenModuleSetBuild.java:531)
at hudson.model.ResourceController.execute(ResourceController.java:98)
at hudson.model.Executor.run(Executor.java:410)
Caused by: hudson.remoting.ProxyException: hudson.maven.MavenModuleSetBuild$MavenExecutionException: org.apache.maven.project.ProjectBuildingException: Some problems were encountered while processing the POMs:
[FATAL] Non-resolvable parent POM: Could not find artifact org.apache.karaf:karaf:pom:4.1.0-SNAPSHOT and 'parent.relativePath' points at wrong local POM @ line 24, column 13
at hudson.maven.MavenModuleSetBuild$PomParser.invoke(MavenModuleSetBuild.java:1364)
at hudson.maven.MavenModuleSetBuild$PomParser.invoke(MavenModuleSetBuild.java:1098)
at hudson.FilePath$FileCallableWrapper.call(FilePath.java:2719)
at hudson.remoting.UserRequest.perform(UserRequest.java:120)
at hudson.remoting.UserRequest.perform(UserRequest.java:48)
at hudson.remoting.Request$2.run(Request.java:326)
at hudson.remoting.InterceptingExecutorService$1.call(InterceptingExecutorService.java:68)
at java.util.concurrent.FutureTask.run(FutureTask.java:262)
at java.util.concurrent.ThreadPoolExecutor.runWorker(ThreadPoolExecutor.java:1145)
at java.util.concurrent.ThreadPoolExecutor$Worker.run(ThreadPoolExecutor.java:615)
at java.lang.Thread.run(Thread.java:745)
at ......remote call to ubuntu3(Native Method)
at hudson.remoting.Channel.attachCallSiteStackTrace(Channel.java:1416)
at hudson.remoting.UserResponse.retrieve(UserRequest.java:220)
at hudson.remoting.Channel.call(Channel.java:781)
at hudson.FilePath.act(FilePath.java:979)
... 8 more
Caused by: hudson.remoting.ProxyException: org.apache.maven.project.ProjectBuildingException: Some problems were encountered while processing the POMs:
[FATAL] Non-resolvable parent POM: Could not find artifact org.apache.karaf:karaf:pom:4.1.0-SNAPSHOT and 'parent.relativePath' points at wrong local POM @ line 24, column 13
at org.apache.maven.project.DefaultProjectBuilder.build(DefaultProjectBuilder.java:364)
at hudson.maven.MavenEmbedder.buildProjects(MavenEmbedder.java:361)
at hudson.maven.MavenEmbedder.readProjects(MavenEmbedder.java:331)
at hudson.maven.MavenModuleSetBuild$PomParser.invoke(MavenModuleSetBuild.java:1301)
at hudson.maven.MavenModuleSetBuild$PomParser.invoke(MavenModuleSetBuild.java:1098)
at hudson.FilePath$FileCallableWrapper.call(FilePath.java:2719)
at hudson.remoting.UserRequest.perform(UserRequest.java:120)
at hudson.remoting.UserRequest.perform(UserRequest.java:48)
at hudson.remoting.Request$2.run(Request.java:326)
at hudson.remoting.InterceptingExecutorService$1.call(InterceptingExecutorService.java:68)
at java.util.concurrent.FutureTask.run(FutureTask.java:262)
at java.util.concurrent.ThreadPoolExecutor.runWorker(ThreadPoolExecutor.java:1145)
at java.util.concurrent.ThreadPoolExecutor$Worker.run(ThreadPoolExecutor.java:615)
at java.lang.Thread.run(Thread.java:745)