You are viewing a plain text version of this content. The canonical link for it is here.
Posted to builds@cassandra.apache.org by Apache Jenkins Server <je...@builds.apache.org> on 2024/07/25 08:28:02 UTC
Build complete: Cassandra-4.1 #503 [UNSTABLE] 891e65e251d102d2664f84d22734b95235a7cb16
-------------------------------------------------------------------------------
Build Cassandra-4.1 #503 Still unstable
URL: https://ci-cassandra.apache.org/job/Cassandra-4.1/503/
-------------------------------------------------------------------------------
Changes:
[Stefan Miklosovic] Update ant dependency-check to version 10.0.0
[Caleb Rackliffe] UnsupportedOperationException when reducing scope for LCS compactions
[Michael Semb Wever] Add termin-8-jdk as a valid jdk8 candidate in the debian package
[Stefan Miklosovic] Do not create a role if ALTER ROLE IF EXISTS operates on non-existing
[Sam Tunnicliffe] Revert to localised start time for coordinator read latency measurement
[Sam Tunnicliffe] Ninja: update CHANGES.txt
[Stefan Miklosovic] Fix schema.cql created by a snapshot after dropping more than one column
[Stefan Miklosovic] Fix rendering issues in cassandra.yaml for gen-asciidoc target
-------------------------------------------------------------------------------
Failed Tests:
21 tests failed.
FAILED: dtest-novnode.materialized_views_test.TestMaterializedViewsConsistency.test_multi_partition_consistent_reads_after_write
FAILED: dtest-novnode.materialized_views_test.TestMaterializedViewsConsistency.test_multi_partition_consistent_reads_after_write
FAILED: org.apache.cassandra.distributed.test.hostreplacement.NodeCannotJoinAsHibernatingNodeWithoutReplaceAddressTest.test
FAILED: org.apache.cassandra.cql3.ViewLongTest.testExpiredLivenessInfoWithDefaultTTLWithFlush[1]
FAILED: org.apache.cassandra.net.ProxyHandlerConnectionsTest.suddenDisconnect-compression
FAILED: org.apache.cassandra.tools.TopPartitionsTest.testServiceTopPartitionsSingleTable
FAILED: dtest-novnode.largecolumn_test.TestLargeColumn.test_cleanup
FAILED: dtest-novnode.largecolumn_test.TestLargeColumn.test_cleanup
FAILED: dtest-offheap.largecolumn_test.TestLargeColumn.test_cleanup
FAILED: dtest-offheap.largecolumn_test.TestLargeColumn.test_cleanup
FAILED: dtest.largecolumn_test.TestLargeColumn.test_cleanup
FAILED: dtest.largecolumn_test.TestLargeColumn.test_cleanup
FAILED: org.apache.cassandra.distributed.test.ReadRepairTest.readRepairRTRangeMovementTest
FAILED: org.apache.cassandra.distributed.test.ReadRepairTest.readRepairRTRangeMovementTest
FAILED: org.apache.cassandra.cql3.MemtableSizeTest.testSize[skiplist]-cdc
FAILED: org.apache.cassandra.cql3.MemtableSizeTest.testSize[skiplist]-cdc
FAILED: org.apache.cassandra.cql3.MemtableSizeTest.testSize[skiplist]-compression
FAILED: org.apache.cassandra.cql3.MemtableSizeTest.testSize[skiplist]-compression
FAILED: org.apache.cassandra.cql3.MemtableSizeTest.testSize[skiplist]-compression
FAILED: org.apache.cassandra.cql3.MemtableSizeTest.testSize[skiplist]
FAILED: org.apache.cassandra.cql3.MemtableSizeTest.testSize[skiplist]
-------------------------------------------------------------------------------
For complete test report and logs see https://nightlies.apache.org/cassandra/Cassandra-4.1/503/