You are viewing a plain text version of this content. The canonical link for it is here.
Posted to builds@beam.apache.org by Apache Jenkins Server <je...@builds.apache.org> on 2024/01/18 22:52:50 UTC
Build failed in Jenkins: beam_PostCommit_Python_VR_Flink #4789
See <https://ci-beam.apache.org/job/beam_PostCommit_Python_VR_Flink/4789/display/redirect>
Changes:
------------------------------------------
Started by timer
Running as SYSTEM
[EnvInject] - Loading node environment variables.
Building remotely on apache-beam-jenkins-15 (beam) in workspace <https://ci-beam.apache.org/job/beam_PostCommit_Python_VR_Flink/ws/>
The recommended git tool is: NONE
No credentials specified
Wiping out workspace first.
Cloning the remote Git repository
Using shallow clone with depth 1
Avoid fetching tags
Cloning repository https://github.com/apache/beam.git
> git init <https://ci-beam.apache.org/job/beam_PostCommit_Python_VR_Flink/ws/src> # timeout=10
Fetching upstream changes from https://github.com/apache/beam.git
> git --version # timeout=10
> git --version # 'git version 2.25.1'
> git fetch --no-tags --force --progress --depth=1 -- https://github.com/apache/beam.git +refs/heads/*:refs/remotes/origin/* # timeout=10
ERROR: Error cloning remote repo 'origin'
hudson.plugins.git.GitException: Command "git fetch --no-tags --force --progress --depth=1 -- https://github.com/apache/beam.git +refs/heads/*:refs/remotes/origin/*" returned status code 128:
stdout:
stderr: remote: Enumerating objects: 154102, done.
remote: Counting objects: 0% (1/154102) remote: Counting objects: 1% (1542/154102) remote: Counting objects: 2% (3083/154102) remote: Counting objects: 3% (4624/154102) remote: Counting objects: 4% (6165/154102) remote: Counting objects: 5% (7706/154102) remote: Counting objects: 6% (9247/154102) remote: Counting objects: 7% (10788/154102) remote: Counting objects: 8% (12329/154102) remote: Counting objects: 9% (13870/154102) remote: Counting objects: 10% (15411/154102) remote: Counting objects: 11% (16952/154102) remote: Counting objects: 12% (18493/154102) remote: Counting objects: 13% (20034/154102) remote: Counting objects: 14% (21575/154102) remote: Counting objects: 15% (23116/154102) remote: Counting objects: 16% (24657/154102) remote: Counting objects: 17% (26198/154102) remote: Counting objects: 18% (27739/154102) remote: Counting objects: 19% (29280/154102) remote: Counting objects: 20% (30821/154102) remote: Counting objects: 21% (32362/154102) remote: Counting objects: 22% (33903/154102) remote: Counting objects: 23% (35444/154102) remote: Counting objects: 24% (36985/154102) remote: Counting objects: 25% (38526/154102) remote: Counting objects: 26% (40067/154102) remote: Counting objects: 27% (41608/154102) remote: Counting objects: 28% (43149/154102) remote: Counting objects: 29% (44690/154102) remote: Counting objects: 30% (46231/154102) remote: Counting objects: 31% (47772/154102) remote: Counting objects: 32% (49313/154102) remote: Counting objects: 33% (50854/154102) remote: Counting objects: 34% (52395/154102) remote: Counting objects: 35% (53936/154102) remote: Counting objects: 36% (55477/154102) remote: Counting objects: 37% (57018/154102) remote: Counting objects: 38% (58559/154102) remote: Counting objects: 39% (60100/154102) remote: Counting objects: 40% (61641/154102) remote: Counting objects: 41% (63182/154102) remote: Counting objects: 42% (64723/154102) remote: Counting objects: 43% (66264/154102) remote: Counting objects: 44% (67805/154102) remote: Counting objects: 45% (69346/154102) remote: Counting objects: 46% (70887/154102) remote: Counting objects: 47% (72428/154102) remote: Counting objects: 48% (73969/154102) remote: Counting objects: 49% (75510/154102) remote: Counting objects: 50% (77051/154102) remote: Counting objects: 51% (78593/154102) remote: Counting objects: 52% (80134/154102) remote: Counting objects: 53% (81675/154102) remote: Counting objects: 54% (83216/154102) remote: Counting objects: 55% (84757/154102) remote: Counting objects: 56% (86298/154102) remote: Counting objects: 57% (87839/154102) remote: Counting objects: 58% (89380/154102) remote: Counting objects: 59% (90921/154102) remote: Counting objects: 60% (92462/154102) remote: Counting objects: 61% (94003/154102) remote: Counting objects: 62% (95544/154102) remote: Counting objects: 63% (97085/154102) remote: Counting objects: 64% (98626/154102) remote: Counting objects: 65% (100167/154102) remote: Counting objects: 66% (101708/154102) remote: Counting objects: 67% (103249/154102) remote: Counting objects: 68% (104790/154102) remote: Counting objects: 69% (106331/154102) remote: Counting objects: 70% (107872/154102) remote: Counting objects: 71% (109413/154102) remote: Counting objects: 72% (110954/154102) remote: Counting objects: 73% (112495/154102) remote: Counting objects: 74% (114036/154102) remote: Counting objects: 75% (115577/154102) remote: Counting objects: 76% (117118/154102) remote: Counting objects: 77% (118659/154102) remote: Counting objects: 78% (120200/154102) remote: Counting objects: 79% (121741/154102) remote: Counting objects: 80% (123282/154102) remote: Counting objects: 81% (124823/154102) remote: Counting objects: 82% (126364/154102) remote: Counting objects: 83% (127905/154102) remote: Counting objects: 84% (129446/154102) remote: Counting objects: 85% (130987/154102) remote: Counting objects: 86% (132528/154102) remote: Counting objects: 87% (134069/154102) remote: Counting objects: 88% (135610/154102) remote: Counting objects: 89% (137151/154102) remote: Counting objects: 90% (138692/154102) remote: Counting objects: 91% (140233/154102) remote: Counting objects: 92% (141774/154102) remote: Counting objects: 93% (143315/154102) remote: Counting objects: 94% (144856/154102) remote: Counting objects: 95% (146397/154102) remote: Counting objects: 96% (147938/154102) remote: Counting objects: 97% (149479/154102) remote: Counting objects: 98% (151020/154102) remote: Counting objects: 99% (152561/154102) remote: Counting objects: 100% (154102/154102) remote: Counting objects: 100% (154102/154102), done.
remote: Compressing objects: 0% (1/70201) remote: Compressing objects: 1% (703/70201) remote: Compressing objects: 2% (1405/70201) remote: Compressing objects: 3% (2107/70201) remote: Compressing objects: 4% (2809/70201) remote: Compressing objects: 5% (3511/70201) remote: Compressing objects: 5% (4134/70201) remote: Compressing objects: 6% (4213/70201) remote: Compressing objects: 7% (4915/70201) remote: Compressing objects: 8% (5617/70201) remote: Compressing objects: 9% (6319/70201) remote: Compressing objects: 10% (7021/70201) remote: Compressing objects: 11% (7723/70201) remote: Compressing objects: 12% (8425/70201) remote: Compressing objects: 13% (9127/70201) remote: Compressing objects: 14% (9829/70201) remote: Compressing objects: 15% (10531/70201) remote: Compressing objects: 15% (10764/70201) remote: Compressing objects: 16% (11233/70201) remote: Compressing objects: 17% (11935/70201) remote: Compressing objects: 18% (12637/70201) remote: Compressing objects: 19% (13339/70201) remote: Compressing objects: 20% (14041/70201) remote: Compressing objects: 21% (14743/70201) remote: Compressing objects: 22% (15445/70201) remote: Compressing objects: 23% (16147/70201) remote: Compressing objects: 23% (16597/70201) remote: Compressing objects: 24% (16849/70201) remote: Compressing objects: 25% (17551/70201) remote: Compressing objects: 26% (18253/70201) remote: Compressing objects: 27% (18955/70201) remote: Compressing objects: 28% (19657/70201) remote: Compressing objects: 29% (20359/70201) remote: Compressing objects: 29% (20946/70201) remote: Compressing objects: 30% (21061/70201) remote: Compressing objects: 31% (21763/70201) remote: Compressing objects: 32% (22465/70201) remote: Compressing objects: 33% (23167/70201) remote: Compressing objects: 34% (23869/70201) remote: Compressing objects: 35% (24571/70201) remote: Compressing objects: 35% (25200/70201) remote: Compressing objects: 36% (25273/70201) remote: Compressing objects: 37% (25975/70201) remote: Compressing objects: 38% (26677/70201) remote: Compressing objects: 39% (27379/70201) remote: Compressing objects: 40% (28081/70201) remote: Compressing objects: 41% (28783/70201) remote: Compressing objects: 42% (29485/70201) remote: Compressing objects: 43% (30187/70201) remote: Compressing objects: 43% (30234/70201) remote: Compressing objects: 44% (30889/70201) remote: Compressing objects: 45% (31591/70201) remote: Compressing objects: 46% (32293/70201) remote: Compressing objects: 47% (32995/70201) remote: Compressing objects: 48% (33697/70201) remote: Compressing objects: 49% (34399/70201) remote: Compressing objects: 50% (35101/70201) remote: Compressing objects: 51% (35803/70201) remote: Compressing objects: 51% (36312/70201) remote: Compressing objects: 52% (36505/70201) remote: Compressing objects: 53% (37207/70201) remote: Compressing objects: 54% (37909/70201) remote: Compressing objects: 55% (38611/70201) remote: Compressing objects: 56% (39313/70201) remote: Compressing objects: 57% (40015/70201) remote: Compressing objects: 58% (40717/70201) remote: Compressing objects: 59% (41419/70201) remote: Compressing objects: 60% (42121/70201) remote: Compressing objects: 61% (42823/70201) remote: Compressing objects: 62% (43525/70201) remote: Compressing objects: 63% (44227/70201) remote: Compressing objects: 64% (44929/70201) remote: Compressing objects: 65% (45631/70201) remote: Compressing objects: 66% (46333/70201) remote: Compressing objects: 67% (47035/70201) remote: Compressing objects: 68% (47737/70201) remote: Compressing objects: 69% (48439/70201) remote: Compressing objects: 70% (49141/70201) remote: Compressing objects: 71% (49843/70201) remote: Compressing objects: 72% (50545/70201) remote: Compressing objects: 72% (50791/70201) remote: Compressing objects: 73% (51247/70201) remote: Compressing objects: 74% (51949/70201) remote: Compressing objects: 75% (52651/70201) remote: Compressing objects: 76% (53353/70201) remote: Compressing objects: 77% (54055/70201) remote: Compressing objects: 78% (54757/70201) remote: Compressing objects: 79% (55459/70201) remote: Compressing objects: 80% (56161/70201) remote: Compressing objects: 81% (56863/70201) remote: Compressing objects: 82% (57565/70201) remote: Compressing objects: 83% (58267/70201) remote: Compressing objects: 84% (58969/70201) remote: Compressing objects: 85% (59671/70201) remote: Compressing objects: 86% (60373/70201) remote: Compressing objects: 87% (61075/70201) remote: Compressing objects: 88% (61777/70201) remote: Compressing objects: 89% (62479/70201) remote: Compressing objects: 90% (63181/70201) remote: Compressing objects: 91% (63883/70201) remote: Compressing objects: 92% (64585/70201) remote: Compressing objects: 93% (65287/70201) remote: Compressing objects: 94% (65989/70201) remote: Compressing objects: 95% (66691/70201) remote: Compressing objects: 96% (67393/70201) remote: Compressing objects: 97% (68095/70201) remote: Compressing objects: 98% (68797/70201) remote: Compressing objects: 99% (69499/70201) remote: Compressing objects: 100% (70201/70201) remote: Compressing objects: 100% (70201/70201), done.
Receiving objects: 0% (1/154102)Receiving objects: 1% (1542/154102)Receiving objects: 2% (3083/154102)Receiving objects: 3% (4624/154102)Receiving objects: 4% (6165/154102)Receiving objects: 5% (7706/154102)Receiving objects: 6% (9247/154102)Receiving objects: 7% (10788/154102)Receiving objects: 8% (12329/154102)Receiving objects: 9% (13870/154102)Receiving objects: 10% (15411/154102)Receiving objects: 11% (16952/154102)Receiving objects: 12% (18493/154102)Receiving objects: 13% (20034/154102)Receiving objects: 14% (21575/154102)Receiving objects: 15% (23116/154102)Receiving objects: 16% (24657/154102)Receiving objects: 17% (26198/154102)Receiving objects: 18% (27739/154102)Receiving objects: 19% (29280/154102)Receiving objects: 20% (30821/154102)Receiving objects: 21% (32362/154102)Receiving objects: 22% (33903/154102)Receiving objects: 23% (35444/154102)Receiving objects: 24% (36985/154102)Receiving objects: 25% (38526/154102)Receiving objects: 26% (40067/154102)Receiving objects: 27% (41608/154102)Receiving objects: 28% (43149/154102)Receiving objects: 29% (44690/154102)Receiving objects: 30% (46231/154102)Receiving objects: 31% (47772/154102)Receiving objects: 32% (49313/154102)Receiving objects: 33% (50854/154102)Receiving objects: 34% (52395/154102)Receiving objects: 35% (53936/154102)Receiving objects: 36% (55477/154102)Receiving objects: 37% (57018/154102)Receiving objects: 38% (58559/154102)Receiving objects: 39% (60100/154102)Receiving objects: 40% (61641/154102)Receiving objects: 41% (63182/154102)Receiving objects: 42% (64723/154102)Receiving objects: 43% (66264/154102)Receiving objects: 44% (67805/154102)Receiving objects: 44% (67807/154102)Receiving objects: 44% (67808/154102)Receiving objects: 44% (67809/154102)Receiving objects: 44% (67810/154102)Receiving objects: 44% (67812/154102), 6.96 MiB | 247.00 KiB/sReceiving objects: 44% (67813/154102), 6.96 MiB | 247.00 KiB/sReceiving objects: 44% (67814/154102), 6.96 MiB | 247.00 KiB/sReceiving objects: 44% (67815/154102), 6.96 MiB | 247.00 KiB/sReceiving objects: 44% (67816/154102), 6.96 MiB | 247.00 KiB/sReceiving objects: 44% (67817/154102), 6.96 MiB | 247.00 KiB/sReceiving objects: 44% (67818/154102), 6.96 MiB | 247.00 KiB/sReceiving objects: 44% (67819/154102), 6.96 MiB | 247.00 KiB/sReceiving objects: 44% (67820/154102), 6.96 MiB | 247.00 KiB/sReceiving objects: 44% (67821/154102), 6.96 MiB | 247.00 KiB/sReceiving objects: 44% (67822/154102), 6.96 MiB | 247.00 KiB/sReceiving objects: 44% (67823/154102), 6.96 MiB | 247.00 KiB/sReceiving objects: 44% (67823/154102), 6.96 MiB | 66.00 KiB/s Receiving objects: 44% (67824/154102), 6.96 MiB | 66.00 KiB/sReceiving objects: 44% (67825/154102), 6.96 MiB | 66.00 KiB/sReceiving objects: 44% (67826/154102), 6.96 MiB | 66.00 KiB/sReceiving objects: 44% (67827/154102), 6.96 MiB | 66.00 KiB/sReceiving objects: 44% (67836/154102), 6.96 MiB | 66.00 KiB/sReceiving objects: 44% (67836/154102), 6.96 MiB | 44.00 KiB/sReceiving objects: 44% (67838/154102), 6.96 MiB | 44.00 KiB/sReceiving objects: 44% (67839/154102), 6.96 MiB | 44.00 KiB/sReceiving objects: 44% (67840/154102), 6.96 MiB | 44.00 KiB/sReceiving objects: 44% (67841/154102), 6.96 MiB | 44.00 KiB/sReceiving objects: 44% (67842/154102), 6.96 MiB | 44.00 KiB/sReceiving objects: 44% (67843/154102), 6.96 MiB | 44.00 KiB/sReceiving objects: 44% (67844/154102), 6.96 MiB | 44.00 KiB/sReceiving objects: 44% (67845/154102), 6.96 MiB | 44.00 KiB/sReceiving objects: 44% (67846/154102), 6.96 MiB | 44.00 KiB/sReceiving objects: 44% (67846/154102), 6.97 MiB | 27.00 KiB/sReceiving objects: 45% (69346/154102), 7.08 MiB | 27.00 KiB/sReceiving objects: 46% (70887/154102), 7.08 MiB | 27.00 KiB/sReceiving objects: 47% (72428/154102), 7.08 MiB | 27.00 KiB/sReceiving objects: 48% (73969/154102), 7.08 MiB | 27.00 KiB/sReceiving objects: 49% (75510/154102), 7.08 MiB | 27.00 KiB/sReceiving objects: 50% (77051/154102), 7.08 MiB | 27.00 KiB/sReceiving objects: 50% (77400/154102), 7.08 MiB | 27.00 KiB/sReceiving objects: 51% (78593/154102), 7.08 MiB | 27.00 KiB/sReceiving objects: 52% (80134/154102), 7.08 MiB | 27.00 KiB/sReceiving objects: 53% (81675/154102), 7.08 MiB | 27.00 KiB/sReceiving objects: 54% (83216/154102), 7.08 MiB | 27.00 KiB/sReceiving objects: 55% (84757/154102), 7.08 MiB | 27.00 KiB/sReceiving objects: 56% (86298/154102), 7.08 MiB | 27.00 KiB/serror: RPC failed; curl 56 GnuTLS recv error (-9): Error decoding the received TLS packet.
fatal: the remote end hung up unexpectedly
fatal: early EOF
fatal: index-pack failed
at org.jenkinsci.plugins.gitclient.CliGitAPIImpl.launchCommandIn(CliGitAPIImpl.java:2734)
at org.jenkinsci.plugins.gitclient.CliGitAPIImpl.launchCommandWithCredentials(CliGitAPIImpl.java:2111)
at org.jenkinsci.plugins.gitclient.CliGitAPIImpl$1.execute(CliGitAPIImpl.java:623)
at org.jenkinsci.plugins.gitclient.CliGitAPIImpl$2.execute(CliGitAPIImpl.java:852)
at org.jenkinsci.plugins.gitclient.RemoteGitImpl$CommandInvocationHandler$GitCommandMasterToSlaveCallable.call(RemoteGitImpl.java:158)
at org.jenkinsci.plugins.gitclient.RemoteGitImpl$CommandInvocationHandler$GitCommandMasterToSlaveCallable.call(RemoteGitImpl.java:151)
at hudson.remoting.UserRequest.perform(UserRequest.java:211)
at hudson.remoting.UserRequest.perform(UserRequest.java:54)
at hudson.remoting.Request$2.run(Request.java:377)
at hudson.remoting.InterceptingExecutorService.lambda$wrap$0(InterceptingExecutorService.java:78)
at java.base/java.util.concurrent.FutureTask.run(FutureTask.java:264)
at java.base/java.util.concurrent.ThreadPoolExecutor.runWorker(ThreadPoolExecutor.java:1128)
at java.base/java.util.concurrent.ThreadPoolExecutor$Worker.run(ThreadPoolExecutor.java:628)
at java.base/java.lang.Thread.run(Thread.java:829)
Suppressed: hudson.remoting.Channel$CallSiteStackTrace: Remote call to apache-beam-jenkins-15
at hudson.remoting.Channel.attachCallSiteStackTrace(Channel.java:1784)
at hudson.remoting.UserRequest$ExceptionResponse.retrieve(UserRequest.java:356)
at hudson.remoting.Channel.call(Channel.java:1000)
at org.jenkinsci.plugins.gitclient.RemoteGitImpl$CommandInvocationHandler.execute(RemoteGitImpl.java:143)
at jdk.internal.reflect.GeneratedMethodAccessor478.invoke(Unknown Source)
at java.base/jdk.internal.reflect.DelegatingMethodAccessorImpl.invoke(DelegatingMethodAccessorImpl.java:43)
at java.base/java.lang.reflect.Method.invoke(Method.java:566)
at org.jenkinsci.plugins.gitclient.RemoteGitImpl$CommandInvocationHandler.invoke(RemoteGitImpl.java:129)
at com.sun.proxy.$Proxy203.execute(Unknown Source)
at hudson.plugins.git.GitSCM.retrieveChanges(GitSCM.java:1226)
at hudson.plugins.git.GitSCM.checkout(GitSCM.java:1309)
at hudson.scm.SCM.checkout(SCM.java:540)
at hudson.model.AbstractProject.checkout(AbstractProject.java:1240)
at hudson.model.AbstractBuild$AbstractBuildExecution.defaultCheckout(AbstractBuild.java:649)
at jenkins.scm.SCMCheckoutStrategy.checkout(SCMCheckoutStrategy.java:85)
at hudson.model.AbstractBuild$AbstractBuildExecution.run(AbstractBuild.java:521)
at hudson.model.Run.execute(Run.java:1900)
at hudson.model.FreeStyleBuild.run(FreeStyleBuild.java:44)
at hudson.model.ResourceController.execute(ResourceController.java:101)
at hudson.model.Executor.run(Executor.java:442)
ERROR: Error cloning remote repo 'origin'
---------------------------------------------------------------------
To unsubscribe, e-mail: builds-unsubscribe@beam.apache.org
For additional commands, e-mail: builds-help@beam.apache.org
Jenkins build is back to normal : beam_PostCommit_Python_VR_Flink #4791
Posted by Apache Jenkins Server <je...@builds.apache.org>.
See <https://ci-beam.apache.org/job/beam_PostCommit_Python_VR_Flink/4791/display/redirect>
---------------------------------------------------------------------
To unsubscribe, e-mail: builds-unsubscribe@beam.apache.org
For additional commands, e-mail: builds-help@beam.apache.org
Build failed in Jenkins: beam_PostCommit_Python_VR_Flink #4790
Posted by Apache Jenkins Server <je...@builds.apache.org>.
See <https://ci-beam.apache.org/job/beam_PostCommit_Python_VR_Flink/4790/display/redirect>
Changes:
------------------------------------------
[...truncated 62.79 KB...]
Downloading pluggy-1.3.0-py3-none-any.whl (18 kB)
Downloading pyproject_api-1.6.1-py3-none-any.whl (12 kB)
Downloading virtualenv-20.25.0-py3-none-any.whl (3.8 MB)
━━━━━━━━━━━━━━━━━━━━━━━━━━━━━━━━━━━━━━━━ 3.8/3.8 MB 36.4 MB/s eta 0:00:00
Downloading distlib-0.3.8-py2.py3-none-any.whl (468 kB)
━━━━━━━━━━━━━━━━━━━━━━━━━━━━━━━━━━━━━━━ 468.9/468.9 kB 257.7 MB/s eta 0:00:00
Installing collected packages: distlib, pluggy, platformdirs, packaging, filelock, colorama, chardet, cachetools, virtualenv, pyproject-api, tox
> Task :sdks:python:test-suites:portable:py38:setupVirtualenv
> Task :sdks:java:container:generateLicenseReport
> Task :release:go-licenses:java:dockerRun
go: downloading github.com/golang/protobuf v1.5.3
go: downloading google.golang.org/protobuf v1.31.0
go: downloading google.golang.org/grpc v1.59.0
go: downloading golang.org/x/sys v0.15.0
go: downloading google.golang.org/genproto/googleapis/rpc v0.0.0-20231120223509-83a465c0220f
go: downloading golang.org/x/net v0.19.0
go: downloading google.golang.org/genproto v0.0.0-20231106174013-bbf56f31fb17
go: downloading golang.org/x/text v0.14.0
go: added github.com/apache/beam/sdks/v2 v2.53.0
go: added github.com/golang/protobuf v1.5.3
go: added golang.org/x/net v0.19.0
go: added golang.org/x/sys v0.15.0
go: added golang.org/x/text v0.14.0
go: added google.golang.org/genproto/googleapis/rpc v0.0.0-20231120223509-83a465c0220f
go: added google.golang.org/grpc v1.59.0
go: added google.golang.org/protobuf v1.31.0
+ go-licenses save github.com/apache/beam/sdks/v2/java/container --save_path=/output/licenses
> Task :sdks:java:extensions:sql:expansion-service:shadowJar FROM-CACHE
> Task :release:go-licenses:java:dockerRun
W0119 12:16:10.895177 36 library.go:101] "golang.org/x/sys/unix" contains non-Go code that can't be inspected for further dependencies:
/go/pkg/mod/golang.org/x/sys@v0.15.0/unix/asm_linux_amd64.s
+ go-licenses csv github.com/apache/beam/sdks/v2/java/container
+ tee /output/licenses/list.csv
W0119 12:16:17.650759 81 library.go:101] "golang.org/x/sys/unix" contains non-Go code that can't be inspected for further dependencies:
/go/pkg/mod/golang.org/x/sys@v0.15.0/unix/asm_linux_amd64.s
> Task :sdks:java:container:pullLicenses
INFO:root:Pulling license for 126 dependencies using 16 threads.
INFO:root:Replaced local file URL with file:///home/jenkins/jenkins-slave/workspace/beam_PostCommit_Python_VR_Flink/src/sdks/java/container/license_scripts/manual_licenses/xz/COPYING for xz-1.5
INFO:root:pull_licenses_java.py succeed. It took 1.835086 seconds with 16 threads.
> Task :sdks:java:container:java8:copyJavaThirdPartyLicenses
> Task :sdks:java:container:downloadCloudProfilerAgent
% Total % Received % Xferd Average Speed Time Time Time Current
Dload Upload Total Spent Left Speed
0 0 0 0 0 0 0 0 --:--:-- --:--:-- --:--:-- 0100 4183k 100 4183k 0 0 7313k 0 --:--:-- --:--:-- --:--:-- 7313k
> Task :sdks:java:container:goPrepare UP-TO-DATE
> Task :release:go-licenses:java:dockerRun
+ chmod -R a+w /output/licenses
> Task :sdks:python:sdist
<string>:32: DeprecationWarning: pkg_resources is deprecated as an API. See https://setuptools.pypa.io/en/latest/pkg_resources.html
/tmp/build-env-ubd4anp6/lib/python3.8/site-packages/setuptools/dist.py:314: InformationOnly: Normalizing '2.54.0.dev' to '2.54.0.dev0'
self.metadata.version = self._normalize_version(self.metadata.version)
warning: no files found matching 'README.md'
warning: no files found matching 'NOTICE'
warning: no files found matching 'LICENSE'
warning: no files found matching 'LICENSE.python'
<string>:32: DeprecationWarning: pkg_resources is deprecated as an API. See https://setuptools.pypa.io/en/latest/pkg_resources.html
/tmp/build-env-ubd4anp6/lib/python3.8/site-packages/setuptools/dist.py:314: InformationOnly: Normalizing '2.54.0.dev' to '2.54.0.dev0'
self.metadata.version = self._normalize_version(self.metadata.version)
warning: no files found matching 'README.md'
warning: no files found matching 'NOTICE'
warning: no files found matching 'LICENSE'
warning: no files found matching 'LICENSE.python'
warning: sdist: standard file not found: should have one of README, README.rst, README.txt, README.md
> Task :release:go-licenses:java:createLicenses
> Task :sdks:java:container:java8:copyGolangLicenses
> Task :runners:flink:1.16:job-server:shadowJar
> Task :sdks:java:container:goBuild
> Task :sdks:java:container:java8:copySdkHarnessLauncher
> Task :sdks:java:container:java8:dockerPrepare
> Task :sdks:java:container:java8:docker
#1 [internal] load .dockerignore
#1 transferring context: 2B done
#1 DONE 1.3s
#2 [internal] load build definition from Dockerfile
#2 transferring dockerfile: 2.59kB done
#2 DONE 1.3s
#3 [internal] load metadata for docker.io/library/eclipse-temurin:8
#3 DONE 0.4s
#4 [ 1/16] FROM docker.io/library/eclipse-temurin:8@sha256:19a59f52ec21d08615c87e5c59a287c4ddeafda0e33be26b463803d663d4c614
#4 resolve docker.io/library/eclipse-temurin:8@sha256:19a59f52ec21d08615c87e5c59a287c4ddeafda0e33be26b463803d663d4c614 0.0s done
#4 CACHED
#5 [internal] load build context
#5 transferring context: 47.44MB 0.5s done
> Task :runners:flink:1.16:job-server:shadowJar FROM-CACHE
> Task :sdks:java:container:java8:docker
#5 DONE 1.1s
#6 [ 2/16] ADD target/slf4j-api.jar /opt/apache/beam/jars/
#6 DONE 48.4s
#7 [ 3/16] ADD target/slf4j-jdk14.jar /opt/apache/beam/jars/
#7 DONE 206.0s
#8 [ 4/16] ADD target/jcl-over-slf4j.jar /opt/apache/beam/jars/
#8 DONE 11.9s
#9 [ 5/16] ADD target/log4j-over-slf4j.jar /opt/apache/beam/jars/
#9 DONE 7.1s
#10 [ 6/16] ADD target/log4j-to-slf4j.jar /opt/apache/beam/jars/
#10 DONE 5.2s
#11 [ 7/16] ADD target/beam-sdks-java-harness.jar /opt/apache/beam/jars/
#11 DONE 3.4s
#12 [ 8/16] COPY target/jamm.jar target/open-module-agent*.jar /opt/apache/beam/jars/
#12 DONE 0.6s
#13 [ 9/16] COPY target/linux_amd64/boot /opt/apache/beam/
#13 DONE 4.0s
#14 [10/16] COPY target/LICENSE /opt/apache/beam/
#14 DONE 0.4s
#15 [11/16] COPY target/NOTICE /opt/apache/beam/
#15 DONE 4.6s
#16 [12/16] ADD target/third_party_licenses /opt/apache/beam/third_party_licenses/
#16 DONE 2.5s
#17 [13/16] COPY target/LICENSE target/options/* /opt/apache/beam/options/
#17 DONE 1.0s
#18 [14/16] COPY target/go-licenses/* /opt/apache/beam/third_party_licenses/golang/
#18 DONE 0.6s
#19 [15/16] RUN if [ "true" = "false" ] ; then rm -rf /opt/apache/beam/third_party_licenses ; fi
#19 DONE 0.8s
#20 [16/16] COPY target/profiler/* /opt/google_cloud_profiler/
#20 DONE 0.3s
#21 exporting to image
#21 exporting layers
#21 exporting layers 0.2s done
#21 writing image sha256:5fa6ab57d0ba25bdbea1dcb82ea5fc1b3ee9c02e4381dff2cfe2599f04b7f38b done
#21 naming to docker.io/apache/beam_java8_sdk:2.54.0.dev done
#21 DONE 0.2s
> Task :sdks:python:test-suites:portable:py38:flinkCompatibilityMatrixLOOPBACK
Traceback (most recent call last):
File "/home/jenkins/jenkins-slave/workspace/beam_PostCommit_Python_VR_Flink/src/sdks/python/test-suites/portable/py38/build/srcs/sdks/python/apache_beam/runners/worker/sdk_worker.py", line 300, in _execute
response = task()
File "/home/jenkins/jenkins-slave/workspace/beam_PostCommit_Python_VR_Flink/src/sdks/python/test-suites/portable/py38/build/srcs/sdks/python/apache_beam/runners/worker/sdk_worker.py", line 375, in <lambda>
lambda: self.create_worker().do_instruction(request), request)
File "/home/jenkins/jenkins-slave/workspace/beam_PostCommit_Python_VR_Flink/src/sdks/python/test-suites/portable/py38/build/srcs/sdks/python/apache_beam/runners/worker/sdk_worker.py", line 639, in do_instruction
return getattr(self, request_type)(
File "/home/jenkins/jenkins-slave/workspace/beam_PostCommit_Python_VR_Flink/src/sdks/python/test-suites/portable/py38/build/srcs/sdks/python/apache_beam/runners/worker/sdk_worker.py", line 670, in process_bundle
bundle_processor = self.bundle_processor_cache.get(
File "/home/jenkins/jenkins-slave/workspace/beam_PostCommit_Python_VR_Flink/src/sdks/python/test-suites/portable/py38/build/srcs/sdks/python/apache_beam/runners/worker/sdk_worker.py", line 497, in get
pbd.MergeFrom(self.fns[bundle_descriptor_id])
File "/home/jenkins/jenkins-slave/workspace/beam_PostCommit_Python_VR_Flink/src/sdks/python/test-suites/portable/py38/build/srcs/sdks/python/apache_beam/runners/worker/sdk_worker.py", line 1403, in __missing__
self[key] = self.default_factory(key) # type: ignore # pylint: disable=E1137
File "/home/jenkins/jenkins-slave/workspace/beam_PostCommit_Python_VR_Flink/src/sdks/python/test-suites/portable/py38/build/srcs/sdks/python/apache_beam/runners/worker/sdk_worker.py", line 210, in default_factory
return self._control_stub.GetProcessBundleDescriptor(
File "/home/jenkins/jenkins-slave/workspace/beam_PostCommit_Python_VR_Flink/src/sdks/python/test-suites/portable/py38/build/srcs/sdks/python/target/.tox-flink-runner-test/flink-runner-test/lib/python3.8/site-packages/grpc/_interceptor.py", line 277, in __call__
response, ignored_call = self._with_call(
File "/home/jenkins/jenkins-slave/workspace/beam_PostCommit_Python_VR_Flink/src/sdks/python/test-suites/portable/py38/build/srcs/sdks/python/target/.tox-flink-runner-test/flink-runner-test/lib/python3.8/site-packages/grpc/_interceptor.py", line 332, in _with_call
return call.result(), call
File "/home/jenkins/jenkins-slave/workspace/beam_PostCommit_Python_VR_Flink/src/sdks/python/test-suites/portable/py38/build/srcs/sdks/python/target/.tox-flink-runner-test/flink-runner-test/lib/python3.8/site-packages/grpc/_channel.py", line 437, in result
raise self
File "/home/jenkins/jenkins-slave/workspace/beam_PostCommit_Python_VR_Flink/src/sdks/python/test-suites/portable/py38/build/srcs/sdks/python/target/.tox-flink-runner-test/flink-runner-test/lib/python3.8/site-packages/grpc/_interceptor.py", line 315, in continuation
response, call = self._thunk(new_method).with_call(
File "/home/jenkins/jenkins-slave/workspace/beam_PostCommit_Python_VR_Flink/src/sdks/python/test-suites/portable/py38/build/srcs/sdks/python/target/.tox-flink-runner-test/flink-runner-test/lib/python3.8/site-packages/grpc/_channel.py", line 1177, in with_call
return _end_unary_response_blocking(state, call, True, None)
File "/home/jenkins/jenkins-slave/workspace/beam_PostCommit_Python_VR_Flink/src/sdks/python/test-suites/portable/py38/build/srcs/sdks/python/target/.tox-flink-runner-test/flink-runner-test/lib/python3.8/site-packages/grpc/_channel.py", line 1003, in _end_unary_response_blocking
raise _InactiveRpcError(state) # pytype: disable=not-instantiable
grpc._channel._InactiveRpcError: <_InactiveRpcError of RPC that terminated with:
status = StatusCode.UNAVAILABLE
details = "failed to connect to all addresses; last error: UNKNOWN: ipv4:127.0.0.1:40595: Failed to connect to remote host: Connection refused"
debug_error_string = "UNKNOWN:Error received from peer {created_time:"2024-01-19T12:37:56.430208997+00:00", grpc_status:14, grpc_message:"failed to connect to all addresses; last error: UNKNOWN: ipv4:127.0.0.1:40595: Failed to connect to remote host: Connection refused"}"
>
Traceback (most recent call last):
File "/home/jenkins/jenkins-slave/workspace/beam_PostCommit_Python_VR_Flink/src/sdks/python/test-suites/portable/py38/build/srcs/sdks/python/apache_beam/runners/worker/data_plane.py", line 508, in input_elements
element = received.get(timeout=1)
File "/usr/lib/python3.8/queue.py", line 178, in get
raise Empty
_queue.Empty
During handling of the above exception, another exception occurred:
Traceback (most recent call last):
File "/home/jenkins/jenkins-slave/workspace/beam_PostCommit_Python_VR_Flink/src/sdks/python/test-suites/portable/py38/build/srcs/sdks/python/apache_beam/runners/worker/sdk_worker.py", line 300, in _execute
response = task()
File "/home/jenkins/jenkins-slave/workspace/beam_PostCommit_Python_VR_Flink/src/sdks/python/test-suites/portable/py38/build/srcs/sdks/python/apache_beam/runners/worker/sdk_worker.py", line 375, in <lambda>
lambda: self.create_worker().do_instruction(request), request)
File "/home/jenkins/jenkins-slave/workspace/beam_PostCommit_Python_VR_Flink/src/sdks/python/test-suites/portable/py38/build/srcs/sdks/python/apache_beam/runners/worker/sdk_worker.py", line 639, in do_instruction
return getattr(self, request_type)(
File "/home/jenkins/jenkins-slave/workspace/beam_PostCommit_Python_VR_Flink/src/sdks/python/test-suites/portable/py38/build/srcs/sdks/python/apache_beam/runners/worker/sdk_worker.py", line 677, in process_bundle
bundle_processor.process_bundle(instruction_id))
File "/home/jenkins/jenkins-slave/workspace/beam_PostCommit_Python_VR_Flink/src/sdks/python/test-suites/portable/py38/build/srcs/sdks/python/apache_beam/runners/worker/bundle_processor.py", line 1102, in process_bundle
for element in data_channel.input_elements(instruction_id,
File "/home/jenkins/jenkins-slave/workspace/beam_PostCommit_Python_VR_Flink/src/sdks/python/test-suites/portable/py38/build/srcs/sdks/python/apache_beam/runners/worker/data_plane.py", line 511, in input_elements
raise RuntimeError('Channel closed prematurely.')
RuntimeError: Channel closed prematurely.
FATAL: command execution failed
java.io.IOException: Backing channel 'apache-beam-jenkins-15' is disconnected.
at hudson.remoting.RemoteInvocationHandler.channelOrFail(RemoteInvocationHandler.java:215)
at hudson.remoting.RemoteInvocationHandler.invoke(RemoteInvocationHandler.java:285)
at com.sun.proxy.$Proxy208.isAlive(Unknown Source)
at hudson.Launcher$RemoteLauncher$ProcImpl.isAlive(Launcher.java:1215)
at hudson.Launcher$RemoteLauncher$ProcImpl.join(Launcher.java:1207)
at hudson.Launcher$ProcStarter.join(Launcher.java:524)
at hudson.plugins.gradle.Gradle.perform(Gradle.java:321)
at hudson.tasks.BuildStepMonitor$1.perform(BuildStepMonitor.java:20)
at hudson.model.AbstractBuild$AbstractBuildExecution.perform(AbstractBuild.java:818)
at hudson.model.Build$BuildExecution.build(Build.java:199)
at hudson.model.Build$BuildExecution.doRun(Build.java:164)
at hudson.model.AbstractBuild$AbstractBuildExecution.run(AbstractBuild.java:526)
at hudson.model.Run.execute(Run.java:1900)
at hudson.model.FreeStyleBuild.run(FreeStyleBuild.java:44)
at hudson.model.ResourceController.execute(ResourceController.java:101)
at hudson.model.Executor.run(Executor.java:442)
Caused by: hudson.remoting.Channel$OrderlyShutdown: Command Close created at
at hudson.remoting.Channel$CloseCommand.execute(Channel.java:1313)
at hudson.remoting.Channel$1.handle(Channel.java:606)
at hudson.remoting.SynchronousCommandTransport$ReaderThread.run(SynchronousCommandTransport.java:81)
Caused by: Command Close created at
at hudson.remoting.Command.<init>(Command.java:70)
at hudson.remoting.Channel$CloseCommand.<init>(Channel.java:1306)
at hudson.remoting.Channel.close(Channel.java:1480)
at hudson.remoting.Channel.close(Channel.java:1447)
at hudson.remoting.Channel$CloseCommand.execute(Channel.java:1312)
at hudson.remoting.Channel$1.handle(Channel.java:606)
at hudson.remoting.SynchronousCommandTransport$ReaderThread.run(SynchronousCommandTransport.java:81)
Build step 'Invoke Gradle script' changed build result to FAILURE
Build step 'Invoke Gradle script' marked build as failure
ERROR: apache-beam-jenkins-15 is offline; cannot locate jdk_1.8_latest
---------------------------------------------------------------------
To unsubscribe, e-mail: builds-unsubscribe@beam.apache.org
For additional commands, e-mail: builds-help@beam.apache.org