You are viewing a plain text version of this content. The canonical link for it is here.
Posted to dev@hbase.apache.org by "Andrew Purtell (JIRA)" <ji...@apache.org> on 2009/01/10 10:17:59 UTC

[jira] Created: (HBASE-1119) Test failures on TRUNK - ArrayIndexOutOfBoundsException in o.a.h.h.regionserver.HStore.compact

Test failures on TRUNK - ArrayIndexOutOfBoundsException in o.a.h.h.regionserver.HStore.compact
----------------------------------------------------------------------------------------------

                 Key: HBASE-1119
                 URL: https://issues.apache.org/jira/browse/HBASE-1119
             Project: Hadoop HBase
          Issue Type: Bug
            Reporter: Andrew Purtell
            Priority: Blocker
             Fix For: 0.19.0


I think Hudson is still hung up on the failure in TestFilter there. 

    [junit] Test org.apache.hadoop.hbase.regionserver.TestCompaction FAILED
    [junit] Test org.apache.hadoop.hbase.regionserver.TestHRegion FAILED
    [junit] Test org.apache.hadoop.hbase.regionserver.TestSplit FAILED
    [junit] Test org.apache.hadoop.hbase.util.TestMergeTool FAILED

Same error on all but TestMergeTool:

java.lang.ArrayIndexOutOfBoundsException: 2
        at org.apache.hadoop.hbase.regionserver.HStore.compact(HStore.java:872)
        at org.apache.hadoop.hbase.regionserver.HRegion.compactStores(HRegion.java:725)
        at org.apache.hadoop.hbase.regionserver.HRegion.compactStores(HRegion.java:682)
        at org.apache.hadoop.hbase.regionserver.TestHRegion.splitAndMerge(TestHRegion.java:518)
        at org.apache.hadoop.hbase.regionserver.TestHRegion.testHRegion(TestHRegion.java:63)

For TestMergeTool:

'unit.framework.AssertionFailedError: 'merging regions 0 and 1' failed
        at org.apache.hadoop.hbase.util.TestMergeTool.mergeAndVerify(TestMergeTool.java:162)
        at org.apache.hadoop.hbase.util.TestMergeTool.testMergeTool(TestMergeTool.java:211)



-- 
This message is automatically generated by JIRA.
-
You can reply to this email to add a comment to the issue online.


[jira] Updated: (HBASE-1119) Test failures on TRUNK - ArrayIndexOutOfBoundsException in o.a.h.h.regionserver.HStore.compact

Posted by "Andrew Purtell (JIRA)" <ji...@apache.org>.
     [ https://issues.apache.org/jira/browse/HBASE-1119?page=com.atlassian.jira.plugin.system.issuetabpanels:all-tabpanel ]

Andrew Purtell updated HBASE-1119:
----------------------------------

    Attachment: TEST-org.apache.hadoop.hbase.regionserver.TestSplit.txt

> Test failures on TRUNK - ArrayIndexOutOfBoundsException in o.a.h.h.regionserver.HStore.compact
> ----------------------------------------------------------------------------------------------
>
>                 Key: HBASE-1119
>                 URL: https://issues.apache.org/jira/browse/HBASE-1119
>             Project: Hadoop HBase
>          Issue Type: Bug
>            Reporter: Andrew Purtell
>            Priority: Blocker
>             Fix For: 0.19.0
>
>         Attachments: TEST-org.apache.hadoop.hbase.regionserver.TestCompaction.txt, TEST-org.apache.hadoop.hbase.regionserver.TestHRegion.txt, TEST-org.apache.hadoop.hbase.regionserver.TestSplit.txt, TEST-org.apache.hadoop.hbase.util.TestMergeTool.txt
>
>
> I think Hudson is still hung up on the failure in TestFilter there. 
>     [junit] Test org.apache.hadoop.hbase.regionserver.TestCompaction FAILED
>     [junit] Test org.apache.hadoop.hbase.regionserver.TestHRegion FAILED
>     [junit] Test org.apache.hadoop.hbase.regionserver.TestSplit FAILED
>     [junit] Test org.apache.hadoop.hbase.util.TestMergeTool FAILED
> Same error on all but TestMergeTool:
> java.lang.ArrayIndexOutOfBoundsException: 2
>         at org.apache.hadoop.hbase.regionserver.HStore.compact(HStore.java:872)
>         at org.apache.hadoop.hbase.regionserver.HRegion.compactStores(HRegion.java:725)
>         at org.apache.hadoop.hbase.regionserver.HRegion.compactStores(HRegion.java:682)
>         at org.apache.hadoop.hbase.regionserver.TestHRegion.splitAndMerge(TestHRegion.java:518)
>         at org.apache.hadoop.hbase.regionserver.TestHRegion.testHRegion(TestHRegion.java:63)
> For TestMergeTool:
> 'unit.framework.AssertionFailedError: 'merging regions 0 and 1' failed
>         at org.apache.hadoop.hbase.util.TestMergeTool.mergeAndVerify(TestMergeTool.java:162)
>         at org.apache.hadoop.hbase.util.TestMergeTool.testMergeTool(TestMergeTool.java:211)

-- 
This message is automatically generated by JIRA.
-
You can reply to this email to add a comment to the issue online.


[jira] Updated: (HBASE-1119) Test failures on TRUNK - ArrayIndexOutOfBoundsException in o.a.h.h.regionserver.HStore.compact

Posted by "Andrew Purtell (JIRA)" <ji...@apache.org>.
     [ https://issues.apache.org/jira/browse/HBASE-1119?page=com.atlassian.jira.plugin.system.issuetabpanels:all-tabpanel ]

Andrew Purtell updated HBASE-1119:
----------------------------------

    Attachment: TEST-org.apache.hadoop.hbase.regionserver.TestHRegion.txt

> Test failures on TRUNK - ArrayIndexOutOfBoundsException in o.a.h.h.regionserver.HStore.compact
> ----------------------------------------------------------------------------------------------
>
>                 Key: HBASE-1119
>                 URL: https://issues.apache.org/jira/browse/HBASE-1119
>             Project: Hadoop HBase
>          Issue Type: Bug
>            Reporter: Andrew Purtell
>            Priority: Blocker
>             Fix For: 0.19.0
>
>         Attachments: TEST-org.apache.hadoop.hbase.regionserver.TestCompaction.txt, TEST-org.apache.hadoop.hbase.regionserver.TestHRegion.txt
>
>
> I think Hudson is still hung up on the failure in TestFilter there. 
>     [junit] Test org.apache.hadoop.hbase.regionserver.TestCompaction FAILED
>     [junit] Test org.apache.hadoop.hbase.regionserver.TestHRegion FAILED
>     [junit] Test org.apache.hadoop.hbase.regionserver.TestSplit FAILED
>     [junit] Test org.apache.hadoop.hbase.util.TestMergeTool FAILED
> Same error on all but TestMergeTool:
> java.lang.ArrayIndexOutOfBoundsException: 2
>         at org.apache.hadoop.hbase.regionserver.HStore.compact(HStore.java:872)
>         at org.apache.hadoop.hbase.regionserver.HRegion.compactStores(HRegion.java:725)
>         at org.apache.hadoop.hbase.regionserver.HRegion.compactStores(HRegion.java:682)
>         at org.apache.hadoop.hbase.regionserver.TestHRegion.splitAndMerge(TestHRegion.java:518)
>         at org.apache.hadoop.hbase.regionserver.TestHRegion.testHRegion(TestHRegion.java:63)
> For TestMergeTool:
> 'unit.framework.AssertionFailedError: 'merging regions 0 and 1' failed
>         at org.apache.hadoop.hbase.util.TestMergeTool.mergeAndVerify(TestMergeTool.java:162)
>         at org.apache.hadoop.hbase.util.TestMergeTool.testMergeTool(TestMergeTool.java:211)

-- 
This message is automatically generated by JIRA.
-
You can reply to this email to add a comment to the issue online.


[jira] Issue Comment Edited: (HBASE-1119) Test failures on TRUNK - ArrayIndexOutOfBoundsException in o.a.h.h.regionserver.HStore.compact

Posted by "Andrew Purtell (JIRA)" <ji...@apache.org>.
    [ https://issues.apache.org/jira/browse/HBASE-1119?page=com.atlassian.jira.plugin.system.issuetabpanels:comment-tabpanel&focusedCommentId=12662678#action_12662678 ] 

apurtell edited comment on HBASE-1119 at 1/10/09 9:58 AM:
----------------------------------------------------------------

It's a one line typo:

org.apache.hadoop.hbase.regionserver.HStore.compact(HStore.java:871)

{code}
-  for (int ii = 0; fss != null && i < fss.length; ii++)
+  for (int ii = 0; fss != null && ii < fss.length; ii++)
{code}

Committing if local tests pass again.

      was (Author: apurtell):
    It's a one line typo:

org.apache.hadoop.hbase.regionserver.HStore.compact(HStore.java:871)

-   for (int ii = 0; fss != null && i < fss.length; ii++)
+  for (int ii = 0; fss != null && ii < fss.length; ii++)

Committing if local tests pass again.
  
> Test failures on TRUNK - ArrayIndexOutOfBoundsException in o.a.h.h.regionserver.HStore.compact
> ----------------------------------------------------------------------------------------------
>
>                 Key: HBASE-1119
>                 URL: https://issues.apache.org/jira/browse/HBASE-1119
>             Project: Hadoop HBase
>          Issue Type: Bug
>            Reporter: Andrew Purtell
>            Assignee: Andrew Purtell
>            Priority: Blocker
>             Fix For: 0.19.0
>
>         Attachments: TEST-org.apache.hadoop.hbase.regionserver.TestCompaction.txt, TEST-org.apache.hadoop.hbase.regionserver.TestHRegion.txt, TEST-org.apache.hadoop.hbase.regionserver.TestSplit.txt, TEST-org.apache.hadoop.hbase.util.TestMergeTool.txt
>
>
> I think Hudson is still hung up on the failure in TestFilter there. 
>     [junit] Test org.apache.hadoop.hbase.regionserver.TestCompaction FAILED
>     [junit] Test org.apache.hadoop.hbase.regionserver.TestHRegion FAILED
>     [junit] Test org.apache.hadoop.hbase.regionserver.TestSplit FAILED
>     [junit] Test org.apache.hadoop.hbase.util.TestMergeTool FAILED
> Same error on all but TestMergeTool:
> java.lang.ArrayIndexOutOfBoundsException: 2
>         at org.apache.hadoop.hbase.regionserver.HStore.compact(HStore.java:872)
>         at org.apache.hadoop.hbase.regionserver.HRegion.compactStores(HRegion.java:725)
>         at org.apache.hadoop.hbase.regionserver.HRegion.compactStores(HRegion.java:682)
>         at org.apache.hadoop.hbase.regionserver.TestHRegion.splitAndMerge(TestHRegion.java:518)
>         at org.apache.hadoop.hbase.regionserver.TestHRegion.testHRegion(TestHRegion.java:63)
> For TestMergeTool:
> 'unit.framework.AssertionFailedError: 'merging regions 0 and 1' failed
>         at org.apache.hadoop.hbase.util.TestMergeTool.mergeAndVerify(TestMergeTool.java:162)
>         at org.apache.hadoop.hbase.util.TestMergeTool.testMergeTool(TestMergeTool.java:211)

-- 
This message is automatically generated by JIRA.
-
You can reply to this email to add a comment to the issue online.


[jira] Assigned: (HBASE-1119) Test failures on TRUNK - ArrayIndexOutOfBoundsException in o.a.h.h.regionserver.HStore.compact

Posted by "Andrew Purtell (JIRA)" <ji...@apache.org>.
     [ https://issues.apache.org/jira/browse/HBASE-1119?page=com.atlassian.jira.plugin.system.issuetabpanels:all-tabpanel ]

Andrew Purtell reassigned HBASE-1119:
-------------------------------------

    Assignee: Andrew Purtell

> Test failures on TRUNK - ArrayIndexOutOfBoundsException in o.a.h.h.regionserver.HStore.compact
> ----------------------------------------------------------------------------------------------
>
>                 Key: HBASE-1119
>                 URL: https://issues.apache.org/jira/browse/HBASE-1119
>             Project: Hadoop HBase
>          Issue Type: Bug
>            Reporter: Andrew Purtell
>            Assignee: Andrew Purtell
>            Priority: Blocker
>             Fix For: 0.19.0
>
>         Attachments: TEST-org.apache.hadoop.hbase.regionserver.TestCompaction.txt, TEST-org.apache.hadoop.hbase.regionserver.TestHRegion.txt, TEST-org.apache.hadoop.hbase.regionserver.TestSplit.txt, TEST-org.apache.hadoop.hbase.util.TestMergeTool.txt
>
>
> I think Hudson is still hung up on the failure in TestFilter there. 
>     [junit] Test org.apache.hadoop.hbase.regionserver.TestCompaction FAILED
>     [junit] Test org.apache.hadoop.hbase.regionserver.TestHRegion FAILED
>     [junit] Test org.apache.hadoop.hbase.regionserver.TestSplit FAILED
>     [junit] Test org.apache.hadoop.hbase.util.TestMergeTool FAILED
> Same error on all but TestMergeTool:
> java.lang.ArrayIndexOutOfBoundsException: 2
>         at org.apache.hadoop.hbase.regionserver.HStore.compact(HStore.java:872)
>         at org.apache.hadoop.hbase.regionserver.HRegion.compactStores(HRegion.java:725)
>         at org.apache.hadoop.hbase.regionserver.HRegion.compactStores(HRegion.java:682)
>         at org.apache.hadoop.hbase.regionserver.TestHRegion.splitAndMerge(TestHRegion.java:518)
>         at org.apache.hadoop.hbase.regionserver.TestHRegion.testHRegion(TestHRegion.java:63)
> For TestMergeTool:
> 'unit.framework.AssertionFailedError: 'merging regions 0 and 1' failed
>         at org.apache.hadoop.hbase.util.TestMergeTool.mergeAndVerify(TestMergeTool.java:162)
>         at org.apache.hadoop.hbase.util.TestMergeTool.testMergeTool(TestMergeTool.java:211)

-- 
This message is automatically generated by JIRA.
-
You can reply to this email to add a comment to the issue online.


[jira] Updated: (HBASE-1119) Test failures on TRUNK - ArrayIndexOutOfBoundsException in o.a.h.h.regionserver.HStore.compact

Posted by "Andrew Purtell (JIRA)" <ji...@apache.org>.
     [ https://issues.apache.org/jira/browse/HBASE-1119?page=com.atlassian.jira.plugin.system.issuetabpanels:all-tabpanel ]

Andrew Purtell updated HBASE-1119:
----------------------------------

    Attachment: TEST-org.apache.hadoop.hbase.util.TestMergeTool.txt

> Test failures on TRUNK - ArrayIndexOutOfBoundsException in o.a.h.h.regionserver.HStore.compact
> ----------------------------------------------------------------------------------------------
>
>                 Key: HBASE-1119
>                 URL: https://issues.apache.org/jira/browse/HBASE-1119
>             Project: Hadoop HBase
>          Issue Type: Bug
>            Reporter: Andrew Purtell
>            Priority: Blocker
>             Fix For: 0.19.0
>
>         Attachments: TEST-org.apache.hadoop.hbase.regionserver.TestCompaction.txt, TEST-org.apache.hadoop.hbase.regionserver.TestHRegion.txt, TEST-org.apache.hadoop.hbase.regionserver.TestSplit.txt, TEST-org.apache.hadoop.hbase.util.TestMergeTool.txt
>
>
> I think Hudson is still hung up on the failure in TestFilter there. 
>     [junit] Test org.apache.hadoop.hbase.regionserver.TestCompaction FAILED
>     [junit] Test org.apache.hadoop.hbase.regionserver.TestHRegion FAILED
>     [junit] Test org.apache.hadoop.hbase.regionserver.TestSplit FAILED
>     [junit] Test org.apache.hadoop.hbase.util.TestMergeTool FAILED
> Same error on all but TestMergeTool:
> java.lang.ArrayIndexOutOfBoundsException: 2
>         at org.apache.hadoop.hbase.regionserver.HStore.compact(HStore.java:872)
>         at org.apache.hadoop.hbase.regionserver.HRegion.compactStores(HRegion.java:725)
>         at org.apache.hadoop.hbase.regionserver.HRegion.compactStores(HRegion.java:682)
>         at org.apache.hadoop.hbase.regionserver.TestHRegion.splitAndMerge(TestHRegion.java:518)
>         at org.apache.hadoop.hbase.regionserver.TestHRegion.testHRegion(TestHRegion.java:63)
> For TestMergeTool:
> 'unit.framework.AssertionFailedError: 'merging regions 0 and 1' failed
>         at org.apache.hadoop.hbase.util.TestMergeTool.mergeAndVerify(TestMergeTool.java:162)
>         at org.apache.hadoop.hbase.util.TestMergeTool.testMergeTool(TestMergeTool.java:211)

-- 
This message is automatically generated by JIRA.
-
You can reply to this email to add a comment to the issue online.


[jira] Updated: (HBASE-1119) Test failures on TRUNK - ArrayIndexOutOfBoundsException in o.a.h.h.regionserver.HStore.compact

Posted by "Andrew Purtell (JIRA)" <ji...@apache.org>.
     [ https://issues.apache.org/jira/browse/HBASE-1119?page=com.atlassian.jira.plugin.system.issuetabpanels:all-tabpanel ]

Andrew Purtell updated HBASE-1119:
----------------------------------

    Attachment: TEST-org.apache.hadoop.hbase.regionserver.TestCompaction.txt

> Test failures on TRUNK - ArrayIndexOutOfBoundsException in o.a.h.h.regionserver.HStore.compact
> ----------------------------------------------------------------------------------------------
>
>                 Key: HBASE-1119
>                 URL: https://issues.apache.org/jira/browse/HBASE-1119
>             Project: Hadoop HBase
>          Issue Type: Bug
>            Reporter: Andrew Purtell
>            Priority: Blocker
>             Fix For: 0.19.0
>
>         Attachments: TEST-org.apache.hadoop.hbase.regionserver.TestCompaction.txt, TEST-org.apache.hadoop.hbase.regionserver.TestHRegion.txt
>
>
> I think Hudson is still hung up on the failure in TestFilter there. 
>     [junit] Test org.apache.hadoop.hbase.regionserver.TestCompaction FAILED
>     [junit] Test org.apache.hadoop.hbase.regionserver.TestHRegion FAILED
>     [junit] Test org.apache.hadoop.hbase.regionserver.TestSplit FAILED
>     [junit] Test org.apache.hadoop.hbase.util.TestMergeTool FAILED
> Same error on all but TestMergeTool:
> java.lang.ArrayIndexOutOfBoundsException: 2
>         at org.apache.hadoop.hbase.regionserver.HStore.compact(HStore.java:872)
>         at org.apache.hadoop.hbase.regionserver.HRegion.compactStores(HRegion.java:725)
>         at org.apache.hadoop.hbase.regionserver.HRegion.compactStores(HRegion.java:682)
>         at org.apache.hadoop.hbase.regionserver.TestHRegion.splitAndMerge(TestHRegion.java:518)
>         at org.apache.hadoop.hbase.regionserver.TestHRegion.testHRegion(TestHRegion.java:63)
> For TestMergeTool:
> 'unit.framework.AssertionFailedError: 'merging regions 0 and 1' failed
>         at org.apache.hadoop.hbase.util.TestMergeTool.mergeAndVerify(TestMergeTool.java:162)
>         at org.apache.hadoop.hbase.util.TestMergeTool.testMergeTool(TestMergeTool.java:211)

-- 
This message is automatically generated by JIRA.
-
You can reply to this email to add a comment to the issue online.


[jira] Commented: (HBASE-1119) Test failures on TRUNK - ArrayIndexOutOfBoundsException in o.a.h.h.regionserver.HStore.compact

Posted by "Andrew Purtell (JIRA)" <ji...@apache.org>.
    [ https://issues.apache.org/jira/browse/HBASE-1119?page=com.atlassian.jira.plugin.system.issuetabpanels:comment-tabpanel&focusedCommentId=12662678#action_12662678 ] 

Andrew Purtell commented on HBASE-1119:
---------------------------------------

It's a one line typo:

org.apache.hadoop.hbase.regionserver.HStore.compact(HStore.java:871)

-   for (int ii = 0; fss != null && i < fss.length; ii++)
+  for (int ii = 0; fss != null && ii < fss.length; ii++)

Committing if local tests pass again.

> Test failures on TRUNK - ArrayIndexOutOfBoundsException in o.a.h.h.regionserver.HStore.compact
> ----------------------------------------------------------------------------------------------
>
>                 Key: HBASE-1119
>                 URL: https://issues.apache.org/jira/browse/HBASE-1119
>             Project: Hadoop HBase
>          Issue Type: Bug
>            Reporter: Andrew Purtell
>            Assignee: Andrew Purtell
>            Priority: Blocker
>             Fix For: 0.19.0
>
>         Attachments: TEST-org.apache.hadoop.hbase.regionserver.TestCompaction.txt, TEST-org.apache.hadoop.hbase.regionserver.TestHRegion.txt, TEST-org.apache.hadoop.hbase.regionserver.TestSplit.txt, TEST-org.apache.hadoop.hbase.util.TestMergeTool.txt
>
>
> I think Hudson is still hung up on the failure in TestFilter there. 
>     [junit] Test org.apache.hadoop.hbase.regionserver.TestCompaction FAILED
>     [junit] Test org.apache.hadoop.hbase.regionserver.TestHRegion FAILED
>     [junit] Test org.apache.hadoop.hbase.regionserver.TestSplit FAILED
>     [junit] Test org.apache.hadoop.hbase.util.TestMergeTool FAILED
> Same error on all but TestMergeTool:
> java.lang.ArrayIndexOutOfBoundsException: 2
>         at org.apache.hadoop.hbase.regionserver.HStore.compact(HStore.java:872)
>         at org.apache.hadoop.hbase.regionserver.HRegion.compactStores(HRegion.java:725)
>         at org.apache.hadoop.hbase.regionserver.HRegion.compactStores(HRegion.java:682)
>         at org.apache.hadoop.hbase.regionserver.TestHRegion.splitAndMerge(TestHRegion.java:518)
>         at org.apache.hadoop.hbase.regionserver.TestHRegion.testHRegion(TestHRegion.java:63)
> For TestMergeTool:
> 'unit.framework.AssertionFailedError: 'merging regions 0 and 1' failed
>         at org.apache.hadoop.hbase.util.TestMergeTool.mergeAndVerify(TestMergeTool.java:162)
>         at org.apache.hadoop.hbase.util.TestMergeTool.testMergeTool(TestMergeTool.java:211)

-- 
This message is automatically generated by JIRA.
-
You can reply to this email to add a comment to the issue online.


[jira] Commented: (HBASE-1119) Test failures on TRUNK - ArrayIndexOutOfBoundsException in o.a.h.h.regionserver.HStore.compact

Posted by "stack (JIRA)" <ji...@apache.org>.
    [ https://issues.apache.org/jira/browse/HBASE-1119?page=com.atlassian.jira.plugin.system.issuetabpanels:comment-tabpanel&focusedCommentId=12662680#action_12662680 ] 

stack commented on HBASE-1119:
------------------------------

THanks for fixing my boo-boo Andrew

> Test failures on TRUNK - ArrayIndexOutOfBoundsException in o.a.h.h.regionserver.HStore.compact
> ----------------------------------------------------------------------------------------------
>
>                 Key: HBASE-1119
>                 URL: https://issues.apache.org/jira/browse/HBASE-1119
>             Project: Hadoop HBase
>          Issue Type: Bug
>            Reporter: Andrew Purtell
>            Assignee: Andrew Purtell
>            Priority: Blocker
>             Fix For: 0.19.0
>
>         Attachments: TEST-org.apache.hadoop.hbase.regionserver.TestCompaction.txt, TEST-org.apache.hadoop.hbase.regionserver.TestHRegion.txt, TEST-org.apache.hadoop.hbase.regionserver.TestSplit.txt, TEST-org.apache.hadoop.hbase.util.TestMergeTool.txt
>
>
> I think Hudson is still hung up on the failure in TestFilter there. 
>     [junit] Test org.apache.hadoop.hbase.regionserver.TestCompaction FAILED
>     [junit] Test org.apache.hadoop.hbase.regionserver.TestHRegion FAILED
>     [junit] Test org.apache.hadoop.hbase.regionserver.TestSplit FAILED
>     [junit] Test org.apache.hadoop.hbase.util.TestMergeTool FAILED
> Same error on all but TestMergeTool:
> java.lang.ArrayIndexOutOfBoundsException: 2
>         at org.apache.hadoop.hbase.regionserver.HStore.compact(HStore.java:872)
>         at org.apache.hadoop.hbase.regionserver.HRegion.compactStores(HRegion.java:725)
>         at org.apache.hadoop.hbase.regionserver.HRegion.compactStores(HRegion.java:682)
>         at org.apache.hadoop.hbase.regionserver.TestHRegion.splitAndMerge(TestHRegion.java:518)
>         at org.apache.hadoop.hbase.regionserver.TestHRegion.testHRegion(TestHRegion.java:63)
> For TestMergeTool:
> 'unit.framework.AssertionFailedError: 'merging regions 0 and 1' failed
>         at org.apache.hadoop.hbase.util.TestMergeTool.mergeAndVerify(TestMergeTool.java:162)
>         at org.apache.hadoop.hbase.util.TestMergeTool.testMergeTool(TestMergeTool.java:211)

-- 
This message is automatically generated by JIRA.
-
You can reply to this email to add a comment to the issue online.


[jira] Resolved: (HBASE-1119) Test failures on TRUNK - ArrayIndexOutOfBoundsException in o.a.h.h.regionserver.HStore.compact

Posted by "Andrew Purtell (JIRA)" <ji...@apache.org>.
     [ https://issues.apache.org/jira/browse/HBASE-1119?page=com.atlassian.jira.plugin.system.issuetabpanels:all-tabpanel ]

Andrew Purtell resolved HBASE-1119.
-----------------------------------

    Resolution: Fixed

Committed. Passes all local tests.

> Test failures on TRUNK - ArrayIndexOutOfBoundsException in o.a.h.h.regionserver.HStore.compact
> ----------------------------------------------------------------------------------------------
>
>                 Key: HBASE-1119
>                 URL: https://issues.apache.org/jira/browse/HBASE-1119
>             Project: Hadoop HBase
>          Issue Type: Bug
>            Reporter: Andrew Purtell
>            Assignee: Andrew Purtell
>            Priority: Blocker
>             Fix For: 0.19.0
>
>         Attachments: TEST-org.apache.hadoop.hbase.regionserver.TestCompaction.txt, TEST-org.apache.hadoop.hbase.regionserver.TestHRegion.txt, TEST-org.apache.hadoop.hbase.regionserver.TestSplit.txt, TEST-org.apache.hadoop.hbase.util.TestMergeTool.txt
>
>
> I think Hudson is still hung up on the failure in TestFilter there. 
>     [junit] Test org.apache.hadoop.hbase.regionserver.TestCompaction FAILED
>     [junit] Test org.apache.hadoop.hbase.regionserver.TestHRegion FAILED
>     [junit] Test org.apache.hadoop.hbase.regionserver.TestSplit FAILED
>     [junit] Test org.apache.hadoop.hbase.util.TestMergeTool FAILED
> Same error on all but TestMergeTool:
> java.lang.ArrayIndexOutOfBoundsException: 2
>         at org.apache.hadoop.hbase.regionserver.HStore.compact(HStore.java:872)
>         at org.apache.hadoop.hbase.regionserver.HRegion.compactStores(HRegion.java:725)
>         at org.apache.hadoop.hbase.regionserver.HRegion.compactStores(HRegion.java:682)
>         at org.apache.hadoop.hbase.regionserver.TestHRegion.splitAndMerge(TestHRegion.java:518)
>         at org.apache.hadoop.hbase.regionserver.TestHRegion.testHRegion(TestHRegion.java:63)
> For TestMergeTool:
> 'unit.framework.AssertionFailedError: 'merging regions 0 and 1' failed
>         at org.apache.hadoop.hbase.util.TestMergeTool.mergeAndVerify(TestMergeTool.java:162)
>         at org.apache.hadoop.hbase.util.TestMergeTool.testMergeTool(TestMergeTool.java:211)

-- 
This message is automatically generated by JIRA.
-
You can reply to this email to add a comment to the issue online.