You are viewing a plain text version of this content. The canonical link for it is here.
Posted to builds@beam.apache.org by Apache Jenkins Server <je...@builds.apache.org> on 2020/08/11 13:14:58 UTC
Build failed in Jenkins: beam_PostCommit_Python37 #2704
See <https://ci-beam.apache.org/job/beam_PostCommit_Python37/2704/display/redirect?page=changes>
Changes:
[noreply] [BEAM-601] Run KinesisIOIT with localstack (#12422)
------------------------------------------
[...truncated 23.71 MB...]
currentStateTime: '1970-01-01T00:00:00Z'
id: '2020-08-11_06_05_46-5170263954163489099'
location: 'us-central1'
name: 'beamapp-jenkins-0811130537-505823'
projectId: 'apache-beam-testing'
stageStates: []
startTime: '2020-08-11T13:05:48.687719Z'
steps: []
tempFiles: []
type: TypeValueValuesEnum(JOB_TYPE_BATCH, 1)>
INFO:apache_beam.runners.dataflow.internal.apiclient:Created job with id: [2020-08-11_06_05_46-5170263954163489099]
INFO:apache_beam.runners.dataflow.internal.apiclient:Submitted job: 2020-08-11_06_05_46-5170263954163489099
INFO:apache_beam.runners.dataflow.internal.apiclient:To access the Dataflow monitoring console, please navigate to https://console.cloud.google.com/dataflow/jobs/us-central1/2020-08-11_06_05_46-5170263954163489099?project=apache-beam-testing
Worker logs: https://console.cloud.google.com/dataflow/jobs/us-central1/2020-08-11_06_05_46-5170263954163489099?project=apache-beam-testing
INFO:apache_beam.runners.dataflow.dataflow_runner:Job 2020-08-11_06_05_46-5170263954163489099 is in state JOB_STATE_RUNNING
INFO:apache_beam.runners.dataflow.dataflow_runner:2020-08-11T13:05:46.728Z: JOB_MESSAGE_DETAILED: Autoscaling is enabled for job 2020-08-11_06_05_46-5170263954163489099. The number of workers will be between 1 and 1000.
INFO:apache_beam.runners.dataflow.dataflow_runner:2020-08-11T13:05:46.728Z: JOB_MESSAGE_DETAILED: Autoscaling was automatically enabled for job 2020-08-11_06_05_46-5170263954163489099.
INFO:apache_beam.runners.dataflow.dataflow_runner:2020-08-11T13:05:51.919Z: JOB_MESSAGE_BASIC: Worker configuration: n1-standard-1 in us-central1-f.
INFO:apache_beam.runners.dataflow.dataflow_runner:2020-08-11T13:05:52.756Z: JOB_MESSAGE_DETAILED: Expanding CoGroupByKey operations into optimizable parts.
INFO:apache_beam.runners.dataflow.dataflow_runner:2020-08-11T13:05:52.855Z: JOB_MESSAGE_DEBUG: Combiner lifting skipped for step GroupByKey: GroupByKey not followed by a combiner.
INFO:apache_beam.runners.dataflow.dataflow_runner:2020-08-11T13:05:52.900Z: JOB_MESSAGE_DETAILED: Expanding GroupByKey operations into optimizable parts.
INFO:apache_beam.runners.dataflow.dataflow_runner:2020-08-11T13:05:52.931Z: JOB_MESSAGE_DETAILED: Lifting ValueCombiningMappingFns into MergeBucketsMappingFns
INFO:apache_beam.runners.dataflow.dataflow_runner:2020-08-11T13:05:53.015Z: JOB_MESSAGE_DEBUG: Annotating graph with Autotuner information.
INFO:apache_beam.runners.dataflow.dataflow_runner:2020-08-11T13:05:53.065Z: JOB_MESSAGE_DETAILED: Fusing adjacent ParDo, Read, Write, and Flatten operations
INFO:apache_beam.runners.dataflow.dataflow_runner:2020-08-11T13:05:53.111Z: JOB_MESSAGE_DETAILED: Fusing consumer metrics into Create/Read
INFO:apache_beam.runners.dataflow.dataflow_runner:2020-08-11T13:05:53.147Z: JOB_MESSAGE_DETAILED: Fusing consumer map_to_common_key into metrics
INFO:apache_beam.runners.dataflow.dataflow_runner:2020-08-11T13:05:53.182Z: JOB_MESSAGE_DETAILED: Fusing consumer GroupByKey/Reify into map_to_common_key
INFO:apache_beam.runners.dataflow.dataflow_runner:2020-08-11T13:05:53.218Z: JOB_MESSAGE_DETAILED: Fusing consumer GroupByKey/Write into GroupByKey/Reify
INFO:apache_beam.runners.dataflow.dataflow_runner:2020-08-11T13:05:53.242Z: JOB_MESSAGE_DETAILED: Fusing consumer GroupByKey/GroupByWindow into GroupByKey/Read
INFO:apache_beam.runners.dataflow.dataflow_runner:2020-08-11T13:05:53.280Z: JOB_MESSAGE_DETAILED: Fusing consumer m_out into GroupByKey/GroupByWindow
INFO:apache_beam.runners.dataflow.dataflow_runner:2020-08-11T13:05:53.316Z: JOB_MESSAGE_DEBUG: Workflow config is missing a default resource spec.
INFO:apache_beam.runners.dataflow.dataflow_runner:2020-08-11T13:05:53.340Z: JOB_MESSAGE_DEBUG: Adding StepResource setup and teardown to workflow graph.
INFO:apache_beam.runners.dataflow.dataflow_runner:2020-08-11T13:05:53.388Z: JOB_MESSAGE_DEBUG: Adding workflow start and stop steps.
INFO:apache_beam.runners.dataflow.dataflow_runner:2020-08-11T13:05:53.422Z: JOB_MESSAGE_DEBUG: Assigning stage ids.
INFO:apache_beam.runners.dataflow.dataflow_runner:2020-08-11T13:05:53.685Z: JOB_MESSAGE_DEBUG: Executing wait step start13
INFO:apache_beam.runners.dataflow.dataflow_runner:2020-08-11T13:05:53.758Z: JOB_MESSAGE_BASIC: Executing operation GroupByKey/Create
INFO:apache_beam.runners.dataflow.dataflow_runner:2020-08-11T13:05:53.793Z: JOB_MESSAGE_DEBUG: Starting worker pool setup.
INFO:apache_beam.runners.dataflow.dataflow_runner:2020-08-11T13:05:53.824Z: JOB_MESSAGE_BASIC: Starting 1 workers in us-central1-f...
INFO:apache_beam.runners.dataflow.dataflow_runner:2020-08-11T13:05:53.869Z: JOB_MESSAGE_BASIC: Finished operation GroupByKey/Create
INFO:apache_beam.runners.dataflow.dataflow_runner:2020-08-11T13:05:53.936Z: JOB_MESSAGE_DEBUG: Value "GroupByKey/Session" materialized.
INFO:apache_beam.runners.dataflow.dataflow_runner:2020-08-11T13:05:54.024Z: JOB_MESSAGE_BASIC: Executing operation Create/Read+metrics+map_to_common_key+GroupByKey/Reify+GroupByKey/Write
INFO:apache_beam.runners.dataflow.dataflow_runner:2020-08-11T13:06:02.331Z: JOB_MESSAGE_DETAILED: BigQuery export job progress: "dataflow_job_5679699419280517545" observed total of 1 exported files thus far.
INFO:apache_beam.runners.dataflow.dataflow_runner:2020-08-11T13:06:02.363Z: JOB_MESSAGE_BASIC: BigQuery export job finished: "dataflow_job_5679699419280517545"
INFO:apache_beam.runners.dataflow.dataflow_runner:2020-08-11T13:06:03.389Z: JOB_MESSAGE_DETAILED: Workers have started successfully.
INFO:apache_beam.runners.dataflow.dataflow_runner:2020-08-11T13:06:03.429Z: JOB_MESSAGE_DETAILED: Workers have started successfully.
INFO:apache_beam.runners.dataflow.dataflow_runner:2020-08-11T13:06:08.112Z: JOB_MESSAGE_DETAILED: Autoscaling: Resized worker pool from 1 to 0.
INFO:apache_beam.runners.dataflow.dataflow_runner:2020-08-11T13:06:08.162Z: JOB_MESSAGE_BASIC: Worker pool stopped.
INFO:apache_beam.runners.dataflow.dataflow_runner:2020-08-11T13:06:08.195Z: JOB_MESSAGE_DEBUG: Tearing down pending resources...
INFO:apache_beam.runners.dataflow.dataflow_runner:2020-08-11T13:06:14.425Z: JOB_MESSAGE_WARNING: Your project already contains 100 Dataflow-created metric descriptors and Stackdriver will not create new Dataflow custom metrics for this job. Each unique user-defined metric name (independent of the DoFn in which it is defined) produces a new metric descriptor. To delete old / unused metric descriptors see https://developers.google.com/apis-explorer/#p/monitoring/v3/monitoring.projects.metricDescriptors.list and https://developers.google.com/apis-explorer/#p/monitoring/v3/monitoring.projects.metricDescriptors.delete
INFO:apache_beam.runners.dataflow.dataflow_runner:Job 2020-08-11_05_58_55-674031997481717513 is in state JOB_STATE_DONE
INFO:apache_beam.io.gcp.tests.bigquery_matcher:Attempting to perform query SELECT bytes, date, time FROM python_write_to_table_15971507204702.python_no_schema_table to BQ
DEBUG:google.auth._default:Checking None for explicit credentials as part of auth process...
DEBUG:google.auth._default:Checking Cloud SDK credentials as part of auth process...
DEBUG:google.auth._default:Cloud SDK credentials not found on disk; not using them
DEBUG:google.auth._default:Checking for App Engine runtime as part of auth process...
DEBUG:google.auth._default:No App Engine library was found so cannot authentication via App Engine Identity Credentials.
DEBUG:google.auth.transport._http_client:Making request: GET http://169.254.169.254
DEBUG:google.auth.transport._http_client:Making request: GET http://metadata.google.internal/computeMetadata/v1/project/project-id
DEBUG:urllib3.util.retry:Converted retries value: 3 -> Retry(total=3, connect=None, read=None, redirect=None, status=None)
DEBUG:google.auth.transport.requests:Making request: GET http://metadata.google.internal/computeMetadata/v1/instance/service-accounts/default/?recursive=true
DEBUG:urllib3.connectionpool:Starting new HTTP connection (1): metadata.google.internal:80
DEBUG:urllib3.connectionpool:http://metadata.google.internal:80 "GET /computeMetadata/v1/instance/service-accounts/default/?recursive=true HTTP/1.1" 200 144
DEBUG:google.auth.transport.requests:Making request: GET http://metadata.google.internal/computeMetadata/v1/instance/service-accounts/844138762903-compute@developer.gserviceaccount.com/token
DEBUG:urllib3.connectionpool:http://metadata.google.internal:80 "GET /computeMetadata/v1/instance/service-accounts/844138762903-compute@developer.gserviceaccount.com/token HTTP/1.1" 200 221
DEBUG:urllib3.connectionpool:Starting new HTTPS connection (1): bigquery.googleapis.com:443
DEBUG:urllib3.connectionpool:https://bigquery.googleapis.com:443 "POST /bigquery/v2/projects/apache-beam-testing/jobs HTTP/1.1" 200 None
DEBUG:urllib3.connectionpool:https://bigquery.googleapis.com:443 "GET /bigquery/v2/projects/apache-beam-testing/queries/88c2a6e2-e4a4-404a-a758-250b5b6828e5?maxResults=0&location=US HTTP/1.1" 200 None
DEBUG:urllib3.connectionpool:https://bigquery.googleapis.com:443 "GET /bigquery/v2/projects/apache-beam-testing/datasets/_7357fab0f784d2a7327ddbe81cdd1f4ca7e429cd/tables/anon32b5144098fab298698cadbaabdfd9678454f4d3/data HTTP/1.1" 200 None
INFO:apache_beam.io.gcp.tests.bigquery_matcher:Result of query is: [(b'xyw', datetime.date(2011, 1, 1), datetime.time(23, 59, 59, 999999)), (b'\xab\xac\xad', datetime.date(2000, 1, 1), datetime.time(0, 0)), (b'abc', datetime.date(2000, 1, 1), datetime.time(0, 0)), (b'\xe4\xbd\xa0\xe5\xa5\xbd', datetime.date(3000, 12, 31), datetime.time(23, 59, 59))]
INFO:apache_beam.io.gcp.bigquery_write_it_test:Deleting dataset python_write_to_table_15971507204702 in project apache-beam-testing
INFO:apache_beam.runners.dataflow.dataflow_runner:2020-08-11T13:06:20.056Z: JOB_MESSAGE_DETAILED: Autoscaling: Raised the number of workers to 1 based on the rate of progress in the currently running stage(s).
INFO:apache_beam.runners.dataflow.dataflow_runner:2020-08-11T13:06:50.222Z: JOB_MESSAGE_DETAILED: Workers have started successfully.
INFO:apache_beam.runners.dataflow.dataflow_runner:2020-08-11T13:06:50.251Z: JOB_MESSAGE_DETAILED: Workers have started successfully.
INFO:apache_beam.runners.dataflow.dataflow_runner:2020-08-11T13:08:34.951Z: JOB_MESSAGE_BASIC: Finished operation Create/Read+InspectForDetails/ParDo(_InspectFn)+ParDo(CallableWrapperDoFn)/ParDo(CallableWrapperDoFn)+Type matches/WindowInto(WindowIntoFn)+Type matches/ToVoidKey+Type matches/Group/pair_with_1+Type matches/Group/GroupByKey/Reify+Type matches/Group/GroupByKey/Write
INFO:apache_beam.runners.dataflow.dataflow_runner:2020-08-11T13:08:38.079Z: JOB_MESSAGE_BASIC: Finished operation Type matches/Create/Read+Type matches/Group/pair_with_0+Type matches/Group/GroupByKey/Reify+Type matches/Group/GroupByKey/Write
INFO:apache_beam.runners.dataflow.dataflow_runner:2020-08-11T13:08:38.163Z: JOB_MESSAGE_BASIC: Executing operation Type matches/Group/GroupByKey/Close
INFO:apache_beam.runners.dataflow.dataflow_runner:2020-08-11T13:08:38.204Z: JOB_MESSAGE_BASIC: Finished operation Type matches/Group/GroupByKey/Close
INFO:apache_beam.runners.dataflow.dataflow_runner:2020-08-11T13:08:38.430Z: JOB_MESSAGE_BASIC: Executing operation Type matches/Group/GroupByKey/Read+Type matches/Group/GroupByKey/GroupByWindow+Type matches/Group/Map(_merge_tagged_vals_under_key)+Type matches/Unkey+Type matches/Match
INFO:apache_beam.runners.dataflow.dataflow_runner:2020-08-11T13:08:47.469Z: JOB_MESSAGE_BASIC: Finished operation Type matches/Group/GroupByKey/Read+Type matches/Group/GroupByKey/GroupByWindow+Type matches/Group/Map(_merge_tagged_vals_under_key)+Type matches/Unkey+Type matches/Match
INFO:apache_beam.runners.dataflow.dataflow_runner:2020-08-11T13:08:47.534Z: JOB_MESSAGE_DEBUG: Executing success step success19
INFO:apache_beam.runners.dataflow.dataflow_runner:2020-08-11T13:08:47.645Z: JOB_MESSAGE_DETAILED: Cleaning up.
INFO:apache_beam.runners.dataflow.dataflow_runner:2020-08-11T13:08:47.691Z: JOB_MESSAGE_DEBUG: Starting worker pool teardown.
INFO:apache_beam.runners.dataflow.dataflow_runner:2020-08-11T13:08:47.716Z: JOB_MESSAGE_BASIC: Stopping worker pool...
INFO:apache_beam.runners.dataflow.dataflow_runner:2020-08-11T13:09:25.751Z: JOB_MESSAGE_BASIC: Executing BigQuery import job "dataflow_job_4603971730127942718". You can check its status with the bq tool: "bq show -j --project_id=apache-beam-testing dataflow_job_4603971730127942718".
INFO:apache_beam.runners.dataflow.dataflow_runner:2020-08-11T13:09:36.430Z: JOB_MESSAGE_BASIC: BigQuery import job "dataflow_job_4603971730127942718" done.
INFO:apache_beam.runners.dataflow.dataflow_runner:2020-08-11T13:09:39.588Z: JOB_MESSAGE_DETAILED: Autoscaling: Resized worker pool from 1 to 0.
INFO:apache_beam.runners.dataflow.dataflow_runner:2020-08-11T13:09:39.635Z: JOB_MESSAGE_BASIC: Worker pool stopped.
INFO:apache_beam.runners.dataflow.dataflow_runner:2020-08-11T13:09:39.665Z: JOB_MESSAGE_DEBUG: Tearing down pending resources...
INFO:apache_beam.runners.dataflow.dataflow_runner:2020-08-11T13:09:37.155Z: JOB_MESSAGE_BASIC: Finished operation read+write/NativeWrite
INFO:apache_beam.runners.dataflow.dataflow_runner:2020-08-11T13:09:37.220Z: JOB_MESSAGE_DEBUG: Executing success step success1
INFO:apache_beam.runners.dataflow.dataflow_runner:2020-08-11T13:09:37.366Z: JOB_MESSAGE_DETAILED: Cleaning up.
INFO:apache_beam.runners.dataflow.dataflow_runner:2020-08-11T13:09:37.569Z: JOB_MESSAGE_DEBUG: Starting worker pool teardown.
INFO:apache_beam.runners.dataflow.dataflow_runner:2020-08-11T13:09:37.607Z: JOB_MESSAGE_BASIC: Stopping worker pool...
INFO:apache_beam.runners.dataflow.dataflow_runner:Job 2020-08-11_06_02_28-10923205911980609932 is in state JOB_STATE_DONE
INFO:apache_beam.runners.dataflow.dataflow_runner:2020-08-11T13:09:50.244Z: JOB_MESSAGE_DETAILED: Workers have started successfully.
INFO:apache_beam.runners.dataflow.dataflow_runner:2020-08-11T13:09:50.271Z: JOB_MESSAGE_DETAILED: Workers have started successfully.
INFO:apache_beam.runners.dataflow.dataflow_runner:2020-08-11T13:10:16.030Z: JOB_MESSAGE_BASIC: Finished operation assert_that/Create/Read+assert_that/Group/pair_with_0+assert_that/Group/GroupByKey/Reify+assert_that/Group/GroupByKey/Write
INFO:apache_beam.runners.dataflow.dataflow_runner:2020-08-11T13:10:19.212Z: JOB_MESSAGE_BASIC: Finished operation Create/Read+ExternalTransform(simple)/Map(<lambda at external_it_test.py:43>)+assert_that/WindowInto(WindowIntoFn)+assert_that/ToVoidKey+assert_that/Group/pair_with_1+assert_that/Group/GroupByKey/Reify+assert_that/Group/GroupByKey/Write
INFO:apache_beam.runners.dataflow.dataflow_runner:2020-08-11T13:10:19.282Z: JOB_MESSAGE_BASIC: Executing operation assert_that/Group/GroupByKey/Close
INFO:apache_beam.runners.dataflow.dataflow_runner:2020-08-11T13:10:19.336Z: JOB_MESSAGE_BASIC: Finished operation assert_that/Group/GroupByKey/Close
INFO:apache_beam.runners.dataflow.dataflow_runner:2020-08-11T13:10:19.407Z: JOB_MESSAGE_BASIC: Executing operation assert_that/Group/GroupByKey/Read+assert_that/Group/GroupByKey/GroupByWindow+assert_that/Group/Map(_merge_tagged_vals_under_key)+assert_that/Unkey+assert_that/Match
INFO:apache_beam.runners.dataflow.dataflow_runner:2020-08-11T13:10:28.588Z: JOB_MESSAGE_BASIC: Finished operation assert_that/Group/GroupByKey/Read+assert_that/Group/GroupByKey/GroupByWindow+assert_that/Group/Map(_merge_tagged_vals_under_key)+assert_that/Unkey+assert_that/Match
INFO:apache_beam.runners.dataflow.dataflow_runner:2020-08-11T13:10:28.674Z: JOB_MESSAGE_DEBUG: Executing success step success19
INFO:apache_beam.runners.dataflow.dataflow_runner:2020-08-11T13:10:28.787Z: JOB_MESSAGE_DETAILED: Cleaning up.
INFO:apache_beam.runners.dataflow.dataflow_runner:2020-08-11T13:10:28.850Z: JOB_MESSAGE_DEBUG: Starting worker pool teardown.
INFO:apache_beam.runners.dataflow.dataflow_runner:2020-08-11T13:10:28.893Z: JOB_MESSAGE_BASIC: Stopping worker pool...
INFO:apache_beam.runners.dataflow.dataflow_runner:2020-08-11T13:10:33.527Z: JOB_MESSAGE_DETAILED: Autoscaling: Resized worker pool from 1 to 0.
INFO:apache_beam.runners.dataflow.dataflow_runner:2020-08-11T13:10:33.577Z: JOB_MESSAGE_BASIC: Worker pool stopped.
INFO:apache_beam.runners.dataflow.dataflow_runner:2020-08-11T13:10:33.603Z: JOB_MESSAGE_DEBUG: Tearing down pending resources...
INFO:apache_beam.runners.dataflow.dataflow_runner:Job 2020-08-11_06_03_50-13952475027181477011 is in state JOB_STATE_DONE
INFO:apache_beam.io.gcp.tests.bigquery_matcher:Attempting to perform query SELECT fruit from `python_query_to_table_15971510171063.output_table`; to BQ
DEBUG:google.auth._default:Checking None for explicit credentials as part of auth process...
DEBUG:google.auth._default:Checking Cloud SDK credentials as part of auth process...
DEBUG:google.auth._default:Cloud SDK credentials not found on disk; not using them
DEBUG:google.auth._default:Checking for App Engine runtime as part of auth process...
DEBUG:google.auth._default:No App Engine library was found so cannot authentication via App Engine Identity Credentials.
DEBUG:google.auth.transport._http_client:Making request: GET http://169.254.169.254
DEBUG:google.auth.transport._http_client:Making request: GET http://metadata.google.internal/computeMetadata/v1/project/project-id
DEBUG:urllib3.util.retry:Converted retries value: 3 -> Retry(total=3, connect=None, read=None, redirect=None, status=None)
DEBUG:google.auth.transport.requests:Making request: GET http://metadata.google.internal/computeMetadata/v1/instance/service-accounts/default/?recursive=true
DEBUG:urllib3.connectionpool:Starting new HTTP connection (1): metadata.google.internal:80
DEBUG:urllib3.connectionpool:http://metadata.google.internal:80 "GET /computeMetadata/v1/instance/service-accounts/default/?recursive=true HTTP/1.1" 200 144
DEBUG:google.auth.transport.requests:Making request: GET http://metadata.google.internal/computeMetadata/v1/instance/service-accounts/844138762903-compute@developer.gserviceaccount.com/token
DEBUG:urllib3.connectionpool:http://metadata.google.internal:80 "GET /computeMetadata/v1/instance/service-accounts/844138762903-compute@developer.gserviceaccount.com/token HTTP/1.1" 200 221
DEBUG:urllib3.connectionpool:Starting new HTTPS connection (1): bigquery.googleapis.com:443
DEBUG:urllib3.connectionpool:https://bigquery.googleapis.com:443 "POST /bigquery/v2/projects/apache-beam-testing/jobs HTTP/1.1" 200 None
DEBUG:urllib3.connectionpool:https://bigquery.googleapis.com:443 "GET /bigquery/v2/projects/apache-beam-testing/queries/c1e77273-d884-4313-ba8d-328da4d25766?maxResults=0&location=US HTTP/1.1" 200 None
DEBUG:urllib3.connectionpool:https://bigquery.googleapis.com:443 "GET /bigquery/v2/projects/apache-beam-testing/datasets/_7357fab0f784d2a7327ddbe81cdd1f4ca7e429cd/tables/anon0be7aafddbc50ec483a78a7068a374a10607bbbf/data HTTP/1.1" 200 None
INFO:apache_beam.io.gcp.tests.bigquery_matcher:Read from given query (SELECT fruit from `python_query_to_table_15971510171063.output_table`;), total rows 2
INFO:apache_beam.io.gcp.tests.bigquery_matcher:Generate checksum: 158a8ea1c254fcf40d4ed3e7c0242c3ea0a29e72
INFO:apache_beam.runners.dataflow.dataflow_runner:2020-08-11T13:11:12.062Z: JOB_MESSAGE_DETAILED: Autoscaling: Resized worker pool from 1 to 0.
INFO:apache_beam.runners.dataflow.dataflow_runner:2020-08-11T13:11:12.110Z: JOB_MESSAGE_BASIC: Worker pool stopped.
INFO:apache_beam.runners.dataflow.dataflow_runner:2020-08-11T13:11:12.149Z: JOB_MESSAGE_DEBUG: Tearing down pending resources...
INFO:apache_beam.runners.dataflow.dataflow_runner:Job 2020-08-11_06_04_31-12891812337550799855 is in state JOB_STATE_DONE
INFO:apache_beam.runners.dataflow.dataflow_runner:2020-08-11T13:13:43.933Z: JOB_MESSAGE_BASIC: Finished operation Create/Read+metrics+map_to_common_key+GroupByKey/Reify+GroupByKey/Write
INFO:apache_beam.runners.dataflow.dataflow_runner:2020-08-11T13:13:44.018Z: JOB_MESSAGE_BASIC: Executing operation GroupByKey/Close
INFO:apache_beam.runners.dataflow.dataflow_runner:2020-08-11T13:13:44.122Z: JOB_MESSAGE_BASIC: Finished operation GroupByKey/Close
INFO:apache_beam.runners.dataflow.dataflow_runner:2020-08-11T13:13:44.350Z: JOB_MESSAGE_BASIC: Executing operation GroupByKey/Read+GroupByKey/GroupByWindow+m_out
INFO:apache_beam.runners.dataflow.dataflow_runner:2020-08-11T13:13:51.735Z: JOB_MESSAGE_BASIC: Finished operation GroupByKey/Read+GroupByKey/GroupByWindow+m_out
INFO:apache_beam.runners.dataflow.dataflow_runner:2020-08-11T13:13:51.805Z: JOB_MESSAGE_DEBUG: Executing success step success11
INFO:apache_beam.runners.dataflow.dataflow_runner:2020-08-11T13:13:51.939Z: JOB_MESSAGE_DETAILED: Cleaning up.
INFO:apache_beam.runners.dataflow.dataflow_runner:2020-08-11T13:13:52.024Z: JOB_MESSAGE_DEBUG: Starting worker pool teardown.
INFO:apache_beam.runners.dataflow.dataflow_runner:2020-08-11T13:13:52.055Z: JOB_MESSAGE_BASIC: Stopping worker pool...
INFO:apache_beam.runners.dataflow.dataflow_runner:2020-08-11T13:14:40.195Z: JOB_MESSAGE_DETAILED: Autoscaling: Resized worker pool from 1 to 0.
INFO:apache_beam.runners.dataflow.dataflow_runner:2020-08-11T13:14:40.239Z: JOB_MESSAGE_BASIC: Worker pool stopped.
INFO:apache_beam.runners.dataflow.dataflow_runner:2020-08-11T13:14:40.295Z: JOB_MESSAGE_DEBUG: Tearing down pending resources...
INFO:apache_beam.runners.dataflow.dataflow_runner:Job 2020-08-11_06_05_46-5170263954163489099 is in state JOB_STATE_DONE
test_bigquery_tornadoes_it (apache_beam.examples.cookbook.bigquery_tornadoes_it_test.BigqueryTornadoesIT) ... ok
test_streaming_wordcount_debugging_it (apache_beam.examples.streaming_wordcount_debugging_it_test.StreamingWordcountDebuggingIT) ... SKIP: Skipped due to [BEAM-3377]: assert_that not working for streaming
test_autocomplete_it (apache_beam.examples.complete.autocomplete_test.AutocompleteTest) ... ok
test_datastore_wordcount_it (apache_beam.examples.cookbook.datastore_wordcount_it_test.DatastoreWordCountIT) ... ok
test_leader_board_it (apache_beam.examples.complete.game.leader_board_it_test.LeaderBoardIT) ... ok
test_game_stats_it (apache_beam.examples.complete.game.game_stats_it_test.GameStatsIT) ... ok
test_streaming_wordcount_it (apache_beam.examples.streaming_wordcount_it_test.StreamingWordCountIT) ... ok
test_wordcount_it (apache_beam.examples.wordcount_it_test.WordCountIT) ... ok
test_wordcount_fnapi_it (apache_beam.examples.wordcount_it_test.WordCountIT) ... ok
test_user_score_it (apache_beam.examples.complete.game.user_score_it_test.UserScoreIT) ... ok
test_avro_it (apache_beam.examples.fastavro_it_test.FastavroIT) ... ok
test_hourly_team_score_it (apache_beam.examples.complete.game.hourly_team_score_it_test.HourlyTeamScoreIT) ... ok
test_read_via_sql (apache_beam.io.gcp.experimental.spannerio_read_it_test.SpannerReadIntegrationTest) ... ok
test_read_via_table (apache_beam.io.gcp.experimental.spannerio_read_it_test.SpannerReadIntegrationTest) ... ok
test_bigquery_read_1M_python (apache_beam.io.gcp.bigquery_io_read_it_test.BigqueryIOReadIT) ... ok
test_bigquery_read_custom_1M_python (apache_beam.io.gcp.bigquery_io_read_it_test.BigqueryIOReadIT) ... ok
test_bqfl_streaming (apache_beam.io.gcp.bigquery_file_loads_test.BigQueryFileLoadsIT) ... SKIP: TestStream is not supported on TestDataflowRunner
test_multiple_destinations_transform (apache_beam.io.gcp.bigquery_file_loads_test.BigQueryFileLoadsIT) ... ok
test_one_job_fails_all_jobs_fail (apache_beam.io.gcp.bigquery_file_loads_test.BigQueryFileLoadsIT) ... ok
test_iobase_source (apache_beam.io.gcp.bigquery_read_it_test.ReadNewTypesTests) ... ok
test_native_source (apache_beam.io.gcp.bigquery_read_it_test.ReadNewTypesTests) ... ok
test_iobase_source (apache_beam.io.gcp.bigquery_read_it_test.ReadTests) ... ok
test_native_source (apache_beam.io.gcp.bigquery_read_it_test.ReadTests) ... ok
test_avro_file_load (apache_beam.io.gcp.bigquery_test.BigQueryFileLoadsIntegrationTests) ... ok
test_spanner_error (apache_beam.io.gcp.experimental.spannerio_write_it_test.SpannerWriteIntegrationTest) ... ok
test_spanner_update (apache_beam.io.gcp.experimental.spannerio_write_it_test.SpannerWriteIntegrationTest) ... ok
test_write_batches (apache_beam.io.gcp.experimental.spannerio_write_it_test.SpannerWriteIntegrationTest) ... ok
test_copy (apache_beam.io.gcp.gcsio_integration_test.GcsIOIntegrationTest) ... ok
test_copy_batch (apache_beam.io.gcp.gcsio_integration_test.GcsIOIntegrationTest) ... ok
test_copy_batch_kms (apache_beam.io.gcp.gcsio_integration_test.GcsIOIntegrationTest) ... ok
test_copy_batch_rewrite_token (apache_beam.io.gcp.gcsio_integration_test.GcsIOIntegrationTest) ... ok
test_copy_kms (apache_beam.io.gcp.gcsio_integration_test.GcsIOIntegrationTest) ... ok
test_copy_rewrite_token (apache_beam.io.gcp.gcsio_integration_test.GcsIOIntegrationTest) ... ok
test_multiple_destinations_transform (apache_beam.io.gcp.bigquery_test.BigQueryStreamingInsertTransformIntegrationTests) ... ok
test_value_provider_transform (apache_beam.io.gcp.bigquery_test.BigQueryStreamingInsertTransformIntegrationTests) ... ok
test_transform_on_gcs (apache_beam.io.fileio_test.MatchIntegrationTest) ... ok
test_parquetio_it (apache_beam.io.parquetio_it_test.TestParquetIT) ... ok
test_datastore_write_limit (apache_beam.io.gcp.datastore.v1new.datastore_write_it_test.DatastoreWriteIT) ... ok
test_file_loads (apache_beam.io.gcp.bigquery_test.PubSubBigQueryIT) ... SKIP: https://issuetracker.google.com/issues/118375066
test_streaming_inserts (apache_beam.io.gcp.bigquery_test.PubSubBigQueryIT) ... ok
test_streaming_data_only (apache_beam.io.gcp.pubsub_integration_test.PubSubIntegrationTest) ... ok
test_streaming_with_attributes (apache_beam.io.gcp.pubsub_integration_test.PubSubIntegrationTest) ... ok
test_dicom_search_instances (apache_beam.io.gcp.dicomio_integration_test.DICOMIoIntegrationTest) ... ok
test_dicom_store_instance_from_gcs (apache_beam.io.gcp.dicomio_integration_test.DICOMIoIntegrationTest) ... ok
test_analyzing_syntax (apache_beam.ml.gcp.naturallanguageml_test_it.NaturalLanguageMlTestIT) ... ok
test_label_detection_with_video_context (apache_beam.ml.gcp.videointelligenceml_test_it.VideoIntelligenceMlTestIT) ... ok
test_basic_execution (apache_beam.testing.test_stream_it_test.TestStreamIntegrationTests) ... SKIP: The "TestDataflowRunner", does not support the TestStream transform. Supported runners: ['DirectRunner', 'SwitchingDirectRunner']
Tests that the TestStream supports emitting to multiple PCollections. ... SKIP: The "TestDataflowRunner", does not support the TestStream transform. Supported runners: ['DirectRunner', 'SwitchingDirectRunner']
Tests that the TestStream can independently control output watermarks. ... SKIP: The "TestDataflowRunner", does not support the TestStream transform. Supported runners: ['DirectRunner', 'SwitchingDirectRunner']
Runs streaming Dataflow job and verifies that user metrics are reported ... ok
test_text_detection_with_language_hint (apache_beam.ml.gcp.visionml_test_it.VisionMlTestIT) ... ok
test_big_query_write (apache_beam.io.gcp.bigquery_write_it_test.BigQueryWriteIntegrationTests) ... ok
test_big_query_write_new_types (apache_beam.io.gcp.bigquery_write_it_test.BigQueryWriteIntegrationTests) ... ok
test_big_query_write_schema_autodetect (apache_beam.io.gcp.bigquery_write_it_test.BigQueryWriteIntegrationTests) ... SKIP: DataflowRunner does not support schema autodetection
test_big_query_write_without_schema (apache_beam.io.gcp.bigquery_write_it_test.BigQueryWriteIntegrationTests) ... ok
test_deidentification (apache_beam.ml.gcp.cloud_dlp_it_test.CloudDLPIT) ... ok
test_inspection (apache_beam.ml.gcp.cloud_dlp_it_test.CloudDLPIT) ... ok
test_big_query_legacy_sql (apache_beam.io.gcp.big_query_query_to_table_it_test.BigQueryQueryToTableIT) ... ok
test_big_query_new_types (apache_beam.io.gcp.big_query_query_to_table_it_test.BigQueryQueryToTableIT) ... ok
test_big_query_new_types_avro (apache_beam.io.gcp.big_query_query_to_table_it_test.BigQueryQueryToTableIT) ... ok
test_big_query_new_types_native (apache_beam.io.gcp.big_query_query_to_table_it_test.BigQueryQueryToTableIT) ... ok
test_big_query_standard_sql (apache_beam.io.gcp.big_query_query_to_table_it_test.BigQueryQueryToTableIT) ... ok
test_big_query_standard_sql_kms_key_native (apache_beam.io.gcp.big_query_query_to_table_it_test.BigQueryQueryToTableIT) ... ok
test_job_python_from_python_it (apache_beam.transforms.external_it_test.ExternalTransformIT) ... ok
test_metrics_fnapi_it (apache_beam.runners.dataflow.dataflow_exercise_metrics_pipeline_test.ExerciseMetricsPipelineTest) ... ok
test_metrics_it (apache_beam.runners.dataflow.dataflow_exercise_metrics_pipeline_test.ExerciseMetricsPipelineTest) ... ok
----------------------------------------------------------------------
XML: nosetests-postCommitIT-df-py37.xml
----------------------------------------------------------------------
XML: <https://ci-beam.apache.org/job/beam_PostCommit_Python37/ws/src/sdks/python/nosetests.xml>
----------------------------------------------------------------------
Ran 66 tests in 4159.031s
OK (SKIP=7)
FAILURE: Build failed with an exception.
* Where:
Script '<https://ci-beam.apache.org/job/beam_PostCommit_Python37/ws/src/sdks/python/test-suites/portable/common.gradle'> line: 210
* What went wrong:
Execution failed for task ':sdks:python:test-suites:portable:py37:postCommitPy37IT'.
> Process 'command 'sh'' finished with non-zero exit value 1
* Try:
Run with --stacktrace option to get the stack trace. Run with --info or --debug option to get more log output. Run with --scan to get full insights.
* Get more help at https://help.gradle.org
Deprecated Gradle features were used in this build, making it incompatible with Gradle 6.0.
Use '--warning-mode all' to show the individual deprecation warnings.
See https://docs.gradle.org/5.2.1/userguide/command_line_interface.html#sec:command_line_warnings
BUILD FAILED in 1h 14m 29s
139 actionable tasks: 112 executed, 26 from cache, 1 up-to-date
Publishing build scan...
https://gradle.com/s/5ik3eb3lscp46
Build step 'Invoke Gradle script' changed build result to FAILURE
Build step 'Invoke Gradle script' marked build as failure
---------------------------------------------------------------------
To unsubscribe, e-mail: builds-unsubscribe@beam.apache.org
For additional commands, e-mail: builds-help@beam.apache.org
Jenkins build is back to normal : beam_PostCommit_Python37 #2710
Posted by Apache Jenkins Server <je...@builds.apache.org>.
See <https://ci-beam.apache.org/job/beam_PostCommit_Python37/2710/display/redirect?page=changes>
---------------------------------------------------------------------
To unsubscribe, e-mail: builds-unsubscribe@beam.apache.org
For additional commands, e-mail: builds-help@beam.apache.org
Build failed in Jenkins: beam_PostCommit_Python37 #2709
Posted by Apache Jenkins Server <je...@builds.apache.org>.
See <https://ci-beam.apache.org/job/beam_PostCommit_Python37/2709/display/redirect?page=changes>
Changes:
[Maximilian Michels] Revert "Merge pull request #12408: [BEAM-10602] Display Python streaming
[kcweaver] [BEAM-10681] Set metrics supported in Spark portable runner.
[noreply] [BEAM-7705] Add BigQuery Java samples (#12118)
[Maximilian Michels] [BEAM-10602] Add latency/checkpoint duration as separate panels in ParDo
[tobiasz.kedzierski] [BEAM-10686] Simplify names for GCP variables check in GA
[noreply] Fix format string in PipelineValidator (#12522)
[noreply] Fix some typos (#12539)
[noreply] Linkage Checker 1.5.0 (#12545)
------------------------------------------
[...truncated 18.67 MB...]
"pipeline_proto_coder_id": "ref_Coder_FastPrimitivesCoder_6"
},
{
"@type": "kind:global_window"
}
],
"is_wrapper": true
},
"output_name": "None",
"user_name": "m_out.out"
}
],
"parallel_input": {
"@type": "OutputReference",
"output_name": "out",
"step_name": "s4"
},
"serialized_fn": "QlpoOTFBWSZTWWeYg/EAApJ/8H/////////////cwr///+ZjwCAAYEBAAvYZlAZGGqZKeap6nqaD1Bk2o9T9UeoGgAaAaDQaNPSeoaD1PUAGnqeoMj0gZNBKmiZNCYmI1J4mSbSYg0yZAAGgABoDQaABoNAyMgGmSIQ0pspptTYiDTTQNBgQyaAGIyAGg0Bp6BNqeoGgeoOAAAAAAAAAAaAAAAAAAAAADvptRksy3rYqqrRyJX2qH0NSOBctdVUdLQAm1Vh2UANxiG8xcsPs2/V+wqRYe1ULTTsFGP9a61H8xkkgE7und2KQKCYLXStXLn3eFthcDyETfV4UGFKZNeBBEHUSJLWyzBEAWMCthwxMLlv1cDyano9cgF8al+wdq5r/REAkG1Xg8aacyW/LCkBXoTuB4iGoncNkgf7kZTycpPhEogIUlcmUXbLXkkTvSvGWUVI8gorCTQi4qGCTsUwnjQkyt2ZyOO9OYuufzYucYr+tb6skz+fLbYmGltqvc0ZyO62U1BN/063ZqwM9sHukMYDtXzQzuCo6I8hcg9bN+uA5zVxEToRovLZIoOS0PpZ6DtewoIpXjNEHdMET2MhmBwtiJO/7kFGvRXCBJCR3E0VT+tlPoVcp7u8FEolFZEAQgtDOCFCYBounGasGioKCtPYuiTpMtBVhRemCeN1kw3xz7+O3HdpAYYCUXQKJCFvkypPA1qn+cbuIJzJofIN2BcCmDlvIBCstlwFz2aQYXYogZO/bA/V1tacCaIv1lmiMtOWCxQ22hA4/JeLrKatgfimoi1XTBYqKI1UlwpqoFFxMxI7eKk1vELwoiakO73oRuciOUowiTwDyilzBw1LIP03KHIxylREq0IIBlhEEIgRqAmRKSZspXcY8WJZc1S79gLtt2o65KoRUptqAP0C0mEjQrLUMMdcwvLxdDZ2YWF3a2YmEc6V3Flq/zGko0q1i7CE9F60VVmlLVbxGN1Kc8GIjGCmM2+eg7pKnM7xezfVKYmJBAxbGHNEIVArMrZhiGweBLCVomDBhtYxZft2DIMzallLUjBweKHOZYLJJaYlEbRaHX4A2iWd0kmIYgPGrVkkFdUkblNPWmlouz7UYWBJGThIYIMpTkP5/pJL782MpXbJs/HJr2mwipgUqF1LL6WhjchFIhEb70ijjxamTOr2EAb6pUqdP+qQ4F4FkIiHj/i7kinChIM8xB+I=",
"user_name": "m_out"
}
}
],
"type": "JOB_TYPE_BATCH"
}
INFO:apache_beam.runners.dataflow.dataflow_runner:2020-08-12T19:06:46.984Z: JOB_MESSAGE_DETAILED: Workers have started successfully.
INFO:apache_beam.runners.dataflow.dataflow_runner:2020-08-12T19:06:47.017Z: JOB_MESSAGE_DETAILED: Workers have started successfully.
INFO:apache_beam.runners.dataflow.internal.apiclient:Create job: <Job
createTime: '2020-08-12T19:06:52.165414Z'
currentStateTime: '1970-01-01T00:00:00Z'
id: '2020-08-12_12_06_50-1758964360690793648'
location: 'us-central1'
name: 'beamapp-jenkins-0812190641-430771'
projectId: 'apache-beam-testing'
stageStates: []
startTime: '2020-08-12T19:06:52.165414Z'
steps: []
tempFiles: []
type: TypeValueValuesEnum(JOB_TYPE_BATCH, 1)>
INFO:apache_beam.runners.dataflow.internal.apiclient:Created job with id: [2020-08-12_12_06_50-1758964360690793648]
INFO:apache_beam.runners.dataflow.internal.apiclient:Submitted job: 2020-08-12_12_06_50-1758964360690793648
INFO:apache_beam.runners.dataflow.internal.apiclient:To access the Dataflow monitoring console, please navigate to https://console.cloud.google.com/dataflow/jobs/us-central1/2020-08-12_12_06_50-1758964360690793648?project=apache-beam-testing
Worker logs: https://console.cloud.google.com/dataflow/jobs/us-central1/2020-08-12_12_06_50-1758964360690793648?project=apache-beam-testing
INFO:apache_beam.runners.dataflow.dataflow_runner:Job 2020-08-12_12_06_50-1758964360690793648 is in state JOB_STATE_RUNNING
INFO:apache_beam.runners.dataflow.dataflow_runner:2020-08-12T19:06:50.603Z: JOB_MESSAGE_DETAILED: Autoscaling was automatically enabled for job 2020-08-12_12_06_50-1758964360690793648.
INFO:apache_beam.runners.dataflow.dataflow_runner:2020-08-12T19:06:50.603Z: JOB_MESSAGE_DETAILED: Autoscaling is enabled for job 2020-08-12_12_06_50-1758964360690793648. The number of workers will be between 1 and 1000.
INFO:apache_beam.runners.dataflow.dataflow_runner:2020-08-12T19:06:55.514Z: JOB_MESSAGE_BASIC: Worker configuration: n1-standard-1 in us-central1-a.
INFO:apache_beam.runners.dataflow.dataflow_runner:2020-08-12T19:06:57.472Z: JOB_MESSAGE_DETAILED: Expanding CoGroupByKey operations into optimizable parts.
INFO:apache_beam.runners.dataflow.dataflow_runner:2020-08-12T19:06:57.548Z: JOB_MESSAGE_DEBUG: Combiner lifting skipped for step GroupByKey: GroupByKey not followed by a combiner.
INFO:apache_beam.runners.dataflow.dataflow_runner:2020-08-12T19:06:57.587Z: JOB_MESSAGE_DETAILED: Expanding GroupByKey operations into optimizable parts.
INFO:apache_beam.runners.dataflow.dataflow_runner:2020-08-12T19:06:57.616Z: JOB_MESSAGE_DETAILED: Lifting ValueCombiningMappingFns into MergeBucketsMappingFns
INFO:apache_beam.runners.dataflow.dataflow_runner:2020-08-12T19:06:57.689Z: JOB_MESSAGE_DEBUG: Annotating graph with Autotuner information.
INFO:apache_beam.runners.dataflow.dataflow_runner:2020-08-12T19:06:57.733Z: JOB_MESSAGE_DETAILED: Fusing adjacent ParDo, Read, Write, and Flatten operations
INFO:apache_beam.runners.dataflow.dataflow_runner:2020-08-12T19:06:57.765Z: JOB_MESSAGE_DETAILED: Fusing consumer metrics into Create/Read
INFO:apache_beam.runners.dataflow.dataflow_runner:2020-08-12T19:06:57.803Z: JOB_MESSAGE_DETAILED: Fusing consumer map_to_common_key into metrics
INFO:apache_beam.runners.dataflow.dataflow_runner:2020-08-12T19:06:57.834Z: JOB_MESSAGE_DETAILED: Fusing consumer GroupByKey/Reify into map_to_common_key
INFO:apache_beam.runners.dataflow.dataflow_runner:2020-08-12T19:06:57.871Z: JOB_MESSAGE_DETAILED: Fusing consumer GroupByKey/Write into GroupByKey/Reify
INFO:apache_beam.runners.dataflow.dataflow_runner:2020-08-12T19:06:57.910Z: JOB_MESSAGE_DETAILED: Fusing consumer GroupByKey/GroupByWindow into GroupByKey/Read
INFO:apache_beam.runners.dataflow.dataflow_runner:2020-08-12T19:06:57.944Z: JOB_MESSAGE_DETAILED: Fusing consumer m_out into GroupByKey/GroupByWindow
INFO:apache_beam.runners.dataflow.dataflow_runner:2020-08-12T19:06:57.981Z: JOB_MESSAGE_DEBUG: Workflow config is missing a default resource spec.
INFO:apache_beam.runners.dataflow.dataflow_runner:2020-08-12T19:06:58.016Z: JOB_MESSAGE_DEBUG: Adding StepResource setup and teardown to workflow graph.
INFO:apache_beam.runners.dataflow.dataflow_runner:2020-08-12T19:06:58.053Z: JOB_MESSAGE_DEBUG: Adding workflow start and stop steps.
INFO:apache_beam.runners.dataflow.dataflow_runner:2020-08-12T19:06:58.084Z: JOB_MESSAGE_DEBUG: Assigning stage ids.
INFO:apache_beam.runners.dataflow.dataflow_runner:2020-08-12T19:06:58.320Z: JOB_MESSAGE_DEBUG: Executing wait step start13
INFO:apache_beam.runners.dataflow.dataflow_runner:2020-08-12T19:06:58.408Z: JOB_MESSAGE_BASIC: Executing operation GroupByKey/Create
INFO:apache_beam.runners.dataflow.dataflow_runner:2020-08-12T19:06:58.457Z: JOB_MESSAGE_DEBUG: Starting worker pool setup.
INFO:apache_beam.runners.dataflow.dataflow_runner:2020-08-12T19:06:58.495Z: JOB_MESSAGE_BASIC: Starting 1 workers in us-central1-a...
INFO:apache_beam.runners.dataflow.dataflow_runner:2020-08-12T19:06:58.526Z: JOB_MESSAGE_BASIC: Finished operation GroupByKey/Create
INFO:apache_beam.runners.dataflow.dataflow_runner:2020-08-12T19:06:58.669Z: JOB_MESSAGE_DEBUG: Value "GroupByKey/Session" materialized.
INFO:apache_beam.runners.dataflow.dataflow_runner:2020-08-12T19:06:58.739Z: JOB_MESSAGE_BASIC: Executing operation Create/Read+metrics+map_to_common_key+GroupByKey/Reify+GroupByKey/Write
INFO:apache_beam.runners.dataflow.dataflow_runner:2020-08-12T19:07:25.885Z: JOB_MESSAGE_DETAILED: Workers have started successfully.
INFO:apache_beam.runners.dataflow.dataflow_runner:2020-08-12T19:07:25.920Z: JOB_MESSAGE_DETAILED: Workers have started successfully.
INFO:apache_beam.runners.dataflow.dataflow_runner:2020-08-12T19:07:27.780Z: JOB_MESSAGE_DETAILED: Autoscaling: Raised the number of workers to 1 based on the rate of progress in the currently running stage(s).
INFO:apache_beam.runners.dataflow.dataflow_runner:2020-08-12T19:07:29.147Z: JOB_MESSAGE_WARNING: Your project already contains 100 Dataflow-created metric descriptors and Stackdriver will not create new Dataflow custom metrics for this job. Each unique user-defined metric name (independent of the DoFn in which it is defined) produces a new metric descriptor. To delete old / unused metric descriptors see https://developers.google.com/apis-explorer/#p/monitoring/v3/monitoring.projects.metricDescriptors.list and https://developers.google.com/apis-explorer/#p/monitoring/v3/monitoring.projects.metricDescriptors.delete
INFO:apache_beam.runners.dataflow.dataflow_runner:2020-08-12T19:09:14.939Z: JOB_MESSAGE_BASIC: Executing BigQuery import job "dataflow_job_15574144733684574981". You can check its status with the bq tool: "bq show -j --project_id=apache-beam-testing dataflow_job_15574144733684574981".
INFO:apache_beam.runners.dataflow.dataflow_runner:2020-08-12T19:09:16.535Z: JOB_MESSAGE_DETAILED: Workers have started successfully.
INFO:apache_beam.runners.dataflow.dataflow_runner:2020-08-12T19:09:16.569Z: JOB_MESSAGE_DETAILED: Workers have started successfully.
INFO:apache_beam.runners.dataflow.dataflow_runner:2020-08-12T19:09:25.599Z: JOB_MESSAGE_BASIC: BigQuery import job "dataflow_job_15574144733684574981" done.
INFO:apache_beam.runners.dataflow.dataflow_runner:2020-08-12T19:09:26.496Z: JOB_MESSAGE_BASIC: Finished operation read+write/NativeWrite
INFO:apache_beam.runners.dataflow.dataflow_runner:2020-08-12T19:09:26.631Z: JOB_MESSAGE_DEBUG: Executing success step success1
INFO:apache_beam.runners.dataflow.dataflow_runner:2020-08-12T19:09:26.762Z: JOB_MESSAGE_DETAILED: Cleaning up.
INFO:apache_beam.runners.dataflow.dataflow_runner:2020-08-12T19:09:26.873Z: JOB_MESSAGE_DEBUG: Starting worker pool teardown.
INFO:apache_beam.runners.dataflow.dataflow_runner:2020-08-12T19:09:26.906Z: JOB_MESSAGE_BASIC: Stopping worker pool...
INFO:apache_beam.runners.dataflow.dataflow_runner:2020-08-12T19:10:15.993Z: JOB_MESSAGE_BASIC: Finished operation Type matches/Create/Read+Type matches/Group/pair_with_0+Type matches/Group/GroupByKey/Reify+Type matches/Group/GroupByKey/Write
INFO:apache_beam.runners.dataflow.dataflow_runner:2020-08-12T19:10:18.309Z: JOB_MESSAGE_DETAILED: Autoscaling: Resized worker pool from 1 to 0.
INFO:apache_beam.runners.dataflow.dataflow_runner:2020-08-12T19:10:18.352Z: JOB_MESSAGE_BASIC: Worker pool stopped.
INFO:apache_beam.runners.dataflow.dataflow_runner:2020-08-12T19:10:18.378Z: JOB_MESSAGE_DEBUG: Tearing down pending resources...
INFO:apache_beam.runners.dataflow.dataflow_runner:2020-08-12T19:10:19.938Z: JOB_MESSAGE_BASIC: Finished operation Create/Read+InspectForDetails/ParDo(_InspectFn)+ParDo(CallableWrapperDoFn)/ParDo(CallableWrapperDoFn)+Type matches/WindowInto(WindowIntoFn)+Type matches/ToVoidKey+Type matches/Group/pair_with_1+Type matches/Group/GroupByKey/Reify+Type matches/Group/GroupByKey/Write
INFO:apache_beam.runners.dataflow.dataflow_runner:2020-08-12T19:10:20.024Z: JOB_MESSAGE_BASIC: Executing operation Type matches/Group/GroupByKey/Close
INFO:apache_beam.runners.dataflow.dataflow_runner:2020-08-12T19:10:20.077Z: JOB_MESSAGE_BASIC: Finished operation Type matches/Group/GroupByKey/Close
INFO:apache_beam.runners.dataflow.dataflow_runner:2020-08-12T19:10:20.142Z: JOB_MESSAGE_BASIC: Executing operation Type matches/Group/GroupByKey/Read+Type matches/Group/GroupByKey/GroupByWindow+Type matches/Group/Map(_merge_tagged_vals_under_key)+Type matches/Unkey+Type matches/Match
INFO:apache_beam.runners.dataflow.dataflow_runner:Job 2020-08-12_12_02_55-1134207117687222595 is in state JOB_STATE_DONE
INFO:apache_beam.runners.dataflow.dataflow_runner:2020-08-12T19:10:29.375Z: JOB_MESSAGE_BASIC: Finished operation Type matches/Group/GroupByKey/Read+Type matches/Group/GroupByKey/GroupByWindow+Type matches/Group/Map(_merge_tagged_vals_under_key)+Type matches/Unkey+Type matches/Match
INFO:apache_beam.runners.dataflow.dataflow_runner:2020-08-12T19:10:29.461Z: JOB_MESSAGE_DEBUG: Executing success step success19
INFO:apache_beam.runners.dataflow.dataflow_runner:2020-08-12T19:10:29.590Z: JOB_MESSAGE_DETAILED: Cleaning up.
INFO:apache_beam.io.gcp.tests.bigquery_matcher:Attempting to perform query SELECT fruit from `python_query_to_table_15972589636608.output_table`; to BQ
DEBUG:google.auth._default:Checking None for explicit credentials as part of auth process...
DEBUG:google.auth._default:Checking Cloud SDK credentials as part of auth process...
DEBUG:google.auth._default:Cloud SDK credentials not found on disk; not using them
DEBUG:google.auth._default:Checking for App Engine runtime as part of auth process...
DEBUG:google.auth._default:No App Engine library was found so cannot authentication via App Engine Identity Credentials.
DEBUG:google.auth.transport._http_client:Making request: GET http://169.254.169.254
DEBUG:google.auth.transport._http_client:Making request: GET http://metadata.google.internal/computeMetadata/v1/project/project-id
DEBUG:urllib3.util.retry:Converted retries value: 3 -> Retry(total=3, connect=None, read=None, redirect=None, status=None)
DEBUG:google.auth.transport.requests:Making request: GET http://metadata.google.internal/computeMetadata/v1/instance/service-accounts/default/?recursive=true
DEBUG:urllib3.connectionpool:Starting new HTTP connection (1): metadata.google.internal:80
DEBUG:urllib3.connectionpool:http://metadata.google.internal:80 "GET /computeMetadata/v1/instance/service-accounts/default/?recursive=true HTTP/1.1" 200 144
DEBUG:google.auth.transport.requests:Making request: GET http://metadata.google.internal/computeMetadata/v1/instance/service-accounts/844138762903-compute@developer.gserviceaccount.com/token
DEBUG:urllib3.connectionpool:http://metadata.google.internal:80 "GET /computeMetadata/v1/instance/service-accounts/844138762903-compute@developer.gserviceaccount.com/token HTTP/1.1" 200 221
DEBUG:urllib3.connectionpool:Starting new HTTPS connection (1): bigquery.googleapis.com:443
DEBUG:urllib3.connectionpool:https://bigquery.googleapis.com:443 "POST /bigquery/v2/projects/apache-beam-testing/jobs HTTP/1.1" 200 None
DEBUG:urllib3.connectionpool:https://bigquery.googleapis.com:443 "GET /bigquery/v2/projects/apache-beam-testing/queries/6222145a-a9e6-4758-b02c-9aac0ef8a4e6?maxResults=0&location=US HTTP/1.1" 200 None
DEBUG:urllib3.connectionpool:https://bigquery.googleapis.com:443 "GET /bigquery/v2/projects/apache-beam-testing/datasets/_7357fab0f784d2a7327ddbe81cdd1f4ca7e429cd/tables/anon739827de09440771409ba37c14e77e4feff3a760/data HTTP/1.1" 200 None
INFO:apache_beam.io.gcp.tests.bigquery_matcher:Read from given query (SELECT fruit from `python_query_to_table_15972589636608.output_table`;), total rows 2
INFO:apache_beam.io.gcp.tests.bigquery_matcher:Generate checksum: 158a8ea1c254fcf40d4ed3e7c0242c3ea0a29e72
INFO:apache_beam.runners.dataflow.dataflow_runner:2020-08-12T19:10:29.656Z: JOB_MESSAGE_DEBUG: Starting worker pool teardown.
INFO:apache_beam.runners.dataflow.dataflow_runner:2020-08-12T19:10:29.690Z: JOB_MESSAGE_BASIC: Stopping worker pool...
INFO:apache_beam.runners.dataflow.dataflow_runner:2020-08-12T19:10:51.091Z: JOB_MESSAGE_BASIC: Finished operation Create/Read+ExternalTransform(simple)/Map(<lambda at external_it_test.py:43>)+assert_that/WindowInto(WindowIntoFn)+assert_that/ToVoidKey+assert_that/Group/pair_with_1+assert_that/Group/GroupByKey/Reify+assert_that/Group/GroupByKey/Write
INFO:apache_beam.runners.dataflow.dataflow_runner:2020-08-12T19:10:54.223Z: JOB_MESSAGE_BASIC: Finished operation assert_that/Create/Read+assert_that/Group/pair_with_0+assert_that/Group/GroupByKey/Reify+assert_that/Group/GroupByKey/Write
INFO:apache_beam.runners.dataflow.dataflow_runner:2020-08-12T19:10:54.304Z: JOB_MESSAGE_BASIC: Executing operation assert_that/Group/GroupByKey/Close
INFO:apache_beam.runners.dataflow.dataflow_runner:2020-08-12T19:10:54.380Z: JOB_MESSAGE_BASIC: Finished operation assert_that/Group/GroupByKey/Close
INFO:apache_beam.runners.dataflow.dataflow_runner:2020-08-12T19:10:54.777Z: JOB_MESSAGE_BASIC: Executing operation assert_that/Group/GroupByKey/Read+assert_that/Group/GroupByKey/GroupByWindow+assert_that/Group/Map(_merge_tagged_vals_under_key)+assert_that/Unkey+assert_that/Match
INFO:apache_beam.runners.dataflow.dataflow_runner:2020-08-12T19:11:03.631Z: JOB_MESSAGE_BASIC: Finished operation assert_that/Group/GroupByKey/Read+assert_that/Group/GroupByKey/GroupByWindow+assert_that/Group/Map(_merge_tagged_vals_under_key)+assert_that/Unkey+assert_that/Match
INFO:apache_beam.runners.dataflow.dataflow_runner:2020-08-12T19:11:03.701Z: JOB_MESSAGE_DEBUG: Executing success step success19
INFO:apache_beam.runners.dataflow.dataflow_runner:2020-08-12T19:11:03.810Z: JOB_MESSAGE_DETAILED: Cleaning up.
INFO:apache_beam.runners.dataflow.dataflow_runner:2020-08-12T19:11:03.860Z: JOB_MESSAGE_DEBUG: Starting worker pool teardown.
INFO:apache_beam.runners.dataflow.dataflow_runner:2020-08-12T19:11:03.889Z: JOB_MESSAGE_BASIC: Stopping worker pool...
INFO:apache_beam.runners.dataflow.dataflow_runner:2020-08-12T19:11:21.276Z: JOB_MESSAGE_DETAILED: Autoscaling: Resized worker pool from 1 to 0.
INFO:apache_beam.runners.dataflow.dataflow_runner:2020-08-12T19:11:21.325Z: JOB_MESSAGE_BASIC: Worker pool stopped.
INFO:apache_beam.runners.dataflow.dataflow_runner:2020-08-12T19:11:21.363Z: JOB_MESSAGE_DEBUG: Tearing down pending resources...
INFO:apache_beam.runners.dataflow.dataflow_runner:Job 2020-08-12_12_04_02-17220927291049683048 is in state JOB_STATE_DONE
INFO:apache_beam.runners.dataflow.dataflow_runner:2020-08-12T19:12:00.593Z: JOB_MESSAGE_DETAILED: Autoscaling: Resized worker pool from 1 to 0.
INFO:apache_beam.runners.dataflow.dataflow_runner:2020-08-12T19:12:00.648Z: JOB_MESSAGE_BASIC: Worker pool stopped.
INFO:apache_beam.runners.dataflow.dataflow_runner:2020-08-12T19:12:00.690Z: JOB_MESSAGE_DEBUG: Tearing down pending resources...
INFO:apache_beam.runners.dataflow.dataflow_runner:Job 2020-08-12_12_05_03-551348558776852572 is in state JOB_STATE_DONE
INFO:apache_beam.runners.dataflow.dataflow_runner:2020-08-12T19:12:58.574Z: JOB_MESSAGE_BASIC: Finished operation Create/Read+metrics+map_to_common_key+GroupByKey/Reify+GroupByKey/Write
INFO:apache_beam.runners.dataflow.dataflow_runner:2020-08-12T19:12:58.701Z: JOB_MESSAGE_BASIC: Executing operation GroupByKey/Close
INFO:apache_beam.runners.dataflow.dataflow_runner:2020-08-12T19:12:58.756Z: JOB_MESSAGE_BASIC: Finished operation GroupByKey/Close
INFO:apache_beam.runners.dataflow.dataflow_runner:2020-08-12T19:12:58.836Z: JOB_MESSAGE_BASIC: Executing operation GroupByKey/Read+GroupByKey/GroupByWindow+m_out
INFO:apache_beam.runners.dataflow.dataflow_runner:2020-08-12T19:13:07.874Z: JOB_MESSAGE_BASIC: Finished operation GroupByKey/Read+GroupByKey/GroupByWindow+m_out
INFO:apache_beam.runners.dataflow.dataflow_runner:2020-08-12T19:13:07.936Z: JOB_MESSAGE_DEBUG: Executing success step success11
INFO:apache_beam.runners.dataflow.dataflow_runner:2020-08-12T19:13:08.068Z: JOB_MESSAGE_DETAILED: Cleaning up.
INFO:apache_beam.runners.dataflow.dataflow_runner:2020-08-12T19:13:08.126Z: JOB_MESSAGE_DEBUG: Starting worker pool teardown.
INFO:apache_beam.runners.dataflow.dataflow_runner:2020-08-12T19:13:08.173Z: JOB_MESSAGE_BASIC: Stopping worker pool...
INFO:apache_beam.runners.dataflow.dataflow_runner:2020-08-12T19:13:58.999Z: JOB_MESSAGE_DETAILED: Autoscaling: Resized worker pool from 1 to 0.
INFO:apache_beam.runners.dataflow.dataflow_runner:2020-08-12T19:13:59.052Z: JOB_MESSAGE_BASIC: Worker pool stopped.
INFO:apache_beam.runners.dataflow.dataflow_runner:2020-08-12T19:13:59.085Z: JOB_MESSAGE_DEBUG: Tearing down pending resources...
INFO:apache_beam.runners.dataflow.dataflow_runner:Job 2020-08-12_12_06_50-1758964360690793648 is in state JOB_STATE_DONE
test_autocomplete_it (apache_beam.examples.complete.autocomplete_test.AutocompleteTest) ... ok
test_streaming_wordcount_debugging_it (apache_beam.examples.streaming_wordcount_debugging_it_test.StreamingWordcountDebuggingIT) ... SKIP: Skipped due to [BEAM-3377]: assert_that not working for streaming
test_bigquery_tornadoes_it (apache_beam.examples.cookbook.bigquery_tornadoes_it_test.BigqueryTornadoesIT) ... ok
test_datastore_wordcount_it (apache_beam.examples.cookbook.datastore_wordcount_it_test.DatastoreWordCountIT) ... ok
test_leader_board_it (apache_beam.examples.complete.game.leader_board_it_test.LeaderBoardIT) ... ok
test_game_stats_it (apache_beam.examples.complete.game.game_stats_it_test.GameStatsIT) ... ok
test_streaming_wordcount_it (apache_beam.examples.streaming_wordcount_it_test.StreamingWordCountIT) ... ok
test_wordcount_it (apache_beam.examples.wordcount_it_test.WordCountIT) ... ok
test_wordcount_fnapi_it (apache_beam.examples.wordcount_it_test.WordCountIT) ... ok
test_user_score_it (apache_beam.examples.complete.game.user_score_it_test.UserScoreIT) ... ok
test_avro_it (apache_beam.examples.fastavro_it_test.FastavroIT) ... ok
test_hourly_team_score_it (apache_beam.examples.complete.game.hourly_team_score_it_test.HourlyTeamScoreIT) ... ok
test_read_via_sql (apache_beam.io.gcp.experimental.spannerio_read_it_test.SpannerReadIntegrationTest) ... ok
test_read_via_table (apache_beam.io.gcp.experimental.spannerio_read_it_test.SpannerReadIntegrationTest) ... ok
test_bigquery_read_1M_python (apache_beam.io.gcp.bigquery_io_read_it_test.BigqueryIOReadIT) ... ok
test_bigquery_read_custom_1M_python (apache_beam.io.gcp.bigquery_io_read_it_test.BigqueryIOReadIT) ... ok
test_bqfl_streaming (apache_beam.io.gcp.bigquery_file_loads_test.BigQueryFileLoadsIT) ... SKIP: TestStream is not supported on TestDataflowRunner
test_multiple_destinations_transform (apache_beam.io.gcp.bigquery_file_loads_test.BigQueryFileLoadsIT) ... ok
test_one_job_fails_all_jobs_fail (apache_beam.io.gcp.bigquery_file_loads_test.BigQueryFileLoadsIT) ... ok
test_iobase_source (apache_beam.io.gcp.bigquery_read_it_test.ReadNewTypesTests) ... ok
test_native_source (apache_beam.io.gcp.bigquery_read_it_test.ReadNewTypesTests) ... ok
test_iobase_source (apache_beam.io.gcp.bigquery_read_it_test.ReadTests) ... ok
test_native_source (apache_beam.io.gcp.bigquery_read_it_test.ReadTests) ... ok
test_avro_file_load (apache_beam.io.gcp.bigquery_test.BigQueryFileLoadsIntegrationTests) ... ok
test_spanner_error (apache_beam.io.gcp.experimental.spannerio_write_it_test.SpannerWriteIntegrationTest) ... ok
test_spanner_update (apache_beam.io.gcp.experimental.spannerio_write_it_test.SpannerWriteIntegrationTest) ... ok
test_write_batches (apache_beam.io.gcp.experimental.spannerio_write_it_test.SpannerWriteIntegrationTest) ... ok
test_copy (apache_beam.io.gcp.gcsio_integration_test.GcsIOIntegrationTest) ... ok
test_copy_batch (apache_beam.io.gcp.gcsio_integration_test.GcsIOIntegrationTest) ... ok
test_copy_batch_kms (apache_beam.io.gcp.gcsio_integration_test.GcsIOIntegrationTest) ... ok
test_copy_batch_rewrite_token (apache_beam.io.gcp.gcsio_integration_test.GcsIOIntegrationTest) ... ok
test_copy_kms (apache_beam.io.gcp.gcsio_integration_test.GcsIOIntegrationTest) ... ok
test_copy_rewrite_token (apache_beam.io.gcp.gcsio_integration_test.GcsIOIntegrationTest) ... ok
test_multiple_destinations_transform (apache_beam.io.gcp.bigquery_test.BigQueryStreamingInsertTransformIntegrationTests) ... ok
test_value_provider_transform (apache_beam.io.gcp.bigquery_test.BigQueryStreamingInsertTransformIntegrationTests) ... ok
test_transform_on_gcs (apache_beam.io.fileio_test.MatchIntegrationTest) ... ok
test_datastore_write_limit (apache_beam.io.gcp.datastore.v1new.datastore_write_it_test.DatastoreWriteIT) ... ok
test_parquetio_it (apache_beam.io.parquetio_it_test.TestParquetIT) ... ok
test_file_loads (apache_beam.io.gcp.bigquery_test.PubSubBigQueryIT) ... SKIP: https://issuetracker.google.com/issues/118375066
test_streaming_inserts (apache_beam.io.gcp.bigquery_test.PubSubBigQueryIT) ... ok
test_dicom_search_instances (apache_beam.io.gcp.dicomio_integration_test.DICOMIoIntegrationTest) ... ok
test_dicom_store_instance_from_gcs (apache_beam.io.gcp.dicomio_integration_test.DICOMIoIntegrationTest) ... ok
test_streaming_data_only (apache_beam.io.gcp.pubsub_integration_test.PubSubIntegrationTest) ... ok
test_streaming_with_attributes (apache_beam.io.gcp.pubsub_integration_test.PubSubIntegrationTest) ... ok
test_analyzing_syntax (apache_beam.ml.gcp.naturallanguageml_test_it.NaturalLanguageMlTestIT) ... ok
test_big_query_write (apache_beam.io.gcp.bigquery_write_it_test.BigQueryWriteIntegrationTests) ... ok
test_big_query_write_new_types (apache_beam.io.gcp.bigquery_write_it_test.BigQueryWriteIntegrationTests) ... ok
test_big_query_write_schema_autodetect (apache_beam.io.gcp.bigquery_write_it_test.BigQueryWriteIntegrationTests) ... SKIP: DataflowRunner does not support schema autodetection
test_big_query_write_without_schema (apache_beam.io.gcp.bigquery_write_it_test.BigQueryWriteIntegrationTests) ... ok
test_basic_execution (apache_beam.testing.test_stream_it_test.TestStreamIntegrationTests) ... SKIP: The "TestDataflowRunner", does not support the TestStream transform. Supported runners: ['DirectRunner', 'SwitchingDirectRunner']
Tests that the TestStream supports emitting to multiple PCollections. ... SKIP: The "TestDataflowRunner", does not support the TestStream transform. Supported runners: ['DirectRunner', 'SwitchingDirectRunner']
Tests that the TestStream can independently control output watermarks. ... SKIP: The "TestDataflowRunner", does not support the TestStream transform. Supported runners: ['DirectRunner', 'SwitchingDirectRunner']
test_text_detection_with_language_hint (apache_beam.ml.gcp.visionml_test_it.VisionMlTestIT) ... ok
test_label_detection_with_video_context (apache_beam.ml.gcp.videointelligenceml_test_it.VideoIntelligenceMlTestIT) ... ok
Runs streaming Dataflow job and verifies that user metrics are reported ... ok
test_big_query_legacy_sql (apache_beam.io.gcp.big_query_query_to_table_it_test.BigQueryQueryToTableIT) ... ok
test_big_query_new_types (apache_beam.io.gcp.big_query_query_to_table_it_test.BigQueryQueryToTableIT) ... ok
test_big_query_new_types_avro (apache_beam.io.gcp.big_query_query_to_table_it_test.BigQueryQueryToTableIT) ... ok
test_big_query_new_types_native (apache_beam.io.gcp.big_query_query_to_table_it_test.BigQueryQueryToTableIT) ... ok
test_big_query_standard_sql (apache_beam.io.gcp.big_query_query_to_table_it_test.BigQueryQueryToTableIT) ... ok
test_big_query_standard_sql_kms_key_native (apache_beam.io.gcp.big_query_query_to_table_it_test.BigQueryQueryToTableIT) ... ok
test_deidentification (apache_beam.ml.gcp.cloud_dlp_it_test.CloudDLPIT) ... ok
test_inspection (apache_beam.ml.gcp.cloud_dlp_it_test.CloudDLPIT) ... ok
test_job_python_from_python_it (apache_beam.transforms.external_it_test.ExternalTransformIT) ... ok
test_metrics_fnapi_it (apache_beam.runners.dataflow.dataflow_exercise_metrics_pipeline_test.ExerciseMetricsPipelineTest) ... ok
test_metrics_it (apache_beam.runners.dataflow.dataflow_exercise_metrics_pipeline_test.ExerciseMetricsPipelineTest) ... ok
----------------------------------------------------------------------
XML: nosetests-postCommitIT-df-py37.xml
----------------------------------------------------------------------
XML: <https://ci-beam.apache.org/job/beam_PostCommit_Python37/ws/src/sdks/python/nosetests.xml>
----------------------------------------------------------------------
Ran 66 tests in 4090.039s
OK (SKIP=7)
FAILURE: Build failed with an exception.
* Where:
Script '<https://ci-beam.apache.org/job/beam_PostCommit_Python37/ws/src/sdks/python/test-suites/portable/common.gradle'> line: 210
* What went wrong:
Execution failed for task ':sdks:python:test-suites:portable:py37:postCommitPy37IT'.
> Process 'command 'sh'' finished with non-zero exit value 1
* Try:
Run with --stacktrace option to get the stack trace. Run with --info or --debug option to get more log output. Run with --scan to get full insights.
* Get more help at https://help.gradle.org
Deprecated Gradle features were used in this build, making it incompatible with Gradle 6.0.
Use '--warning-mode all' to show the individual deprecation warnings.
See https://docs.gradle.org/5.2.1/userguide/command_line_interface.html#sec:command_line_warnings
BUILD FAILED in 1h 13m 6s
139 actionable tasks: 105 executed, 33 from cache, 1 up-to-date
Publishing build scan...
https://gradle.com/s/5lzhlbrnmfukm
Build step 'Invoke Gradle script' changed build result to FAILURE
Build step 'Invoke Gradle script' marked build as failure
---------------------------------------------------------------------
To unsubscribe, e-mail: builds-unsubscribe@beam.apache.org
For additional commands, e-mail: builds-help@beam.apache.org
Build failed in Jenkins: beam_PostCommit_Python37 #2708
Posted by Apache Jenkins Server <je...@builds.apache.org>.
See <https://ci-beam.apache.org/job/beam_PostCommit_Python37/2708/display/redirect>
Changes:
------------------------------------------
[...truncated 18.67 MB...]
"pipeline_proto_coder_id": "ref_Coder_FastPrimitivesCoder_6"
}
],
"is_pair_like": true,
"pipeline_proto_coder_id": "ref_Coder_FastPrimitivesCoder_6"
},
{
"@type": "kind:global_window"
}
],
"is_wrapper": true
},
"output_name": "None",
"user_name": "m_out.out"
}
],
"parallel_input": {
"@type": "OutputReference",
"output_name": "out",
"step_name": "s4"
},
"serialized_fn": "QlpoOTFBWSZTWWeYg/EAApJ/8H/////////////cwr///+ZjwCAAYEBAAvYZlAZGGqZKeap6nqaD1Bk2o9T9UeoGgAaAaDQaNPSeoaD1PUAGnqeoMj0gZNBKmiZNCYmI1J4mSbSYg0yZAAGgABoDQaABoNAyMgGmSIQ0pspptTYiDTTQNBgQyaAGIyAGg0Bp6BNqeoGgeoOAAAAAAAAAAaAAAAAAAAAADvptRksy3rYqqrRyJX2qH0NSOBctdVUdLQAm1Vh2UANxiG8xcsPs2/V+wqRYe1ULTTsFGP9a61H8xkkgE7und2KQKCYLXStXLn3eFthcDyETfV4UGFKZNeBBEHUSJLWyzBEAWMCthwxMLlv1cDyano9cgF8al+wdq5r/REAkG1Xg8aacyW/LCkBXoTuB4iGoncNkgf7kZTycpPhEogIUlcmUXbLXkkTvSvGWUVI8gorCTQi4qGCTsUwnjQkyt2ZyOO9OYuufzYucYr+tb6skz+fLbYmGltqvc0ZyO62U1BN/063ZqwM9sHukMYDtXzQzuCo6I8hcg9bN+uA5zVxEToRovLZIoOS0PpZ6DtewoIpXjNEHdMET2MhmBwtiJO/7kFGvRXCBJCR3E0VT+tlPoVcp7u8FEolFZEAQgtDOCFCYBounGasGioKCtPYuiTpMtBVhRemCeN1kw3xz7+O3HdpAYYCUXQKJCFvkypPA1qn+cbuIJzJofIN2BcCmDlvIBCstlwFz2aQYXYogZO/bA/V1tacCaIv1lmiMtOWCxQ22hA4/JeLrKatgfimoi1XTBYqKI1UlwpqoFFxMxI7eKk1vELwoiakO73oRuciOUowiTwDyilzBw1LIP03KHIxylREq0IIBlhEEIgRqAmRKSZspXcY8WJZc1S79gLtt2o65KoRUptqAP0C0mEjQrLUMMdcwvLxdDZ2YWF3a2YmEc6V3Flq/zGko0q1i7CE9F60VVmlLVbxGN1Kc8GIjGCmM2+eg7pKnM7xezfVKYmJBAxbGHNEIVArMrZhiGweBLCVomDBhtYxZft2DIMzallLUjBweKHOZYLJJaYlEbRaHX4A2iWd0kmIYgPGrVkkFdUkblNPWmlouz7UYWBJGThIYIMpTkP5/pJL782MpXbJs/HJr2mwipgUqF1LL6WhjchFIhEb70ijjxamTOr2EAb6pUqdP+qQ4F4FkIiHj/i7kinChIM8xB+I=",
"user_name": "m_out"
}
}
],
"type": "JOB_TYPE_BATCH"
}
INFO:apache_beam.runners.dataflow.internal.apiclient:Create job: <Job
createTime: '2020-08-12T13:03:04.353392Z'
currentStateTime: '1970-01-01T00:00:00Z'
id: '2020-08-12_06_03_02-13303307726263113777'
location: 'us-central1'
name: 'beamapp-jenkins-0812130253-833804'
projectId: 'apache-beam-testing'
stageStates: []
startTime: '2020-08-12T13:03:04.353392Z'
steps: []
tempFiles: []
type: TypeValueValuesEnum(JOB_TYPE_BATCH, 1)>
INFO:apache_beam.runners.dataflow.internal.apiclient:Created job with id: [2020-08-12_06_03_02-13303307726263113777]
INFO:apache_beam.runners.dataflow.internal.apiclient:Submitted job: 2020-08-12_06_03_02-13303307726263113777
INFO:apache_beam.runners.dataflow.internal.apiclient:To access the Dataflow monitoring console, please navigate to https://console.cloud.google.com/dataflow/jobs/us-central1/2020-08-12_06_03_02-13303307726263113777?project=apache-beam-testing
Worker logs: https://console.cloud.google.com/dataflow/jobs/us-central1/2020-08-12_06_03_02-13303307726263113777?project=apache-beam-testing
INFO:apache_beam.runners.dataflow.dataflow_runner:Job 2020-08-12_06_03_02-13303307726263113777 is in state JOB_STATE_RUNNING
INFO:apache_beam.runners.dataflow.dataflow_runner:2020-08-12T13:03:02.687Z: JOB_MESSAGE_DETAILED: Autoscaling is enabled for job 2020-08-12_06_03_02-13303307726263113777. The number of workers will be between 1 and 1000.
INFO:apache_beam.runners.dataflow.dataflow_runner:2020-08-12T13:03:02.687Z: JOB_MESSAGE_DETAILED: Autoscaling was automatically enabled for job 2020-08-12_06_03_02-13303307726263113777.
INFO:apache_beam.runners.dataflow.dataflow_runner:2020-08-12T13:03:06.963Z: JOB_MESSAGE_BASIC: Worker configuration: n1-standard-1 in us-central1-a.
INFO:apache_beam.runners.dataflow.dataflow_runner:2020-08-12T13:03:07.701Z: JOB_MESSAGE_DETAILED: Expanding CoGroupByKey operations into optimizable parts.
INFO:apache_beam.runners.dataflow.dataflow_runner:2020-08-12T13:03:07.725Z: JOB_MESSAGE_DEBUG: Combiner lifting skipped for step GroupByKey: GroupByKey not followed by a combiner.
INFO:apache_beam.runners.dataflow.dataflow_runner:2020-08-12T13:03:07.753Z: JOB_MESSAGE_DETAILED: Expanding GroupByKey operations into optimizable parts.
INFO:apache_beam.runners.dataflow.dataflow_runner:2020-08-12T13:03:07.785Z: JOB_MESSAGE_DETAILED: Lifting ValueCombiningMappingFns into MergeBucketsMappingFns
INFO:apache_beam.runners.dataflow.dataflow_runner:2020-08-12T13:03:07.869Z: JOB_MESSAGE_DEBUG: Annotating graph with Autotuner information.
INFO:apache_beam.runners.dataflow.dataflow_runner:2020-08-12T13:03:07.910Z: JOB_MESSAGE_DETAILED: Fusing adjacent ParDo, Read, Write, and Flatten operations
INFO:apache_beam.runners.dataflow.dataflow_runner:2020-08-12T13:03:07.933Z: JOB_MESSAGE_DETAILED: Fusing consumer metrics into Create/Read
INFO:apache_beam.runners.dataflow.dataflow_runner:2020-08-12T13:03:07.966Z: JOB_MESSAGE_DETAILED: Fusing consumer map_to_common_key into metrics
INFO:apache_beam.runners.dataflow.dataflow_runner:2020-08-12T13:03:08.003Z: JOB_MESSAGE_DETAILED: Fusing consumer GroupByKey/Reify into map_to_common_key
INFO:apache_beam.runners.dataflow.dataflow_runner:2020-08-12T13:03:08.025Z: JOB_MESSAGE_DETAILED: Fusing consumer GroupByKey/Write into GroupByKey/Reify
INFO:apache_beam.runners.dataflow.dataflow_runner:2020-08-12T13:03:08.056Z: JOB_MESSAGE_DETAILED: Fusing consumer GroupByKey/GroupByWindow into GroupByKey/Read
INFO:apache_beam.runners.dataflow.dataflow_runner:2020-08-12T13:03:08.091Z: JOB_MESSAGE_DETAILED: Fusing consumer m_out into GroupByKey/GroupByWindow
INFO:apache_beam.runners.dataflow.dataflow_runner:2020-08-12T13:03:08.125Z: JOB_MESSAGE_DEBUG: Workflow config is missing a default resource spec.
INFO:apache_beam.runners.dataflow.dataflow_runner:2020-08-12T13:03:08.160Z: JOB_MESSAGE_DEBUG: Adding StepResource setup and teardown to workflow graph.
INFO:apache_beam.runners.dataflow.dataflow_runner:2020-08-12T13:03:08.192Z: JOB_MESSAGE_DEBUG: Adding workflow start and stop steps.
INFO:apache_beam.runners.dataflow.dataflow_runner:2020-08-12T13:03:08.212Z: JOB_MESSAGE_DEBUG: Assigning stage ids.
INFO:apache_beam.runners.dataflow.dataflow_runner:2020-08-12T13:03:08.412Z: JOB_MESSAGE_DEBUG: Executing wait step start13
INFO:apache_beam.runners.dataflow.dataflow_runner:2020-08-12T13:03:08.513Z: JOB_MESSAGE_BASIC: Executing operation GroupByKey/Create
INFO:apache_beam.runners.dataflow.dataflow_runner:2020-08-12T13:03:08.548Z: JOB_MESSAGE_DEBUG: Starting worker pool setup.
INFO:apache_beam.runners.dataflow.dataflow_runner:2020-08-12T13:03:08.583Z: JOB_MESSAGE_BASIC: Starting 1 workers in us-central1-a...
INFO:apache_beam.runners.dataflow.dataflow_runner:2020-08-12T13:03:08.628Z: JOB_MESSAGE_BASIC: Finished operation GroupByKey/Create
INFO:apache_beam.runners.dataflow.dataflow_runner:2020-08-12T13:03:08.685Z: JOB_MESSAGE_DEBUG: Value "GroupByKey/Session" materialized.
INFO:apache_beam.runners.dataflow.dataflow_runner:2020-08-12T13:03:08.752Z: JOB_MESSAGE_BASIC: Executing operation Create/Read+metrics+map_to_common_key+GroupByKey/Reify+GroupByKey/Write
INFO:apache_beam.runners.dataflow.dataflow_runner:2020-08-12T13:03:33.004Z: JOB_MESSAGE_WARNING: Your project already contains 100 Dataflow-created metric descriptors and Stackdriver will not create new Dataflow custom metrics for this job. Each unique user-defined metric name (independent of the DoFn in which it is defined) produces a new metric descriptor. To delete old / unused metric descriptors see https://developers.google.com/apis-explorer/#p/monitoring/v3/monitoring.projects.metricDescriptors.list and https://developers.google.com/apis-explorer/#p/monitoring/v3/monitoring.projects.metricDescriptors.delete
INFO:apache_beam.runners.dataflow.dataflow_runner:2020-08-12T13:03:41.057Z: JOB_MESSAGE_DETAILED: Autoscaling: Raised the number of workers to 1 based on the rate of progress in the currently running stage(s).
INFO:apache_beam.runners.dataflow.dataflow_runner:2020-08-12T13:04:43.194Z: JOB_MESSAGE_BASIC: Executing BigQuery import job "dataflow_job_2889297553561486372". You can check its status with the bq tool: "bq show -j --project_id=apache-beam-testing dataflow_job_2889297553561486372".
INFO:apache_beam.runners.dataflow.dataflow_runner:2020-08-12T13:04:53.695Z: JOB_MESSAGE_BASIC: BigQuery import job "dataflow_job_2889297553561486372" done.
INFO:apache_beam.runners.dataflow.dataflow_runner:2020-08-12T13:04:54.464Z: JOB_MESSAGE_BASIC: Finished operation read+write/NativeWrite
INFO:apache_beam.runners.dataflow.dataflow_runner:2020-08-12T13:04:54.518Z: JOB_MESSAGE_DEBUG: Executing success step success1
INFO:apache_beam.runners.dataflow.dataflow_runner:2020-08-12T13:04:54.762Z: JOB_MESSAGE_DETAILED: Cleaning up.
INFO:apache_beam.runners.dataflow.dataflow_runner:2020-08-12T13:04:54.796Z: JOB_MESSAGE_DEBUG: Starting worker pool teardown.
INFO:apache_beam.runners.dataflow.dataflow_runner:2020-08-12T13:04:54.827Z: JOB_MESSAGE_BASIC: Stopping worker pool...
INFO:apache_beam.runners.dataflow.dataflow_runner:2020-08-12T13:05:02.807Z: JOB_MESSAGE_BASIC: Finished operation Create/Read+InspectForDetails/ParDo(_InspectFn)+ParDo(CallableWrapperDoFn)/ParDo(CallableWrapperDoFn)+Type matches/WindowInto(WindowIntoFn)+Type matches/ToVoidKey+Type matches/Group/pair_with_1+Type matches/Group/GroupByKey/Reify+Type matches/Group/GroupByKey/Write
INFO:apache_beam.runners.dataflow.dataflow_runner:2020-08-12T13:05:05.935Z: JOB_MESSAGE_BASIC: Finished operation Type matches/Create/Read+Type matches/Group/pair_with_0+Type matches/Group/GroupByKey/Reify+Type matches/Group/GroupByKey/Write
INFO:apache_beam.runners.dataflow.dataflow_runner:2020-08-12T13:05:06.023Z: JOB_MESSAGE_BASIC: Executing operation Type matches/Group/GroupByKey/Close
INFO:apache_beam.runners.dataflow.dataflow_runner:2020-08-12T13:05:06.129Z: JOB_MESSAGE_BASIC: Finished operation Type matches/Group/GroupByKey/Close
INFO:apache_beam.runners.dataflow.dataflow_runner:2020-08-12T13:05:06.214Z: JOB_MESSAGE_BASIC: Executing operation Type matches/Group/GroupByKey/Read+Type matches/Group/GroupByKey/GroupByWindow+Type matches/Group/Map(_merge_tagged_vals_under_key)+Type matches/Unkey+Type matches/Match
INFO:apache_beam.runners.dataflow.dataflow_runner:2020-08-12T13:05:15.319Z: JOB_MESSAGE_BASIC: Finished operation Type matches/Group/GroupByKey/Read+Type matches/Group/GroupByKey/GroupByWindow+Type matches/Group/Map(_merge_tagged_vals_under_key)+Type matches/Unkey+Type matches/Match
INFO:apache_beam.runners.dataflow.dataflow_runner:2020-08-12T13:05:15.678Z: JOB_MESSAGE_DEBUG: Executing success step success19
INFO:apache_beam.runners.dataflow.dataflow_runner:2020-08-12T13:05:15.792Z: JOB_MESSAGE_DETAILED: Cleaning up.
INFO:apache_beam.runners.dataflow.dataflow_runner:2020-08-12T13:05:15.849Z: JOB_MESSAGE_DEBUG: Starting worker pool teardown.
INFO:apache_beam.runners.dataflow.dataflow_runner:2020-08-12T13:05:15.877Z: JOB_MESSAGE_BASIC: Stopping worker pool...
INFO:apache_beam.runners.dataflow.dataflow_runner:2020-08-12T13:05:25.409Z: JOB_MESSAGE_DETAILED: Workers have started successfully.
INFO:apache_beam.runners.dataflow.dataflow_runner:2020-08-12T13:05:25.439Z: JOB_MESSAGE_DETAILED: Workers have started successfully.
INFO:apache_beam.runners.dataflow.dataflow_runner:2020-08-12T13:05:42.035Z: JOB_MESSAGE_DETAILED: Autoscaling: Resized worker pool from 1 to 0.
INFO:apache_beam.runners.dataflow.dataflow_runner:2020-08-12T13:05:42.068Z: JOB_MESSAGE_BASIC: Worker pool stopped.
INFO:apache_beam.runners.dataflow.dataflow_runner:2020-08-12T13:05:42.094Z: JOB_MESSAGE_DEBUG: Tearing down pending resources...
INFO:apache_beam.runners.dataflow.dataflow_runner:Job 2020-08-12_05_59_06-16216981811570707091 is in state JOB_STATE_DONE
INFO:apache_beam.io.gcp.tests.bigquery_matcher:Attempting to perform query SELECT fruit from `python_query_to_table_15972371332854.output_table`; to BQ
DEBUG:google.auth._default:Checking None for explicit credentials as part of auth process...
DEBUG:google.auth._default:Checking Cloud SDK credentials as part of auth process...
DEBUG:google.auth._default:Cloud SDK credentials not found on disk; not using them
DEBUG:google.auth._default:Checking for App Engine runtime as part of auth process...
DEBUG:google.auth._default:No App Engine library was found so cannot authentication via App Engine Identity Credentials.
DEBUG:google.auth.transport._http_client:Making request: GET http://169.254.169.254
DEBUG:google.auth.transport._http_client:Making request: GET http://metadata.google.internal/computeMetadata/v1/project/project-id
DEBUG:urllib3.util.retry:Converted retries value: 3 -> Retry(total=3, connect=None, read=None, redirect=None, status=None)
DEBUG:google.auth.transport.requests:Making request: GET http://metadata.google.internal/computeMetadata/v1/instance/service-accounts/default/?recursive=true
DEBUG:urllib3.connectionpool:Starting new HTTP connection (1): metadata.google.internal:80
DEBUG:urllib3.connectionpool:http://metadata.google.internal:80 "GET /computeMetadata/v1/instance/service-accounts/default/?recursive=true HTTP/1.1" 200 144
DEBUG:google.auth.transport.requests:Making request: GET http://metadata.google.internal/computeMetadata/v1/instance/service-accounts/844138762903-compute@developer.gserviceaccount.com/token
DEBUG:urllib3.connectionpool:http://metadata.google.internal:80 "GET /computeMetadata/v1/instance/service-accounts/844138762903-compute@developer.gserviceaccount.com/token HTTP/1.1" 200 221
DEBUG:urllib3.connectionpool:Starting new HTTPS connection (1): bigquery.googleapis.com:443
DEBUG:urllib3.connectionpool:https://bigquery.googleapis.com:443 "POST /bigquery/v2/projects/apache-beam-testing/jobs HTTP/1.1" 200 None
DEBUG:urllib3.connectionpool:https://bigquery.googleapis.com:443 "GET /bigquery/v2/projects/apache-beam-testing/queries/c03644a3-e70f-4a8e-99f9-be0ad438a41f?maxResults=0&location=US HTTP/1.1" 200 None
DEBUG:urllib3.connectionpool:https://bigquery.googleapis.com:443 "GET /bigquery/v2/projects/apache-beam-testing/datasets/_7357fab0f784d2a7327ddbe81cdd1f4ca7e429cd/tables/anon32887248f5fc76bdce0b5db2f87095f5e12b2f68/data HTTP/1.1" 200 None
INFO:apache_beam.io.gcp.tests.bigquery_matcher:Read from given query (SELECT fruit from `python_query_to_table_15972371332854.output_table`;), total rows 2
INFO:apache_beam.io.gcp.tests.bigquery_matcher:Generate checksum: 158a8ea1c254fcf40d4ed3e7c0242c3ea0a29e72
INFO:apache_beam.runners.dataflow.dataflow_runner:2020-08-12T13:05:50.564Z: JOB_MESSAGE_BASIC: Finished operation Create/Read+ExternalTransform(simple)/Map(<lambda at external_it_test.py:43>)+assert_that/WindowInto(WindowIntoFn)+assert_that/ToVoidKey+assert_that/Group/pair_with_1+assert_that/Group/GroupByKey/Reify+assert_that/Group/GroupByKey/Write
INFO:apache_beam.runners.dataflow.dataflow_runner:2020-08-12T13:05:53.818Z: JOB_MESSAGE_BASIC: Finished operation assert_that/Create/Read+assert_that/Group/pair_with_0+assert_that/Group/GroupByKey/Reify+assert_that/Group/GroupByKey/Write
INFO:apache_beam.runners.dataflow.dataflow_runner:2020-08-12T13:05:53.904Z: JOB_MESSAGE_BASIC: Executing operation assert_that/Group/GroupByKey/Close
INFO:apache_beam.runners.dataflow.dataflow_runner:2020-08-12T13:05:53.965Z: JOB_MESSAGE_BASIC: Finished operation assert_that/Group/GroupByKey/Close
INFO:apache_beam.runners.dataflow.dataflow_runner:2020-08-12T13:05:54.038Z: JOB_MESSAGE_BASIC: Executing operation assert_that/Group/GroupByKey/Read+assert_that/Group/GroupByKey/GroupByWindow+assert_that/Group/Map(_merge_tagged_vals_under_key)+assert_that/Unkey+assert_that/Match
INFO:apache_beam.runners.dataflow.dataflow_runner:2020-08-12T13:06:03.742Z: JOB_MESSAGE_BASIC: Finished operation assert_that/Group/GroupByKey/Read+assert_that/Group/GroupByKey/GroupByWindow+assert_that/Group/Map(_merge_tagged_vals_under_key)+assert_that/Unkey+assert_that/Match
INFO:apache_beam.runners.dataflow.dataflow_runner:2020-08-12T13:06:04.283Z: JOB_MESSAGE_DEBUG: Executing success step success19
INFO:apache_beam.runners.dataflow.dataflow_runner:2020-08-12T13:06:05.485Z: JOB_MESSAGE_DETAILED: Cleaning up.
INFO:apache_beam.runners.dataflow.dataflow_runner:2020-08-12T13:06:05.883Z: JOB_MESSAGE_DEBUG: Starting worker pool teardown.
INFO:apache_beam.runners.dataflow.dataflow_runner:2020-08-12T13:06:05.967Z: JOB_MESSAGE_BASIC: Stopping worker pool...
INFO:apache_beam.runners.dataflow.dataflow_runner:2020-08-12T13:06:16.737Z: JOB_MESSAGE_DETAILED: Autoscaling: Resized worker pool from 1 to 0.
INFO:apache_beam.runners.dataflow.dataflow_runner:2020-08-12T13:06:16.774Z: JOB_MESSAGE_BASIC: Worker pool stopped.
INFO:apache_beam.runners.dataflow.dataflow_runner:2020-08-12T13:06:16.813Z: JOB_MESSAGE_DEBUG: Tearing down pending resources...
INFO:apache_beam.runners.dataflow.dataflow_runner:Job 2020-08-12_05_59_33-4686296226130139599 is in state JOB_STATE_DONE
INFO:apache_beam.runners.dataflow.dataflow_runner:2020-08-12T13:06:58.624Z: JOB_MESSAGE_DETAILED: Autoscaling: Resized worker pool from 1 to 0.
INFO:apache_beam.runners.dataflow.dataflow_runner:2020-08-12T13:06:58.681Z: JOB_MESSAGE_BASIC: Worker pool stopped.
INFO:apache_beam.runners.dataflow.dataflow_runner:2020-08-12T13:06:58.722Z: JOB_MESSAGE_DEBUG: Tearing down pending resources...
INFO:apache_beam.runners.dataflow.dataflow_runner:Job 2020-08-12_05_59_59-13960231851704923909 is in state JOB_STATE_DONE
INFO:apache_beam.runners.dataflow.dataflow_runner:2020-08-12T13:09:09.690Z: JOB_MESSAGE_BASIC: Finished operation Create/Read+metrics+map_to_common_key+GroupByKey/Reify+GroupByKey/Write
INFO:apache_beam.runners.dataflow.dataflow_runner:2020-08-12T13:09:09.971Z: JOB_MESSAGE_BASIC: Executing operation GroupByKey/Close
INFO:apache_beam.runners.dataflow.dataflow_runner:2020-08-12T13:09:10.014Z: JOB_MESSAGE_BASIC: Finished operation GroupByKey/Close
INFO:apache_beam.runners.dataflow.dataflow_runner:2020-08-12T13:09:10.073Z: JOB_MESSAGE_BASIC: Executing operation GroupByKey/Read+GroupByKey/GroupByWindow+m_out
INFO:apache_beam.runners.dataflow.dataflow_runner:2020-08-12T13:09:18.068Z: JOB_MESSAGE_BASIC: Finished operation GroupByKey/Read+GroupByKey/GroupByWindow+m_out
INFO:apache_beam.runners.dataflow.dataflow_runner:2020-08-12T13:09:18.141Z: JOB_MESSAGE_DEBUG: Executing success step success11
INFO:apache_beam.runners.dataflow.dataflow_runner:2020-08-12T13:09:18.247Z: JOB_MESSAGE_DETAILED: Cleaning up.
INFO:apache_beam.runners.dataflow.dataflow_runner:2020-08-12T13:09:18.290Z: JOB_MESSAGE_DEBUG: Starting worker pool teardown.
INFO:apache_beam.runners.dataflow.dataflow_runner:2020-08-12T13:09:18.328Z: JOB_MESSAGE_BASIC: Stopping worker pool...
INFO:apache_beam.runners.dataflow.dataflow_runner:2020-08-12T13:10:13.108Z: JOB_MESSAGE_DETAILED: Autoscaling: Resized worker pool from 1 to 0.
INFO:apache_beam.runners.dataflow.dataflow_runner:2020-08-12T13:10:13.169Z: JOB_MESSAGE_BASIC: Worker pool stopped.
INFO:apache_beam.runners.dataflow.dataflow_runner:2020-08-12T13:10:13.205Z: JOB_MESSAGE_DEBUG: Tearing down pending resources...
INFO:apache_beam.runners.dataflow.dataflow_runner:Job 2020-08-12_06_03_02-13303307726263113777 is in state JOB_STATE_DONE
test_autocomplete_it (apache_beam.examples.complete.autocomplete_test.AutocompleteTest) ... ok
test_streaming_wordcount_debugging_it (apache_beam.examples.streaming_wordcount_debugging_it_test.StreamingWordcountDebuggingIT) ... SKIP: Skipped due to [BEAM-3377]: assert_that not working for streaming
test_bigquery_tornadoes_it (apache_beam.examples.cookbook.bigquery_tornadoes_it_test.BigqueryTornadoesIT) ... ok
test_datastore_wordcount_it (apache_beam.examples.cookbook.datastore_wordcount_it_test.DatastoreWordCountIT) ... ok
test_leader_board_it (apache_beam.examples.complete.game.leader_board_it_test.LeaderBoardIT) ... ok
test_game_stats_it (apache_beam.examples.complete.game.game_stats_it_test.GameStatsIT) ... ok
test_streaming_wordcount_it (apache_beam.examples.streaming_wordcount_it_test.StreamingWordCountIT) ... ok
test_wordcount_fnapi_it (apache_beam.examples.wordcount_it_test.WordCountIT) ... ok
test_wordcount_it (apache_beam.examples.wordcount_it_test.WordCountIT) ... ok
test_user_score_it (apache_beam.examples.complete.game.user_score_it_test.UserScoreIT) ... ok
test_avro_it (apache_beam.examples.fastavro_it_test.FastavroIT) ... ok
test_hourly_team_score_it (apache_beam.examples.complete.game.hourly_team_score_it_test.HourlyTeamScoreIT) ... ok
test_read_via_sql (apache_beam.io.gcp.experimental.spannerio_read_it_test.SpannerReadIntegrationTest) ... ok
test_read_via_table (apache_beam.io.gcp.experimental.spannerio_read_it_test.SpannerReadIntegrationTest) ... ok
test_bigquery_read_1M_python (apache_beam.io.gcp.bigquery_io_read_it_test.BigqueryIOReadIT) ... ok
test_bigquery_read_custom_1M_python (apache_beam.io.gcp.bigquery_io_read_it_test.BigqueryIOReadIT) ... ok
test_iobase_source (apache_beam.io.gcp.bigquery_read_it_test.ReadNewTypesTests) ... ok
test_native_source (apache_beam.io.gcp.bigquery_read_it_test.ReadNewTypesTests) ... ok
test_bqfl_streaming (apache_beam.io.gcp.bigquery_file_loads_test.BigQueryFileLoadsIT) ... SKIP: TestStream is not supported on TestDataflowRunner
test_multiple_destinations_transform (apache_beam.io.gcp.bigquery_file_loads_test.BigQueryFileLoadsIT) ... ok
test_one_job_fails_all_jobs_fail (apache_beam.io.gcp.bigquery_file_loads_test.BigQueryFileLoadsIT) ... ok
test_avro_file_load (apache_beam.io.gcp.bigquery_test.BigQueryFileLoadsIntegrationTests) ... ok
test_spanner_error (apache_beam.io.gcp.experimental.spannerio_write_it_test.SpannerWriteIntegrationTest) ... ok
test_spanner_update (apache_beam.io.gcp.experimental.spannerio_write_it_test.SpannerWriteIntegrationTest) ... ok
test_write_batches (apache_beam.io.gcp.experimental.spannerio_write_it_test.SpannerWriteIntegrationTest) ... ok
test_iobase_source (apache_beam.io.gcp.bigquery_read_it_test.ReadTests) ... ok
test_native_source (apache_beam.io.gcp.bigquery_read_it_test.ReadTests) ... ok
test_copy (apache_beam.io.gcp.gcsio_integration_test.GcsIOIntegrationTest) ... ok
test_copy_batch (apache_beam.io.gcp.gcsio_integration_test.GcsIOIntegrationTest) ... ok
test_copy_batch_kms (apache_beam.io.gcp.gcsio_integration_test.GcsIOIntegrationTest) ... ok
test_copy_batch_rewrite_token (apache_beam.io.gcp.gcsio_integration_test.GcsIOIntegrationTest) ... ok
test_copy_kms (apache_beam.io.gcp.gcsio_integration_test.GcsIOIntegrationTest) ... ok
test_copy_rewrite_token (apache_beam.io.gcp.gcsio_integration_test.GcsIOIntegrationTest) ... ok
test_multiple_destinations_transform (apache_beam.io.gcp.bigquery_test.BigQueryStreamingInsertTransformIntegrationTests) ... ok
test_value_provider_transform (apache_beam.io.gcp.bigquery_test.BigQueryStreamingInsertTransformIntegrationTests) ... ok
test_datastore_write_limit (apache_beam.io.gcp.datastore.v1new.datastore_write_it_test.DatastoreWriteIT) ... ok
test_transform_on_gcs (apache_beam.io.fileio_test.MatchIntegrationTest) ... ok
test_file_loads (apache_beam.io.gcp.bigquery_test.PubSubBigQueryIT) ... SKIP: https://issuetracker.google.com/issues/118375066
test_streaming_inserts (apache_beam.io.gcp.bigquery_test.PubSubBigQueryIT) ... ok
test_parquetio_it (apache_beam.io.parquetio_it_test.TestParquetIT) ... ok
test_dicom_search_instances (apache_beam.io.gcp.dicomio_integration_test.DICOMIoIntegrationTest) ... ok
test_dicom_store_instance_from_gcs (apache_beam.io.gcp.dicomio_integration_test.DICOMIoIntegrationTest) ... ok
test_streaming_data_only (apache_beam.io.gcp.pubsub_integration_test.PubSubIntegrationTest) ... ok
test_streaming_with_attributes (apache_beam.io.gcp.pubsub_integration_test.PubSubIntegrationTest) ... ok
test_analyzing_syntax (apache_beam.ml.gcp.naturallanguageml_test_it.NaturalLanguageMlTestIT) ... ok
test_text_detection_with_language_hint (apache_beam.ml.gcp.visionml_test_it.VisionMlTestIT) ... ok
test_basic_execution (apache_beam.testing.test_stream_it_test.TestStreamIntegrationTests) ... SKIP: The "TestDataflowRunner", does not support the TestStream transform. Supported runners: ['DirectRunner', 'SwitchingDirectRunner']
Tests that the TestStream supports emitting to multiple PCollections. ... SKIP: The "TestDataflowRunner", does not support the TestStream transform. Supported runners: ['DirectRunner', 'SwitchingDirectRunner']
Tests that the TestStream can independently control output watermarks. ... SKIP: The "TestDataflowRunner", does not support the TestStream transform. Supported runners: ['DirectRunner', 'SwitchingDirectRunner']
test_big_query_write (apache_beam.io.gcp.bigquery_write_it_test.BigQueryWriteIntegrationTests) ... ok
test_big_query_write_new_types (apache_beam.io.gcp.bigquery_write_it_test.BigQueryWriteIntegrationTests) ... ok
test_big_query_write_schema_autodetect (apache_beam.io.gcp.bigquery_write_it_test.BigQueryWriteIntegrationTests) ... SKIP: DataflowRunner does not support schema autodetection
test_big_query_write_without_schema (apache_beam.io.gcp.bigquery_write_it_test.BigQueryWriteIntegrationTests) ... ok
test_label_detection_with_video_context (apache_beam.ml.gcp.videointelligenceml_test_it.VideoIntelligenceMlTestIT) ... ok
Runs streaming Dataflow job and verifies that user metrics are reported ... ok
test_big_query_legacy_sql (apache_beam.io.gcp.big_query_query_to_table_it_test.BigQueryQueryToTableIT) ... ok
test_big_query_new_types (apache_beam.io.gcp.big_query_query_to_table_it_test.BigQueryQueryToTableIT) ... ok
test_big_query_new_types_avro (apache_beam.io.gcp.big_query_query_to_table_it_test.BigQueryQueryToTableIT) ... ok
test_big_query_new_types_native (apache_beam.io.gcp.big_query_query_to_table_it_test.BigQueryQueryToTableIT) ... ok
test_big_query_standard_sql (apache_beam.io.gcp.big_query_query_to_table_it_test.BigQueryQueryToTableIT) ... ok
test_big_query_standard_sql_kms_key_native (apache_beam.io.gcp.big_query_query_to_table_it_test.BigQueryQueryToTableIT) ... ok
test_deidentification (apache_beam.ml.gcp.cloud_dlp_it_test.CloudDLPIT) ... ok
test_inspection (apache_beam.ml.gcp.cloud_dlp_it_test.CloudDLPIT) ... ok
test_job_python_from_python_it (apache_beam.transforms.external_it_test.ExternalTransformIT) ... ok
test_metrics_fnapi_it (apache_beam.runners.dataflow.dataflow_exercise_metrics_pipeline_test.ExerciseMetricsPipelineTest) ... ok
test_metrics_it (apache_beam.runners.dataflow.dataflow_exercise_metrics_pipeline_test.ExerciseMetricsPipelineTest) ... ok
----------------------------------------------------------------------
XML: nosetests-postCommitIT-df-py37.xml
----------------------------------------------------------------------
XML: <https://ci-beam.apache.org/job/beam_PostCommit_Python37/ws/src/sdks/python/nosetests.xml>
----------------------------------------------------------------------
Ran 66 tests in 4065.652s
OK (SKIP=7)
FAILURE: Build failed with an exception.
* Where:
Script '<https://ci-beam.apache.org/job/beam_PostCommit_Python37/ws/src/sdks/python/test-suites/portable/common.gradle'> line: 210
* What went wrong:
Execution failed for task ':sdks:python:test-suites:portable:py37:postCommitPy37IT'.
> Process 'command 'sh'' finished with non-zero exit value 1
* Try:
Run with --stacktrace option to get the stack trace. Run with --info or --debug option to get more log output. Run with --scan to get full insights.
* Get more help at https://help.gradle.org
Deprecated Gradle features were used in this build, making it incompatible with Gradle 6.0.
Use '--warning-mode all' to show the individual deprecation warnings.
See https://docs.gradle.org/5.2.1/userguide/command_line_interface.html#sec:command_line_warnings
BUILD FAILED in 1h 10m 9s
139 actionable tasks: 104 executed, 34 from cache, 1 up-to-date
Publishing build scan...
https://gradle.com/s/7pjilas4renno
Build step 'Invoke Gradle script' changed build result to FAILURE
Build step 'Invoke Gradle script' marked build as failure
---------------------------------------------------------------------
To unsubscribe, e-mail: builds-unsubscribe@beam.apache.org
For additional commands, e-mail: builds-help@beam.apache.org
Build failed in Jenkins: beam_PostCommit_Python37 #2707
Posted by Apache Jenkins Server <je...@builds.apache.org>.
See <https://ci-beam.apache.org/job/beam_PostCommit_Python37/2707/display/redirect?page=changes>
Changes:
[michal.walenia] [BEAM-10492] Add missing sideinput handling to DLP transforms
[noreply] Use new ZetaSQL value create API (#12536)
------------------------------------------
[...truncated 18.60 MB...]
INFO:apache_beam.runners.dataflow.dataflow_runner:2020-08-12T07:05:13.082Z: JOB_MESSAGE_BASIC: Finished operation assert_that/Group/GroupByKey/Read+assert_that/Group/GroupByKey/GroupByWindow+assert_that/Group/Map(_merge_tagged_vals_under_key)+assert_that/Unkey+assert_that/Match
INFO:apache_beam.runners.dataflow.dataflow_runner:2020-08-12T07:05:13.269Z: JOB_MESSAGE_DEBUG: Executing success step success19
INFO:apache_beam.runners.dataflow.dataflow_runner:2020-08-12T07:05:13.431Z: JOB_MESSAGE_DETAILED: Cleaning up.
INFO:apache_beam.runners.dataflow.dataflow_runner:2020-08-12T07:05:13.601Z: JOB_MESSAGE_DEBUG: Starting worker pool teardown.
INFO:apache_beam.runners.dataflow.dataflow_runner:2020-08-12T07:05:13.650Z: JOB_MESSAGE_BASIC: Stopping worker pool...
INFO:apache_beam.runners.dataflow.dataflow_runner:2020-08-12T07:06:07.207Z: JOB_MESSAGE_DETAILED: Autoscaling: Resized worker pool from 1 to 0.
INFO:apache_beam.runners.dataflow.dataflow_runner:2020-08-12T07:06:07.290Z: JOB_MESSAGE_BASIC: Worker pool stopped.
INFO:apache_beam.runners.dataflow.dataflow_runner:2020-08-12T07:06:07.356Z: JOB_MESSAGE_DEBUG: Tearing down pending resources...
INFO:apache_beam.runners.dataflow.dataflow_runner:Job 2020-08-11_23_59_07-14984072547588181513 is in state JOB_STATE_DONE
INFO:apache_beam.runners.dataflow.dataflow_runner:2020-08-12T07:06:56.979Z: JOB_MESSAGE_BASIC: Finished operation Create/Read+metrics+map_to_common_key+GroupByKey/Reify+GroupByKey/Write
INFO:apache_beam.runners.dataflow.dataflow_runner:2020-08-12T07:06:57.096Z: JOB_MESSAGE_BASIC: Executing operation GroupByKey/Close
INFO:apache_beam.runners.dataflow.dataflow_runner:2020-08-12T07:06:57.150Z: JOB_MESSAGE_BASIC: Finished operation GroupByKey/Close
INFO:apache_beam.runners.dataflow.dataflow_runner:2020-08-12T07:06:57.222Z: JOB_MESSAGE_BASIC: Executing operation GroupByKey/Read+GroupByKey/GroupByWindow+m_out
INFO:apache_beam.runners.dataflow.dataflow_runner:2020-08-12T07:07:06.285Z: JOB_MESSAGE_BASIC: Finished operation GroupByKey/Read+GroupByKey/GroupByWindow+m_out
INFO:apache_beam.runners.dataflow.dataflow_runner:2020-08-12T07:07:06.353Z: JOB_MESSAGE_DEBUG: Executing success step success11
INFO:apache_beam.runners.dataflow.dataflow_runner:2020-08-12T07:07:06.466Z: JOB_MESSAGE_DETAILED: Cleaning up.
INFO:apache_beam.runners.dataflow.dataflow_runner:2020-08-12T07:07:06.542Z: JOB_MESSAGE_DEBUG: Starting worker pool teardown.
INFO:apache_beam.runners.dataflow.dataflow_runner:2020-08-12T07:07:06.569Z: JOB_MESSAGE_BASIC: Stopping worker pool...
INFO:apache_beam.runners.dataflow.dataflow_runner:2020-08-12T07:08:02.046Z: JOB_MESSAGE_DETAILED: Autoscaling: Resized worker pool from 1 to 0.
INFO:apache_beam.runners.dataflow.dataflow_runner:2020-08-12T07:08:02.089Z: JOB_MESSAGE_BASIC: Worker pool stopped.
INFO:apache_beam.runners.dataflow.dataflow_runner:2020-08-12T07:08:02.127Z: JOB_MESSAGE_DEBUG: Tearing down pending resources...
INFO:apache_beam.runners.dataflow.dataflow_runner:Job 2020-08-12_00_01_04-8058833730438781860 is in state JOB_STATE_DONE
test_autocomplete_it (apache_beam.examples.complete.autocomplete_test.AutocompleteTest) ... ok
test_streaming_wordcount_debugging_it (apache_beam.examples.streaming_wordcount_debugging_it_test.StreamingWordcountDebuggingIT) ... SKIP: Skipped due to [BEAM-3377]: assert_that not working for streaming
test_bigquery_tornadoes_it (apache_beam.examples.cookbook.bigquery_tornadoes_it_test.BigqueryTornadoesIT) ... ok
test_datastore_wordcount_it (apache_beam.examples.cookbook.datastore_wordcount_it_test.DatastoreWordCountIT) ... ok
test_leader_board_it (apache_beam.examples.complete.game.leader_board_it_test.LeaderBoardIT) ... ok
test_game_stats_it (apache_beam.examples.complete.game.game_stats_it_test.GameStatsIT) ... ok
test_streaming_wordcount_it (apache_beam.examples.streaming_wordcount_it_test.StreamingWordCountIT) ... ok
test_wordcount_fnapi_it (apache_beam.examples.wordcount_it_test.WordCountIT) ... ok
test_wordcount_it (apache_beam.examples.wordcount_it_test.WordCountIT) ... ok
test_hourly_team_score_it (apache_beam.examples.complete.game.hourly_team_score_it_test.HourlyTeamScoreIT) ... ok
test_avro_it (apache_beam.examples.fastavro_it_test.FastavroIT) ... ok
test_user_score_it (apache_beam.examples.complete.game.user_score_it_test.UserScoreIT) ... ok
test_read_via_sql (apache_beam.io.gcp.experimental.spannerio_read_it_test.SpannerReadIntegrationTest) ... ok
test_read_via_table (apache_beam.io.gcp.experimental.spannerio_read_it_test.SpannerReadIntegrationTest) ... ok
test_bigquery_read_1M_python (apache_beam.io.gcp.bigquery_io_read_it_test.BigqueryIOReadIT) ... ok
test_bigquery_read_custom_1M_python (apache_beam.io.gcp.bigquery_io_read_it_test.BigqueryIOReadIT) ... ok
test_iobase_source (apache_beam.io.gcp.bigquery_read_it_test.ReadNewTypesTests) ... ok
test_native_source (apache_beam.io.gcp.bigquery_read_it_test.ReadNewTypesTests) ... ok
test_bqfl_streaming (apache_beam.io.gcp.bigquery_file_loads_test.BigQueryFileLoadsIT) ... SKIP: TestStream is not supported on TestDataflowRunner
test_multiple_destinations_transform (apache_beam.io.gcp.bigquery_file_loads_test.BigQueryFileLoadsIT) ... ok
test_one_job_fails_all_jobs_fail (apache_beam.io.gcp.bigquery_file_loads_test.BigQueryFileLoadsIT) ... ok
test_iobase_source (apache_beam.io.gcp.bigquery_read_it_test.ReadTests) ... ok
test_native_source (apache_beam.io.gcp.bigquery_read_it_test.ReadTests) ... ok
test_avro_file_load (apache_beam.io.gcp.bigquery_test.BigQueryFileLoadsIntegrationTests) ... ok
test_spanner_error (apache_beam.io.gcp.experimental.spannerio_write_it_test.SpannerWriteIntegrationTest) ... ok
test_spanner_update (apache_beam.io.gcp.experimental.spannerio_write_it_test.SpannerWriteIntegrationTest) ... ok
test_write_batches (apache_beam.io.gcp.experimental.spannerio_write_it_test.SpannerWriteIntegrationTest) ... ok
test_copy (apache_beam.io.gcp.gcsio_integration_test.GcsIOIntegrationTest) ... ok
test_copy_batch (apache_beam.io.gcp.gcsio_integration_test.GcsIOIntegrationTest) ... ok
test_copy_batch_kms (apache_beam.io.gcp.gcsio_integration_test.GcsIOIntegrationTest) ... ok
test_copy_batch_rewrite_token (apache_beam.io.gcp.gcsio_integration_test.GcsIOIntegrationTest) ... ok
test_copy_kms (apache_beam.io.gcp.gcsio_integration_test.GcsIOIntegrationTest) ... ok
test_copy_rewrite_token (apache_beam.io.gcp.gcsio_integration_test.GcsIOIntegrationTest) ... ok
test_multiple_destinations_transform (apache_beam.io.gcp.bigquery_test.BigQueryStreamingInsertTransformIntegrationTests) ... ok
test_value_provider_transform (apache_beam.io.gcp.bigquery_test.BigQueryStreamingInsertTransformIntegrationTests) ... ok
test_dicom_search_instances (apache_beam.io.gcp.dicomio_integration_test.DICOMIoIntegrationTest) ... ok
test_dicom_store_instance_from_gcs (apache_beam.io.gcp.dicomio_integration_test.DICOMIoIntegrationTest) ... ERROR
test_transform_on_gcs (apache_beam.io.fileio_test.MatchIntegrationTest) ... ok
test_datastore_write_limit (apache_beam.io.gcp.datastore.v1new.datastore_write_it_test.DatastoreWriteIT) ... ok
test_parquetio_it (apache_beam.io.parquetio_it_test.TestParquetIT) ... ok
test_file_loads (apache_beam.io.gcp.bigquery_test.PubSubBigQueryIT) ... SKIP: https://issuetracker.google.com/issues/118375066
test_streaming_inserts (apache_beam.io.gcp.bigquery_test.PubSubBigQueryIT) ... ok
test_streaming_data_only (apache_beam.io.gcp.pubsub_integration_test.PubSubIntegrationTest) ... ok
test_streaming_with_attributes (apache_beam.io.gcp.pubsub_integration_test.PubSubIntegrationTest) ... ok
test_analyzing_syntax (apache_beam.ml.gcp.naturallanguageml_test_it.NaturalLanguageMlTestIT) ... ok
test_label_detection_with_video_context (apache_beam.ml.gcp.videointelligenceml_test_it.VideoIntelligenceMlTestIT) ... ok
test_basic_execution (apache_beam.testing.test_stream_it_test.TestStreamIntegrationTests) ... SKIP: The "TestDataflowRunner", does not support the TestStream transform. Supported runners: ['DirectRunner', 'SwitchingDirectRunner']
Tests that the TestStream supports emitting to multiple PCollections. ... SKIP: The "TestDataflowRunner", does not support the TestStream transform. Supported runners: ['DirectRunner', 'SwitchingDirectRunner']
Tests that the TestStream can independently control output watermarks. ... SKIP: The "TestDataflowRunner", does not support the TestStream transform. Supported runners: ['DirectRunner', 'SwitchingDirectRunner']
test_text_detection_with_language_hint (apache_beam.ml.gcp.visionml_test_it.VisionMlTestIT) ... ok
test_deidentification (apache_beam.ml.gcp.cloud_dlp_it_test.CloudDLPIT) ... ok
test_inspection (apache_beam.ml.gcp.cloud_dlp_it_test.CloudDLPIT) ... ok
test_big_query_write (apache_beam.io.gcp.bigquery_write_it_test.BigQueryWriteIntegrationTests) ... ok
test_big_query_write_new_types (apache_beam.io.gcp.bigquery_write_it_test.BigQueryWriteIntegrationTests) ... ok
test_big_query_write_schema_autodetect (apache_beam.io.gcp.bigquery_write_it_test.BigQueryWriteIntegrationTests) ... SKIP: DataflowRunner does not support schema autodetection
test_big_query_write_without_schema (apache_beam.io.gcp.bigquery_write_it_test.BigQueryWriteIntegrationTests) ... ok
Runs streaming Dataflow job and verifies that user metrics are reported ... ok
test_big_query_legacy_sql (apache_beam.io.gcp.big_query_query_to_table_it_test.BigQueryQueryToTableIT) ... ok
test_big_query_new_types (apache_beam.io.gcp.big_query_query_to_table_it_test.BigQueryQueryToTableIT) ... ok
test_big_query_new_types_avro (apache_beam.io.gcp.big_query_query_to_table_it_test.BigQueryQueryToTableIT) ... ok
test_big_query_new_types_native (apache_beam.io.gcp.big_query_query_to_table_it_test.BigQueryQueryToTableIT) ... ok
test_big_query_standard_sql (apache_beam.io.gcp.big_query_query_to_table_it_test.BigQueryQueryToTableIT) ... ok
test_big_query_standard_sql_kms_key_native (apache_beam.io.gcp.big_query_query_to_table_it_test.BigQueryQueryToTableIT) ... ok
test_job_python_from_python_it (apache_beam.transforms.external_it_test.ExternalTransformIT) ... ok
test_metrics_fnapi_it (apache_beam.runners.dataflow.dataflow_exercise_metrics_pipeline_test.ExerciseMetricsPipelineTest) ... ok
test_metrics_it (apache_beam.runners.dataflow.dataflow_exercise_metrics_pipeline_test.ExerciseMetricsPipelineTest) ... ok
======================================================================
ERROR: test_dicom_store_instance_from_gcs (apache_beam.io.gcp.dicomio_integration_test.DICOMIoIntegrationTest)
----------------------------------------------------------------------
Traceback (most recent call last):
File "<https://ci-beam.apache.org/job/beam_PostCommit_Python37/ws/src/sdks/python/apache_beam/io/gcp/dicomio_integration_test.py",> line 210, in test_dicom_store_instance_from_gcs
results, equal_to(expected_output), label='store first assert')
File "<https://ci-beam.apache.org/job/beam_PostCommit_Python37/ws/src/sdks/python/apache_beam/pipeline.py",> line 555, in __exit__
self.result = self.run()
File "<https://ci-beam.apache.org/job/beam_PostCommit_Python37/ws/src/sdks/python/apache_beam/testing/test_pipeline.py",> line 112, in run
False if self.not_use_test_runner_api else test_runner_api))
File "<https://ci-beam.apache.org/job/beam_PostCommit_Python37/ws/src/sdks/python/apache_beam/pipeline.py",> line 521, in run
allow_proto_holders=True).run(False)
File "<https://ci-beam.apache.org/job/beam_PostCommit_Python37/ws/src/sdks/python/apache_beam/pipeline.py",> line 534, in run
return self.runner.run_pipeline(self, self._options)
File "<https://ci-beam.apache.org/job/beam_PostCommit_Python37/ws/src/sdks/python/apache_beam/runners/dataflow/test_dataflow_runner.py",> line 57, in run_pipeline
self).run_pipeline(pipeline, options)
File "<https://ci-beam.apache.org/job/beam_PostCommit_Python37/ws/src/sdks/python/apache_beam/runners/dataflow/dataflow_runner.py",> line 479, in run_pipeline
artifacts=environments.python_sdk_dependencies(options)))
File "<https://ci-beam.apache.org/job/beam_PostCommit_Python37/ws/src/sdks/python/apache_beam/transforms/environments.py",> line 613, in python_sdk_dependencies
staged_name in stager.Stager.create_job_resources(options, tmp_dir))
File "<https://ci-beam.apache.org/job/beam_PostCommit_Python37/ws/src/sdks/python/apache_beam/runners/portability/stager.py",> line 172, in create_job_resources
setup_options.requirements_file, requirements_cache_path)
File "<https://ci-beam.apache.org/job/beam_PostCommit_Python37/ws/src/sdks/python/apache_beam/utils/retry.py",> line 236, in wrapper
return fun(*args, **kwargs)
File "<https://ci-beam.apache.org/job/beam_PostCommit_Python37/ws/src/sdks/python/apache_beam/runners/portability/stager.py",> line 558, in _populate_requirements_cache
processes.check_output(cmd_args, stderr=processes.STDOUT)
File "<https://ci-beam.apache.org/job/beam_PostCommit_Python37/ws/src/sdks/python/apache_beam/utils/processes.py",> line 99, in check_output
.format(traceback.format_exc(), args[0][6], error.output))
RuntimeError: Full traceback: Traceback (most recent call last):
File "<https://ci-beam.apache.org/job/beam_PostCommit_Python37/ws/src/sdks/python/apache_beam/utils/processes.py",> line 91, in check_output
out = subprocess.check_output(*args, **kwargs)
File "/usr/lib/python3.7/subprocess.py", line 395, in check_output
**kwargs).stdout
File "/usr/lib/python3.7/subprocess.py", line 487, in run
output=stdout, stderr=stderr)
subprocess.CalledProcessError: Command '['<https://ci-beam.apache.org/job/beam_PostCommit_Python37/ws/src/build/gradleenv/-1734967052/bin/python',> '-m', 'pip', 'download', '--dest', '/tmp/dataflow-requirements-cache', '-r', 'postcommit_requirements.txt', '--exists-action', 'i', '--no-binary', ':all:']' returned non-zero exit status 1.
Pip install failed for package: -r
Output from execution of subprocess: b'Collecting pyhamcrest!=1.10.0,<2.0.0\n File was already downloaded /tmp/dataflow-requirements-cache/PyHamcrest-1.10.1.tar.gz\nCollecting mock<3.0.0\n File was already downloaded /tmp/dataflow-requirements-cache/mock-2.0.0.tar.gz\nCollecting parameterized<0.8.0,>=0.7.1\n File was already downloaded /tmp/dataflow-requirements-cache/parameterized-0.7.4.tar.gz\nCollecting six\n File was already downloaded /tmp/dataflow-requirements-cache/six-1.15.0.tar.gz\n ERROR: Command errored out with exit status 1:\n command: <https://ci-beam.apache.org/job/beam_PostCommit_Python37/ws/src/build/gradleenv/-1734967052/bin/python> -c \'import sys, setuptools, tokenize; sys.argv[0] = \'"\'"\'/tmp/pip-download-k9xsdryi/six/setup.py\'"\'"\'; __file__=\'"\'"\'/tmp/pip-download-k9xsdryi/six/setup.py\'"\'"\';f=getattr(tokenize, \'"\'"\'open\'"\'"\', open)(__file__);code=f.read().replace(\'"\'"\'\\r\\n\'"\'"\', \'"\'"\'\\n\'"\'"\');f.close();exec(compile(code, __file__, \'"\'"\'exec\'"\'"\'))\' egg_info --egg-base /tmp/pip-pip-egg-info-ad82q3or\n cwd: /tmp/pip-download-k9xsdryi/six/\n Complete output (5 lines):\n Traceback (most recent call last):\n File "<string>", line 1, in <module>\n File "<https://ci-beam.apache.org/job/beam_PostCommit_Python37/ws/src/build/gradleenv/-1734967052/lib/python3.7/tokenize.py",> line 447, in open\n buffer = _builtin_open(filename, \'rb\')\n FileNotFoundError: [Errno 2] No such file or directory: \'/tmp/pip-download-k9xsdryi/six/setup.py\'\n ----------------------------------------\nERROR: Command errored out with exit status 1: python setup.py egg_info Check the logs for full command output.\n'
-------------------- >> begin captured logging << --------------------
google.auth._default: DEBUG: Checking None for explicit credentials as part of auth process...
google.auth._default: DEBUG: Checking Cloud SDK credentials as part of auth process...
google.auth._default: DEBUG: Cloud SDK credentials not found on disk; not using them
google.auth._default: DEBUG: Checking for App Engine runtime as part of auth process...
google.auth._default: DEBUG: No App Engine library was found so cannot authentication via App Engine Identity Credentials.
google.auth.transport._http_client: DEBUG: Making request: GET http://169.254.169.254
google.auth.transport._http_client: DEBUG: Making request: GET http://metadata.google.internal/computeMetadata/v1/project/project-id
urllib3.util.retry: DEBUG: Converted retries value: 3 -> Retry(total=3, connect=None, read=None, redirect=None, status=None)
google.auth.transport.requests: DEBUG: Making request: GET http://metadata.google.internal/computeMetadata/v1/instance/service-accounts/default/?recursive=true
urllib3.connectionpool: DEBUG: Starting new HTTP connection (1): metadata.google.internal:80
urllib3.connectionpool: DEBUG: http://metadata.google.internal:80 "GET /computeMetadata/v1/instance/service-accounts/default/?recursive=true HTTP/1.1" 200 144
google.auth.transport.requests: DEBUG: Making request: GET http://metadata.google.internal/computeMetadata/v1/instance/service-accounts/844138762903-compute@developer.gserviceaccount.com/token
urllib3.connectionpool: DEBUG: http://metadata.google.internal:80 "GET /computeMetadata/v1/instance/service-accounts/844138762903-compute@developer.gserviceaccount.com/token HTTP/1.1" 200 221
urllib3.connectionpool: DEBUG: Starting new HTTPS connection (1): storage.googleapis.com:443
urllib3.connectionpool: DEBUG: https://storage.googleapis.com:443 "GET /storage/v1/b/apache-beam-samples/o/healthcare%2Fdicom%2Fio_test_metadata%2FDicom_io_it_test_data.json?alt=media HTTP/1.1" 200 17443
google.auth._default: DEBUG: Checking None for explicit credentials as part of auth process...
google.auth._default: DEBUG: Checking Cloud SDK credentials as part of auth process...
google.auth._default: DEBUG: Cloud SDK credentials not found on disk; not using them
google.auth._default: DEBUG: Checking for App Engine runtime as part of auth process...
google.auth._default: DEBUG: No App Engine library was found so cannot authentication via App Engine Identity Credentials.
google.auth.transport._http_client: DEBUG: Making request: GET http://169.254.169.254
google.auth.transport._http_client: DEBUG: Making request: GET http://metadata.google.internal/computeMetadata/v1/project/project-id
urllib3.util.retry: DEBUG: Converted retries value: 3 -> Retry(total=3, connect=None, read=None, redirect=None, status=None)
google.auth.transport.requests: DEBUG: Making request: GET http://metadata.google.internal/computeMetadata/v1/instance/service-accounts/default/?recursive=true
urllib3.connectionpool: DEBUG: Starting new HTTP connection (1): metadata.google.internal:80
urllib3.connectionpool: DEBUG: http://metadata.google.internal:80 "GET /computeMetadata/v1/instance/service-accounts/default/?recursive=true HTTP/1.1" 200 144
google.auth.transport.requests: DEBUG: Making request: GET http://metadata.google.internal/computeMetadata/v1/instance/service-accounts/844138762903-compute@developer.gserviceaccount.com/token
urllib3.connectionpool: DEBUG: http://metadata.google.internal:80 "GET /computeMetadata/v1/instance/service-accounts/844138762903-compute@developer.gserviceaccount.com/token HTTP/1.1" 200 221
urllib3.connectionpool: DEBUG: Starting new HTTPS connection (1): storage.googleapis.com:443
urllib3.connectionpool: DEBUG: https://storage.googleapis.com:443 "GET /storage/v1/b/apache-beam-samples/o/healthcare%2Fdicom%2Fio_test_metadata%2FDicom_io_it_test_refined_data.json?alt=media HTTP/1.1" 200 969
google.auth._default: DEBUG: Checking None for explicit credentials as part of auth process...
google.auth._default: DEBUG: Checking Cloud SDK credentials as part of auth process...
google.auth._default: DEBUG: Cloud SDK credentials not found on disk; not using them
google.auth._default: DEBUG: Checking for App Engine runtime as part of auth process...
google.auth._default: DEBUG: No App Engine library was found so cannot authentication via App Engine Identity Credentials.
google.auth.transport._http_client: DEBUG: Making request: GET http://169.254.169.254
google.auth.transport._http_client: DEBUG: Making request: GET http://metadata.google.internal/computeMetadata/v1/project/project-id
urllib3.util.retry: DEBUG: Converted retries value: 3 -> Retry(total=3, connect=None, read=None, redirect=None, status=None)
google.auth.transport.requests: DEBUG: Making request: GET http://metadata.google.internal/computeMetadata/v1/instance/service-accounts/default/?recursive=true
urllib3.connectionpool: DEBUG: Starting new HTTP connection (1): metadata.google.internal:80
urllib3.connectionpool: DEBUG: http://metadata.google.internal:80 "GET /computeMetadata/v1/instance/service-accounts/default/?recursive=true HTTP/1.1" 200 144
google.auth.transport.requests: DEBUG: Making request: GET http://metadata.google.internal/computeMetadata/v1/instance/service-accounts/844138762903-compute@developer.gserviceaccount.com/token
urllib3.connectionpool: DEBUG: http://metadata.google.internal:80 "GET /computeMetadata/v1/instance/service-accounts/844138762903-compute@developer.gserviceaccount.com/token HTTP/1.1" 200 221
urllib3.connectionpool: DEBUG: Starting new HTTPS connection (1): healthcare.googleapis.com:443
urllib3.connectionpool: DEBUG: https://healthcare.googleapis.com:443 "POST /v1/projects/apache-beam-testing/locations/us-central1/datasets/apache-beam-integration-testing/dicomStores?dicomStoreId=DICOM_store_iwc27crvwPByOHz HTTP/1.1" 200 148
root: DEBUG: Unhandled type_constraint: Union[]
root: DEBUG: Unhandled type_constraint: Union[]
root: DEBUG: Unhandled type_constraint: Union[]
root: DEBUG: Unhandled type_constraint: Union[]
apache_beam.runners.portability.stager: INFO: Executing command: ['<https://ci-beam.apache.org/job/beam_PostCommit_Python37/ws/src/build/gradleenv/-1734967052/bin/python',> '-m', 'pip', 'download', '--dest', '/tmp/dataflow-requirements-cache', '-r', 'postcommit_requirements.txt', '--exists-action', 'i', '--no-binary', ':all:']
google.auth._default: DEBUG: Checking None for explicit credentials as part of auth process...
google.auth._default: DEBUG: Checking Cloud SDK credentials as part of auth process...
google.auth._default: DEBUG: Cloud SDK credentials not found on disk; not using them
google.auth._default: DEBUG: Checking for App Engine runtime as part of auth process...
google.auth._default: DEBUG: No App Engine library was found so cannot authentication via App Engine Identity Credentials.
google.auth.transport._http_client: DEBUG: Making request: GET http://169.254.169.254
google.auth.transport._http_client: DEBUG: Making request: GET http://metadata.google.internal/computeMetadata/v1/project/project-id
urllib3.util.retry: DEBUG: Converted retries value: 3 -> Retry(total=3, connect=None, read=None, redirect=None, status=None)
google.auth.transport.requests: DEBUG: Making request: GET http://metadata.google.internal/computeMetadata/v1/instance/service-accounts/default/?recursive=true
urllib3.connectionpool: DEBUG: Starting new HTTP connection (1): metadata.google.internal:80
urllib3.connectionpool: DEBUG: http://metadata.google.internal:80 "GET /computeMetadata/v1/instance/service-accounts/default/?recursive=true HTTP/1.1" 200 144
google.auth.transport.requests: DEBUG: Making request: GET http://metadata.google.internal/computeMetadata/v1/instance/service-accounts/844138762903-compute@developer.gserviceaccount.com/token
urllib3.connectionpool: DEBUG: http://metadata.google.internal:80 "GET /computeMetadata/v1/instance/service-accounts/844138762903-compute@developer.gserviceaccount.com/token HTTP/1.1" 200 221
urllib3.connectionpool: DEBUG: Starting new HTTPS connection (1): healthcare.googleapis.com:443
urllib3.connectionpool: DEBUG: https://healthcare.googleapis.com:443 "DELETE /v1/projects/apache-beam-testing/locations/us-central1/datasets/apache-beam-integration-testing/dicomStores/DICOM_store_iwc27crvwPByOHz HTTP/1.1" 200 3
--------------------- >> end captured logging << ---------------------
----------------------------------------------------------------------
XML: nosetests-postCommitIT-df-py37.xml
----------------------------------------------------------------------
XML: <https://ci-beam.apache.org/job/beam_PostCommit_Python37/ws/src/sdks/python/nosetests.xml>
----------------------------------------------------------------------
Ran 66 tests in 3944.747s
FAILED (SKIP=7, errors=1)
> Task :sdks:python:test-suites:dataflow:py37:postCommitIT FAILED
FAILURE: Build completed with 2 failures.
1: Task failed with an exception.
-----------
* Where:
Script '<https://ci-beam.apache.org/job/beam_PostCommit_Python37/ws/src/sdks/python/test-suites/portable/common.gradle'> line: 210
* What went wrong:
Execution failed for task ':sdks:python:test-suites:portable:py37:postCommitPy37IT'.
> Process 'command 'sh'' finished with non-zero exit value 1
* Try:
Run with --stacktrace option to get the stack trace. Run with --info or --debug option to get more log output. Run with --scan to get full insights.
==============================================================================
2: Task failed with an exception.
-----------
* Where:
Script '<https://ci-beam.apache.org/job/beam_PostCommit_Python37/ws/src/sdks/python/test-suites/dataflow/common.gradle'> line: 116
* What went wrong:
Execution failed for task ':sdks:python:test-suites:dataflow:py37:postCommitIT'.
> Process 'command 'sh'' finished with non-zero exit value 1
* Try:
Run with --stacktrace option to get the stack trace. Run with --info or --debug option to get more log output. Run with --scan to get full insights.
==============================================================================
* Get more help at https://help.gradle.org
Deprecated Gradle features were used in this build, making it incompatible with Gradle 6.0.
Use '--warning-mode all' to show the individual deprecation warnings.
See https://docs.gradle.org/5.2.1/userguide/command_line_interface.html#sec:command_line_warnings
BUILD FAILED in 1h 8m 2s
139 actionable tasks: 107 executed, 31 from cache, 1 up-to-date
Publishing build scan...
https://gradle.com/s/pwir5ifugecrq
Build step 'Invoke Gradle script' changed build result to FAILURE
Build step 'Invoke Gradle script' marked build as failure
---------------------------------------------------------------------
To unsubscribe, e-mail: builds-unsubscribe@beam.apache.org
For additional commands, e-mail: builds-help@beam.apache.org
Build failed in Jenkins: beam_PostCommit_Python37 #2706
Posted by Apache Jenkins Server <je...@builds.apache.org>.
See <https://ci-beam.apache.org/job/beam_PostCommit_Python37/2706/display/redirect?page=changes>
Changes:
[Robin Qiu] Upgrade to ZetaSQL 2020.08.1
[Damian Gadomski] Moving /tmp directory cleanup of CI workers to Inventory Jenkins job
[Boyuan Zhang] Workaround of AutoValueSchema doesn't work with SchemaFieldName
[noreply] [BEAM-10572] Eliminate nullability errors from
[noreply] [BEAM-7996] Add Python SqlTransform test that includes a MAP input and
[noreply] [BEAM-10663] Disable python kafka integration tests (#12526)
[Robin Qiu] Change SqlAnalyzer code to use the updated ZetaSQL API
[noreply] Merge pull request #12485 from [BEAM-6064] Improvements to BQ streaming
[noreply] [BEAM-8125] Add verifyDeterministic test to SchemaCoderTest (#12521)
[noreply] [BEAM-10571] Use schemas in ExternalConfigurationPayload (#12481)
[noreply] [BEAM-10644] Mark Beam 2.24.0 as the last release with Py2 and Py35
------------------------------------------
[...truncated 18.69 MB...]
{
"@type": "kind:global_window"
}
],
"is_wrapper": true
},
"output_name": "None",
"user_name": "m_out.out"
}
],
"parallel_input": {
"@type": "OutputReference",
"output_name": "out",
"step_name": "s4"
},
"serialized_fn": "QlpoOTFBWSZTWWeYg/EAApJ/8H/////////////cwr///+ZjwCAAYEBAAvYZlAZGGqZKeap6nqaD1Bk2o9T9UeoGgAaAaDQaNPSeoaD1PUAGnqeoMj0gZNBKmiZNCYmI1J4mSbSYg0yZAAGgABoDQaABoNAyMgGmSIQ0pspptTYiDTTQNBgQyaAGIyAGg0Bp6BNqeoGgeoOAAAAAAAAAAaAAAAAAAAAADvptRksy3rYqqrRyJX2qH0NSOBctdVUdLQAm1Vh2UANxiG8xcsPs2/V+wqRYe1ULTTsFGP9a61H8xkkgE7und2KQKCYLXStXLn3eFthcDyETfV4UGFKZNeBBEHUSJLWyzBEAWMCthwxMLlv1cDyano9cgF8al+wdq5r/REAkG1Xg8aacyW/LCkBXoTuB4iGoncNkgf7kZTycpPhEogIUlcmUXbLXkkTvSvGWUVI8gorCTQi4qGCTsUwnjQkyt2ZyOO9OYuufzYucYr+tb6skz+fLbYmGltqvc0ZyO62U1BN/063ZqwM9sHukMYDtXzQzuCo6I8hcg9bN+uA5zVxEToRovLZIoOS0PpZ6DtewoIpXjNEHdMET2MhmBwtiJO/7kFGvRXCBJCR3E0VT+tlPoVcp7u8FEolFZEAQgtDOCFCYBounGasGioKCtPYuiTpMtBVhRemCeN1kw3xz7+O3HdpAYYCUXQKJCFvkypPA1qn+cbuIJzJofIN2BcCmDlvIBCstlwFz2aQYXYogZO/bA/V1tacCaIv1lmiMtOWCxQ22hA4/JeLrKatgfimoi1XTBYqKI1UlwpqoFFxMxI7eKk1vELwoiakO73oRuciOUowiTwDyilzBw1LIP03KHIxylREq0IIBlhEEIgRqAmRKSZspXcY8WJZc1S79gLtt2o65KoRUptqAP0C0mEjQrLUMMdcwvLxdDZ2YWF3a2YmEc6V3Flq/zGko0q1i7CE9F60VVmlLVbxGN1Kc8GIjGCmM2+eg7pKnM7xezfVKYmJBAxbGHNEIVArMrZhiGweBLCVomDBhtYxZft2DIMzallLUjBweKHOZYLJJaYlEbRaHX4A2iWd0kmIYgPGrVkkFdUkblNPWmlouz7UYWBJGThIYIMpTkP5/pJL782MpXbJs/HJr2mwipgUqF1LL6WhjchFIhEb70ijjxamTOr2EAb6pUqdP+qQ4F4FkIiHj/i7kinChIM8xB+I=",
"user_name": "m_out"
}
}
],
"type": "JOB_TYPE_BATCH"
}
INFO:apache_beam.runners.dataflow.internal.apiclient:Create job: <Job
createTime: '2020-08-12T01:15:14.972072Z'
currentStateTime: '1970-01-01T00:00:00Z'
id: '2020-08-11_18_15_13-12495080922612805175'
location: 'us-central1'
name: 'beamapp-jenkins-0812011503-693550'
projectId: 'apache-beam-testing'
stageStates: []
startTime: '2020-08-12T01:15:14.972072Z'
steps: []
tempFiles: []
type: TypeValueValuesEnum(JOB_TYPE_BATCH, 1)>
INFO:apache_beam.runners.dataflow.internal.apiclient:Created job with id: [2020-08-11_18_15_13-12495080922612805175]
INFO:apache_beam.runners.dataflow.internal.apiclient:Submitted job: 2020-08-11_18_15_13-12495080922612805175
INFO:apache_beam.runners.dataflow.internal.apiclient:To access the Dataflow monitoring console, please navigate to https://console.cloud.google.com/dataflow/jobs/us-central1/2020-08-11_18_15_13-12495080922612805175?project=apache-beam-testing
Worker logs: https://console.cloud.google.com/dataflow/jobs/us-central1/2020-08-11_18_15_13-12495080922612805175?project=apache-beam-testing
INFO:apache_beam.runners.dataflow.dataflow_runner:Job 2020-08-11_18_15_13-12495080922612805175 is in state JOB_STATE_RUNNING
INFO:apache_beam.runners.dataflow.dataflow_runner:2020-08-12T01:15:13.205Z: JOB_MESSAGE_DETAILED: Autoscaling is enabled for job 2020-08-11_18_15_13-12495080922612805175. The number of workers will be between 1 and 1000.
INFO:apache_beam.runners.dataflow.dataflow_runner:2020-08-12T01:15:13.206Z: JOB_MESSAGE_DETAILED: Autoscaling was automatically enabled for job 2020-08-11_18_15_13-12495080922612805175.
INFO:apache_beam.runners.dataflow.dataflow_runner:2020-08-12T01:15:17.752Z: JOB_MESSAGE_BASIC: Worker configuration: n1-standard-1 in us-central1-a.
INFO:apache_beam.runners.dataflow.dataflow_runner:2020-08-12T01:15:20.504Z: JOB_MESSAGE_DETAILED: Expanding CoGroupByKey operations into optimizable parts.
INFO:apache_beam.runners.dataflow.dataflow_runner:2020-08-12T01:15:20.542Z: JOB_MESSAGE_DEBUG: Combiner lifting skipped for step GroupByKey: GroupByKey not followed by a combiner.
INFO:apache_beam.runners.dataflow.dataflow_runner:2020-08-12T01:15:20.579Z: JOB_MESSAGE_DETAILED: Expanding GroupByKey operations into optimizable parts.
INFO:apache_beam.runners.dataflow.dataflow_runner:2020-08-12T01:15:20.600Z: JOB_MESSAGE_DETAILED: Lifting ValueCombiningMappingFns into MergeBucketsMappingFns
INFO:apache_beam.runners.dataflow.dataflow_runner:2020-08-12T01:15:20.674Z: JOB_MESSAGE_DEBUG: Annotating graph with Autotuner information.
INFO:apache_beam.runners.dataflow.dataflow_runner:2020-08-12T01:15:20.720Z: JOB_MESSAGE_DETAILED: Fusing adjacent ParDo, Read, Write, and Flatten operations
INFO:apache_beam.runners.dataflow.dataflow_runner:2020-08-12T01:15:20.752Z: JOB_MESSAGE_DETAILED: Fusing consumer metrics into Create/Read
INFO:apache_beam.runners.dataflow.dataflow_runner:2020-08-12T01:15:20.784Z: JOB_MESSAGE_DETAILED: Fusing consumer map_to_common_key into metrics
INFO:apache_beam.runners.dataflow.dataflow_runner:2020-08-12T01:15:20.815Z: JOB_MESSAGE_DETAILED: Fusing consumer GroupByKey/Reify into map_to_common_key
INFO:apache_beam.runners.dataflow.dataflow_runner:2020-08-12T01:15:20.850Z: JOB_MESSAGE_DETAILED: Fusing consumer GroupByKey/Write into GroupByKey/Reify
INFO:apache_beam.runners.dataflow.dataflow_runner:2020-08-12T01:15:20.874Z: JOB_MESSAGE_DETAILED: Fusing consumer GroupByKey/GroupByWindow into GroupByKey/Read
INFO:apache_beam.runners.dataflow.dataflow_runner:2020-08-12T01:15:20.907Z: JOB_MESSAGE_DETAILED: Fusing consumer m_out into GroupByKey/GroupByWindow
INFO:apache_beam.runners.dataflow.dataflow_runner:2020-08-12T01:15:20.936Z: JOB_MESSAGE_DEBUG: Workflow config is missing a default resource spec.
INFO:apache_beam.runners.dataflow.dataflow_runner:2020-08-12T01:15:20.969Z: JOB_MESSAGE_DEBUG: Adding StepResource setup and teardown to workflow graph.
INFO:apache_beam.runners.dataflow.dataflow_runner:2020-08-12T01:15:21.006Z: JOB_MESSAGE_DEBUG: Adding workflow start and stop steps.
INFO:apache_beam.runners.dataflow.dataflow_runner:2020-08-12T01:15:21.028Z: JOB_MESSAGE_DEBUG: Assigning stage ids.
INFO:apache_beam.runners.dataflow.dataflow_runner:2020-08-12T01:15:21.149Z: JOB_MESSAGE_DEBUG: Executing wait step start13
INFO:apache_beam.runners.dataflow.dataflow_runner:2020-08-12T01:15:21.216Z: JOB_MESSAGE_BASIC: Executing operation GroupByKey/Create
INFO:apache_beam.runners.dataflow.dataflow_runner:2020-08-12T01:15:21.260Z: JOB_MESSAGE_DEBUG: Starting worker pool setup.
INFO:apache_beam.runners.dataflow.dataflow_runner:2020-08-12T01:15:21.283Z: JOB_MESSAGE_BASIC: Starting 1 workers in us-central1-a...
INFO:apache_beam.runners.dataflow.dataflow_runner:2020-08-12T01:15:21.328Z: JOB_MESSAGE_BASIC: Finished operation GroupByKey/Create
INFO:apache_beam.runners.dataflow.dataflow_runner:2020-08-12T01:15:21.412Z: JOB_MESSAGE_DEBUG: Value "GroupByKey/Session" materialized.
INFO:apache_beam.runners.dataflow.dataflow_runner:2020-08-12T01:15:21.481Z: JOB_MESSAGE_BASIC: Executing operation Create/Read+metrics+map_to_common_key+GroupByKey/Reify+GroupByKey/Write
INFO:apache_beam.runners.dataflow.dataflow_runner:2020-08-12T01:15:46.975Z: JOB_MESSAGE_DETAILED: Autoscaling: Raised the number of workers to 1 based on the rate of progress in the currently running stage(s).
INFO:apache_beam.runners.dataflow.dataflow_runner:2020-08-12T01:15:50.535Z: JOB_MESSAGE_WARNING: Your project already contains 100 Dataflow-created metric descriptors and Stackdriver will not create new Dataflow custom metrics for this job. Each unique user-defined metric name (independent of the DoFn in which it is defined) produces a new metric descriptor. To delete old / unused metric descriptors see https://developers.google.com/apis-explorer/#p/monitoring/v3/monitoring.projects.metricDescriptors.list and https://developers.google.com/apis-explorer/#p/monitoring/v3/monitoring.projects.metricDescriptors.delete
INFO:apache_beam.runners.dataflow.dataflow_runner:2020-08-12T01:15:48.761Z: JOB_MESSAGE_BASIC: Executing BigQuery import job "dataflow_job_10536921158720118991". You can check its status with the bq tool: "bq show -j --project_id=apache-beam-testing dataflow_job_10536921158720118991".
INFO:apache_beam.runners.dataflow.dataflow_runner:2020-08-12T01:15:55.585Z: JOB_MESSAGE_DETAILED: Autoscaling: Resized worker pool from 1 to 0.
INFO:apache_beam.runners.dataflow.dataflow_runner:2020-08-12T01:15:55.635Z: JOB_MESSAGE_BASIC: Worker pool stopped.
INFO:apache_beam.runners.dataflow.dataflow_runner:2020-08-12T01:15:55.665Z: JOB_MESSAGE_DEBUG: Tearing down pending resources...
INFO:apache_beam.runners.dataflow.dataflow_runner:2020-08-12T01:16:00.201Z: JOB_MESSAGE_BASIC: BigQuery import job "dataflow_job_10536921158720118991" done.
INFO:apache_beam.runners.dataflow.dataflow_runner:2020-08-12T01:16:01.027Z: JOB_MESSAGE_BASIC: Finished operation read+write/NativeWrite
INFO:apache_beam.runners.dataflow.dataflow_runner:2020-08-12T01:16:01.097Z: JOB_MESSAGE_DEBUG: Executing success step success1
INFO:apache_beam.runners.dataflow.dataflow_runner:2020-08-12T01:16:01.232Z: JOB_MESSAGE_DETAILED: Cleaning up.
INFO:apache_beam.runners.dataflow.dataflow_runner:2020-08-12T01:16:01.377Z: JOB_MESSAGE_DEBUG: Starting worker pool teardown.
INFO:apache_beam.runners.dataflow.dataflow_runner:2020-08-12T01:16:01.407Z: JOB_MESSAGE_BASIC: Stopping worker pool...
INFO:apache_beam.runners.dataflow.dataflow_runner:Job 2020-08-11_18_08_59-11396879769908802750 is in state JOB_STATE_DONE
INFO:apache_beam.runners.dataflow.dataflow_runner:2020-08-12T01:16:16.634Z: JOB_MESSAGE_BASIC: Finished operation Create/Read+ExternalTransform(simple)/Map(<lambda at external_it_test.py:43>)+assert_that/WindowInto(WindowIntoFn)+assert_that/ToVoidKey+assert_that/Group/pair_with_1+assert_that/Group/GroupByKey/Reify+assert_that/Group/GroupByKey/Write
INFO:apache_beam.runners.dataflow.dataflow_runner:2020-08-12T01:16:19.795Z: JOB_MESSAGE_BASIC: Finished operation assert_that/Create/Read+assert_that/Group/pair_with_0+assert_that/Group/GroupByKey/Reify+assert_that/Group/GroupByKey/Write
INFO:apache_beam.runners.dataflow.dataflow_runner:2020-08-12T01:16:19.871Z: JOB_MESSAGE_BASIC: Executing operation assert_that/Group/GroupByKey/Close
INFO:apache_beam.runners.dataflow.dataflow_runner:2020-08-12T01:16:19.924Z: JOB_MESSAGE_BASIC: Finished operation assert_that/Group/GroupByKey/Close
INFO:apache_beam.runners.dataflow.dataflow_runner:2020-08-12T01:16:19.997Z: JOB_MESSAGE_BASIC: Executing operation assert_that/Group/GroupByKey/Read+assert_that/Group/GroupByKey/GroupByWindow+assert_that/Group/Map(_merge_tagged_vals_under_key)+assert_that/Unkey+assert_that/Match
INFO:apache_beam.runners.dataflow.dataflow_runner:2020-08-12T01:16:27.514Z: JOB_MESSAGE_BASIC: Finished operation assert_that/Group/GroupByKey/Read+assert_that/Group/GroupByKey/GroupByWindow+assert_that/Group/Map(_merge_tagged_vals_under_key)+assert_that/Unkey+assert_that/Match
INFO:apache_beam.runners.dataflow.dataflow_runner:2020-08-12T01:16:27.578Z: JOB_MESSAGE_DEBUG: Executing success step success19
INFO:apache_beam.runners.dataflow.dataflow_runner:2020-08-12T01:16:27.706Z: JOB_MESSAGE_DETAILED: Cleaning up.
INFO:apache_beam.runners.dataflow.dataflow_runner:2020-08-12T01:16:27.769Z: JOB_MESSAGE_DEBUG: Starting worker pool teardown.
INFO:apache_beam.runners.dataflow.dataflow_runner:2020-08-12T01:16:27.805Z: JOB_MESSAGE_BASIC: Stopping worker pool...
INFO:apache_beam.runners.dataflow.dataflow_runner:2020-08-12T01:17:00.735Z: JOB_MESSAGE_DETAILED: Autoscaling: Resized worker pool from 1 to 0.
INFO:apache_beam.runners.dataflow.dataflow_runner:2020-08-12T01:17:00.782Z: JOB_MESSAGE_BASIC: Worker pool stopped.
INFO:apache_beam.runners.dataflow.dataflow_runner:2020-08-12T01:17:00.823Z: JOB_MESSAGE_DEBUG: Tearing down pending resources...
INFO:apache_beam.runners.dataflow.dataflow_runner:Job 2020-08-11_18_09_55-16828710864383434554 is in state JOB_STATE_DONE
INFO:apache_beam.io.gcp.tests.bigquery_matcher:Attempting to perform query SELECT fruit from `python_query_to_table_15971945815732.output_table`; to BQ
DEBUG:google.auth._default:Checking None for explicit credentials as part of auth process...
DEBUG:google.auth._default:Checking Cloud SDK credentials as part of auth process...
DEBUG:google.auth._default:Cloud SDK credentials not found on disk; not using them
DEBUG:google.auth._default:Checking for App Engine runtime as part of auth process...
DEBUG:google.auth._default:No App Engine library was found so cannot authentication via App Engine Identity Credentials.
DEBUG:google.auth.transport._http_client:Making request: GET http://169.254.169.254
DEBUG:google.auth.transport._http_client:Making request: GET http://metadata.google.internal/computeMetadata/v1/project/project-id
DEBUG:urllib3.util.retry:Converted retries value: 3 -> Retry(total=3, connect=None, read=None, redirect=None, status=None)
DEBUG:google.auth.transport.requests:Making request: GET http://metadata.google.internal/computeMetadata/v1/instance/service-accounts/default/?recursive=true
DEBUG:urllib3.connectionpool:Starting new HTTP connection (1): metadata.google.internal:80
DEBUG:urllib3.connectionpool:http://metadata.google.internal:80 "GET /computeMetadata/v1/instance/service-accounts/default/?recursive=true HTTP/1.1" 200 144
DEBUG:google.auth.transport.requests:Making request: GET http://metadata.google.internal/computeMetadata/v1/instance/service-accounts/844138762903-compute@developer.gserviceaccount.com/token
DEBUG:urllib3.connectionpool:http://metadata.google.internal:80 "GET /computeMetadata/v1/instance/service-accounts/844138762903-compute@developer.gserviceaccount.com/token HTTP/1.1" 200 221
DEBUG:urllib3.connectionpool:Starting new HTTPS connection (1): bigquery.googleapis.com:443
DEBUG:urllib3.connectionpool:https://bigquery.googleapis.com:443 "POST /bigquery/v2/projects/apache-beam-testing/jobs HTTP/1.1" 200 None
DEBUG:urllib3.connectionpool:https://bigquery.googleapis.com:443 "GET /bigquery/v2/projects/apache-beam-testing/queries/3722df66-78b3-4ced-a38a-3684be3deb1f?maxResults=0&location=US HTTP/1.1" 200 None
DEBUG:urllib3.connectionpool:https://bigquery.googleapis.com:443 "GET /bigquery/v2/projects/apache-beam-testing/datasets/_7357fab0f784d2a7327ddbe81cdd1f4ca7e429cd/tables/anon591698d0fec1c598da6640cc0bff5883e7ac9851/data HTTP/1.1" 200 None
INFO:apache_beam.io.gcp.tests.bigquery_matcher:Read from given query (SELECT fruit from `python_query_to_table_15971945815732.output_table`;), total rows 2
INFO:apache_beam.io.gcp.tests.bigquery_matcher:Generate checksum: 158a8ea1c254fcf40d4ed3e7c0242c3ea0a29e72
INFO:apache_beam.runners.dataflow.dataflow_runner:2020-08-12T01:17:20.184Z: JOB_MESSAGE_DETAILED: Autoscaling: Resized worker pool from 1 to 0.
INFO:apache_beam.runners.dataflow.dataflow_runner:2020-08-12T01:17:20.239Z: JOB_MESSAGE_BASIC: Worker pool stopped.
INFO:apache_beam.runners.dataflow.dataflow_runner:2020-08-12T01:17:20.273Z: JOB_MESSAGE_DEBUG: Tearing down pending resources...
INFO:apache_beam.runners.dataflow.dataflow_runner:Job 2020-08-11_18_09_54-3798011248117832348 is in state JOB_STATE_DONE
INFO:apache_beam.runners.dataflow.dataflow_runner:2020-08-12T01:17:46.703Z: JOB_MESSAGE_DETAILED: Workers have started successfully.
INFO:apache_beam.runners.dataflow.dataflow_runner:2020-08-12T01:17:46.752Z: JOB_MESSAGE_DETAILED: Workers have started successfully.
INFO:apache_beam.runners.dataflow.dataflow_runner:2020-08-12T01:21:51.587Z: JOB_MESSAGE_BASIC: Finished operation Create/Read+metrics+map_to_common_key+GroupByKey/Reify+GroupByKey/Write
INFO:apache_beam.runners.dataflow.dataflow_runner:2020-08-12T01:21:51.661Z: JOB_MESSAGE_BASIC: Executing operation GroupByKey/Close
INFO:apache_beam.runners.dataflow.dataflow_runner:2020-08-12T01:21:51.717Z: JOB_MESSAGE_BASIC: Finished operation GroupByKey/Close
INFO:apache_beam.runners.dataflow.dataflow_runner:2020-08-12T01:21:51.783Z: JOB_MESSAGE_BASIC: Executing operation GroupByKey/Read+GroupByKey/GroupByWindow+m_out
INFO:apache_beam.runners.dataflow.dataflow_runner:2020-08-12T01:22:00.944Z: JOB_MESSAGE_BASIC: Finished operation GroupByKey/Read+GroupByKey/GroupByWindow+m_out
INFO:apache_beam.runners.dataflow.dataflow_runner:2020-08-12T01:22:01.020Z: JOB_MESSAGE_DEBUG: Executing success step success11
INFO:apache_beam.runners.dataflow.dataflow_runner:2020-08-12T01:22:01.185Z: JOB_MESSAGE_DETAILED: Cleaning up.
INFO:apache_beam.runners.dataflow.dataflow_runner:2020-08-12T01:22:01.243Z: JOB_MESSAGE_DEBUG: Starting worker pool teardown.
INFO:apache_beam.runners.dataflow.dataflow_runner:2020-08-12T01:22:01.275Z: JOB_MESSAGE_BASIC: Stopping worker pool...
INFO:apache_beam.runners.dataflow.dataflow_runner:2020-08-12T01:22:54.159Z: JOB_MESSAGE_DETAILED: Autoscaling: Resized worker pool from 1 to 0.
INFO:apache_beam.runners.dataflow.dataflow_runner:2020-08-12T01:22:54.194Z: JOB_MESSAGE_BASIC: Worker pool stopped.
INFO:apache_beam.runners.dataflow.dataflow_runner:2020-08-12T01:22:54.237Z: JOB_MESSAGE_DEBUG: Tearing down pending resources...
INFO:apache_beam.runners.dataflow.dataflow_runner:Job 2020-08-11_18_15_13-12495080922612805175 is in state JOB_STATE_DONE
test_datastore_wordcount_it (apache_beam.examples.cookbook.datastore_wordcount_it_test.DatastoreWordCountIT) ... ok
test_streaming_wordcount_debugging_it (apache_beam.examples.streaming_wordcount_debugging_it_test.StreamingWordcountDebuggingIT) ... SKIP: Skipped due to [BEAM-3377]: assert_that not working for streaming
test_autocomplete_it (apache_beam.examples.complete.autocomplete_test.AutocompleteTest) ... ok
test_bigquery_tornadoes_it (apache_beam.examples.cookbook.bigquery_tornadoes_it_test.BigqueryTornadoesIT) ... ok
test_leader_board_it (apache_beam.examples.complete.game.leader_board_it_test.LeaderBoardIT) ... ok
test_game_stats_it (apache_beam.examples.complete.game.game_stats_it_test.GameStatsIT) ... ok
test_streaming_wordcount_it (apache_beam.examples.streaming_wordcount_it_test.StreamingWordCountIT) ... ok
test_wordcount_it (apache_beam.examples.wordcount_it_test.WordCountIT) ... ok
test_wordcount_fnapi_it (apache_beam.examples.wordcount_it_test.WordCountIT) ... ok
test_user_score_it (apache_beam.examples.complete.game.user_score_it_test.UserScoreIT) ... ok
test_avro_it (apache_beam.examples.fastavro_it_test.FastavroIT) ... ok
test_hourly_team_score_it (apache_beam.examples.complete.game.hourly_team_score_it_test.HourlyTeamScoreIT) ... ok
test_read_via_sql (apache_beam.io.gcp.experimental.spannerio_read_it_test.SpannerReadIntegrationTest) ... ok
test_read_via_table (apache_beam.io.gcp.experimental.spannerio_read_it_test.SpannerReadIntegrationTest) ... ok
test_bigquery_read_1M_python (apache_beam.io.gcp.bigquery_io_read_it_test.BigqueryIOReadIT) ... ok
test_bigquery_read_custom_1M_python (apache_beam.io.gcp.bigquery_io_read_it_test.BigqueryIOReadIT) ... ok
test_avro_file_load (apache_beam.io.gcp.bigquery_test.BigQueryFileLoadsIntegrationTests) ... ok
test_bqfl_streaming (apache_beam.io.gcp.bigquery_file_loads_test.BigQueryFileLoadsIT) ... SKIP: TestStream is not supported on TestDataflowRunner
test_multiple_destinations_transform (apache_beam.io.gcp.bigquery_file_loads_test.BigQueryFileLoadsIT) ... ok
test_one_job_fails_all_jobs_fail (apache_beam.io.gcp.bigquery_file_loads_test.BigQueryFileLoadsIT) ... ok
test_spanner_error (apache_beam.io.gcp.experimental.spannerio_write_it_test.SpannerWriteIntegrationTest) ... ok
test_spanner_update (apache_beam.io.gcp.experimental.spannerio_write_it_test.SpannerWriteIntegrationTest) ... ok
test_write_batches (apache_beam.io.gcp.experimental.spannerio_write_it_test.SpannerWriteIntegrationTest) ... ok
test_iobase_source (apache_beam.io.gcp.bigquery_read_it_test.ReadNewTypesTests) ... ok
test_native_source (apache_beam.io.gcp.bigquery_read_it_test.ReadNewTypesTests) ... ok
test_iobase_source (apache_beam.io.gcp.bigquery_read_it_test.ReadTests) ... ok
test_native_source (apache_beam.io.gcp.bigquery_read_it_test.ReadTests) ... ok
test_copy (apache_beam.io.gcp.gcsio_integration_test.GcsIOIntegrationTest) ... ok
test_copy_batch (apache_beam.io.gcp.gcsio_integration_test.GcsIOIntegrationTest) ... ok
test_copy_batch_kms (apache_beam.io.gcp.gcsio_integration_test.GcsIOIntegrationTest) ... ok
test_copy_batch_rewrite_token (apache_beam.io.gcp.gcsio_integration_test.GcsIOIntegrationTest) ... ok
test_copy_kms (apache_beam.io.gcp.gcsio_integration_test.GcsIOIntegrationTest) ... ok
test_copy_rewrite_token (apache_beam.io.gcp.gcsio_integration_test.GcsIOIntegrationTest) ... ok
test_multiple_destinations_transform (apache_beam.io.gcp.bigquery_test.BigQueryStreamingInsertTransformIntegrationTests) ... ok
test_value_provider_transform (apache_beam.io.gcp.bigquery_test.BigQueryStreamingInsertTransformIntegrationTests) ... ok
test_transform_on_gcs (apache_beam.io.fileio_test.MatchIntegrationTest) ... ok
test_datastore_write_limit (apache_beam.io.gcp.datastore.v1new.datastore_write_it_test.DatastoreWriteIT) ... ok
test_parquetio_it (apache_beam.io.parquetio_it_test.TestParquetIT) ... ok
test_file_loads (apache_beam.io.gcp.bigquery_test.PubSubBigQueryIT) ... SKIP: https://issuetracker.google.com/issues/118375066
test_streaming_inserts (apache_beam.io.gcp.bigquery_test.PubSubBigQueryIT) ... ok
test_dicom_search_instances (apache_beam.io.gcp.dicomio_integration_test.DICOMIoIntegrationTest) ... ok
test_dicom_store_instance_from_gcs (apache_beam.io.gcp.dicomio_integration_test.DICOMIoIntegrationTest) ... ok
test_streaming_data_only (apache_beam.io.gcp.pubsub_integration_test.PubSubIntegrationTest) ... ok
test_streaming_with_attributes (apache_beam.io.gcp.pubsub_integration_test.PubSubIntegrationTest) ... ok
test_analyzing_syntax (apache_beam.ml.gcp.naturallanguageml_test_it.NaturalLanguageMlTestIT) ... ok
test_text_detection_with_language_hint (apache_beam.ml.gcp.visionml_test_it.VisionMlTestIT) ... ok
test_basic_execution (apache_beam.testing.test_stream_it_test.TestStreamIntegrationTests) ... SKIP: The "TestDataflowRunner", does not support the TestStream transform. Supported runners: ['DirectRunner', 'SwitchingDirectRunner']
Tests that the TestStream supports emitting to multiple PCollections. ... SKIP: The "TestDataflowRunner", does not support the TestStream transform. Supported runners: ['DirectRunner', 'SwitchingDirectRunner']
Tests that the TestStream can independently control output watermarks. ... SKIP: The "TestDataflowRunner", does not support the TestStream transform. Supported runners: ['DirectRunner', 'SwitchingDirectRunner']
test_big_query_write (apache_beam.io.gcp.bigquery_write_it_test.BigQueryWriteIntegrationTests) ... ok
test_big_query_write_new_types (apache_beam.io.gcp.bigquery_write_it_test.BigQueryWriteIntegrationTests) ... ok
test_big_query_write_schema_autodetect (apache_beam.io.gcp.bigquery_write_it_test.BigQueryWriteIntegrationTests) ... SKIP: DataflowRunner does not support schema autodetection
test_big_query_write_without_schema (apache_beam.io.gcp.bigquery_write_it_test.BigQueryWriteIntegrationTests) ... ok
test_label_detection_with_video_context (apache_beam.ml.gcp.videointelligenceml_test_it.VideoIntelligenceMlTestIT) ... ok
Runs streaming Dataflow job and verifies that user metrics are reported ... ok
test_deidentification (apache_beam.ml.gcp.cloud_dlp_it_test.CloudDLPIT) ... ok
test_inspection (apache_beam.ml.gcp.cloud_dlp_it_test.CloudDLPIT) ... ok
test_big_query_legacy_sql (apache_beam.io.gcp.big_query_query_to_table_it_test.BigQueryQueryToTableIT) ... ok
test_big_query_new_types (apache_beam.io.gcp.big_query_query_to_table_it_test.BigQueryQueryToTableIT) ... ok
test_big_query_new_types_avro (apache_beam.io.gcp.big_query_query_to_table_it_test.BigQueryQueryToTableIT) ... ok
test_big_query_new_types_native (apache_beam.io.gcp.big_query_query_to_table_it_test.BigQueryQueryToTableIT) ... ok
test_big_query_standard_sql (apache_beam.io.gcp.big_query_query_to_table_it_test.BigQueryQueryToTableIT) ... ok
test_big_query_standard_sql_kms_key_native (apache_beam.io.gcp.big_query_query_to_table_it_test.BigQueryQueryToTableIT) ... ok
test_job_python_from_python_it (apache_beam.transforms.external_it_test.ExternalTransformIT) ... ok
test_metrics_fnapi_it (apache_beam.runners.dataflow.dataflow_exercise_metrics_pipeline_test.ExerciseMetricsPipelineTest) ... ok
test_metrics_it (apache_beam.runners.dataflow.dataflow_exercise_metrics_pipeline_test.ExerciseMetricsPipelineTest) ... ok
----------------------------------------------------------------------
XML: nosetests-postCommitIT-df-py37.xml
----------------------------------------------------------------------
XML: <https://ci-beam.apache.org/job/beam_PostCommit_Python37/ws/src/sdks/python/nosetests.xml>
----------------------------------------------------------------------
Ran 66 tests in 4361.057s
OK (SKIP=7)
FAILURE: Build completed with 2 failures.
1: Task failed with an exception.
-----------
* Where:
Script '<https://ci-beam.apache.org/job/beam_PostCommit_Python37/ws/src/sdks/python/test-suites/direct/common.gradle'> line: 48
* What went wrong:
Execution failed for task ':sdks:python:test-suites:direct:py37:postCommitIT'.
> Process 'command 'sh'' finished with non-zero exit value 1
* Try:
Run with --stacktrace option to get the stack trace. Run with --info or --debug option to get more log output. Run with --scan to get full insights.
==============================================================================
2: Task failed with an exception.
-----------
* Where:
Script '<https://ci-beam.apache.org/job/beam_PostCommit_Python37/ws/src/sdks/python/test-suites/portable/common.gradle'> line: 210
* What went wrong:
Execution failed for task ':sdks:python:test-suites:portable:py37:postCommitPy37IT'.
> Process 'command 'sh'' finished with non-zero exit value 1
* Try:
Run with --stacktrace option to get the stack trace. Run with --info or --debug option to get more log output. Run with --scan to get full insights.
==============================================================================
* Get more help at https://help.gradle.org
Deprecated Gradle features were used in this build, making it incompatible with Gradle 6.0.
Use '--warning-mode all' to show the individual deprecation warnings.
See https://docs.gradle.org/5.2.1/userguide/command_line_interface.html#sec:command_line_warnings
BUILD FAILED in 1h 21m 20s
139 actionable tasks: 117 executed, 21 from cache, 1 up-to-date
Publishing build scan...
https://gradle.com/s/gtmanpke32xd2
Build step 'Invoke Gradle script' changed build result to FAILURE
Build step 'Invoke Gradle script' marked build as failure
---------------------------------------------------------------------
To unsubscribe, e-mail: builds-unsubscribe@beam.apache.org
For additional commands, e-mail: builds-help@beam.apache.org
Build failed in Jenkins: beam_PostCommit_Python37 #2705
Posted by Apache Jenkins Server <je...@builds.apache.org>.
See <https://ci-beam.apache.org/job/beam_PostCommit_Python37/2705/display/redirect?page=changes>
Changes:
[Damian Gadomski] Extending archiveJunit post-commit task with stability history
------------------------------------------
[...truncated 23.51 MB...]
"pipeline_proto_coder_id": "ref_Coder_FastPrimitivesCoder_6"
}
],
"is_pair_like": true,
"pipeline_proto_coder_id": "ref_Coder_FastPrimitivesCoder_6"
},
{
"@type": "kind:global_window"
}
],
"is_wrapper": true
},
"output_name": "None",
"user_name": "m_out.out"
}
],
"parallel_input": {
"@type": "OutputReference",
"output_name": "out",
"step_name": "s4"
},
"serialized_fn": "QlpoOTFBWSZTWWeYg/EAApJ/8H/////////////cwr///+ZjwCAAYEBAAvYZlAZGGqZKeap6nqaD1Bk2o9T9UeoGgAaAaDQaNPSeoaD1PUAGnqeoMj0gZNBKmiZNCYmI1J4mSbSYg0yZAAGgABoDQaABoNAyMgGmSIQ0pspptTYiDTTQNBgQyaAGIyAGg0Bp6BNqeoGgeoOAAAAAAAAAAaAAAAAAAAAADvptRksy3rYqqrRyJX2qH0NSOBctdVUdLQAm1Vh2UANxiG8xcsPs2/V+wqRYe1ULTTsFGP9a61H8xkkgE7und2KQKCYLXStXLn3eFthcDyETfV4UGFKZNeBBEHUSJLWyzBEAWMCthwxMLlv1cDyano9cgF8al+wdq5r/REAkG1Xg8aacyW/LCkBXoTuB4iGoncNkgf7kZTycpPhEogIUlcmUXbLXkkTvSvGWUVI8gorCTQi4qGCTsUwnjQkyt2ZyOO9OYuufzYucYr+tb6skz+fLbYmGltqvc0ZyO62U1BN/063ZqwM9sHukMYDtXzQzuCo6I8hcg9bN+uA5zVxEToRovLZIoOS0PpZ6DtewoIpXjNEHdMET2MhmBwtiJO/7kFGvRXCBJCR3E0VT+tlPoVcp7u8FEolFZEAQgtDOCFCYBounGasGioKCtPYuiTpMtBVhRemCeN1kw3xz7+O3HdpAYYCUXQKJCFvkypPA1qn+cbuIJzJofIN2BcCmDlvIBCstlwFz2aQYXYogZO/bA/V1tacCaIv1lmiMtOWCxQ22hA4/JeLrKatgfimoi1XTBYqKI1UlwpqoFFxMxI7eKk1vELwoiakO73oRuciOUowiTwDyilzBw1LIP03KHIxylREq0IIBlhEEIgRqAmRKSZspXcY8WJZc1S79gLtt2o65KoRUptqAP0C0mEjQrLUMMdcwvLxdDZ2YWF3a2YmEc6V3Flq/zGko0q1i7CE9F60VVmlLVbxGN1Kc8GIjGCmM2+eg7pKnM7xezfVKYmJBAxbGHNEIVArMrZhiGweBLCVomDBhtYxZft2DIMzallLUjBweKHOZYLJJaYlEbRaHX4A2iWd0kmIYgPGrVkkFdUkblNPWmlouz7UYWBJGThIYIMpTkP5/pJL782MpXbJs/HJr2mwipgUqF1LL6WhjchFIhEb70ijjxamTOr2EAb6pUqdP+qQ4F4FkIiHj/i7kinChIM8xB+I=",
"user_name": "m_out"
}
}
],
"type": "JOB_TYPE_BATCH"
}
INFO:apache_beam.runners.dataflow.internal.apiclient:Create job: <Job
createTime: '2020-08-11T19:06:51.965286Z'
currentStateTime: '1970-01-01T00:00:00Z'
id: '2020-08-11_12_06_49-5946104617904938573'
location: 'us-central1'
name: 'beamapp-jenkins-0811190640-714999'
projectId: 'apache-beam-testing'
stageStates: []
startTime: '2020-08-11T19:06:51.965286Z'
steps: []
tempFiles: []
type: TypeValueValuesEnum(JOB_TYPE_BATCH, 1)>
INFO:apache_beam.runners.dataflow.internal.apiclient:Created job with id: [2020-08-11_12_06_49-5946104617904938573]
INFO:apache_beam.runners.dataflow.internal.apiclient:Submitted job: 2020-08-11_12_06_49-5946104617904938573
INFO:apache_beam.runners.dataflow.internal.apiclient:To access the Dataflow monitoring console, please navigate to https://console.cloud.google.com/dataflow/jobs/us-central1/2020-08-11_12_06_49-5946104617904938573?project=apache-beam-testing
Worker logs: https://console.cloud.google.com/dataflow/jobs/us-central1/2020-08-11_12_06_49-5946104617904938573?project=apache-beam-testing
INFO:apache_beam.runners.dataflow.dataflow_runner:Job 2020-08-11_12_06_49-5946104617904938573 is in state JOB_STATE_RUNNING
INFO:apache_beam.runners.dataflow.dataflow_runner:2020-08-11T19:06:57.181Z: JOB_MESSAGE_BASIC: Executing BigQuery import job "dataflow_job_9389175675591366464". You can check its status with the bq tool: "bq show -j --project_id=apache-beam-testing dataflow_job_9389175675591366464".
INFO:apache_beam.runners.dataflow.dataflow_runner:2020-08-11T19:06:49.909Z: JOB_MESSAGE_DETAILED: Autoscaling was automatically enabled for job 2020-08-11_12_06_49-5946104617904938573.
INFO:apache_beam.runners.dataflow.dataflow_runner:2020-08-11T19:06:49.909Z: JOB_MESSAGE_DETAILED: Autoscaling is enabled for job 2020-08-11_12_06_49-5946104617904938573. The number of workers will be between 1 and 1000.
INFO:apache_beam.runners.dataflow.dataflow_runner:2020-08-11T19:06:55.083Z: JOB_MESSAGE_BASIC: Worker configuration: n1-standard-1 in us-central1-b.
INFO:apache_beam.runners.dataflow.dataflow_runner:2020-08-11T19:06:55.870Z: JOB_MESSAGE_DETAILED: Expanding CoGroupByKey operations into optimizable parts.
INFO:apache_beam.runners.dataflow.dataflow_runner:2020-08-11T19:06:55.903Z: JOB_MESSAGE_DEBUG: Combiner lifting skipped for step GroupByKey: GroupByKey not followed by a combiner.
INFO:apache_beam.runners.dataflow.dataflow_runner:2020-08-11T19:06:55.954Z: JOB_MESSAGE_DETAILED: Expanding GroupByKey operations into optimizable parts.
INFO:apache_beam.runners.dataflow.dataflow_runner:2020-08-11T19:06:55.985Z: JOB_MESSAGE_DETAILED: Lifting ValueCombiningMappingFns into MergeBucketsMappingFns
INFO:apache_beam.runners.dataflow.dataflow_runner:2020-08-11T19:06:56.057Z: JOB_MESSAGE_DEBUG: Annotating graph with Autotuner information.
INFO:apache_beam.runners.dataflow.dataflow_runner:2020-08-11T19:06:56.099Z: JOB_MESSAGE_DETAILED: Fusing adjacent ParDo, Read, Write, and Flatten operations
INFO:apache_beam.runners.dataflow.dataflow_runner:2020-08-11T19:06:56.142Z: JOB_MESSAGE_DETAILED: Fusing consumer metrics into Create/Read
INFO:apache_beam.runners.dataflow.dataflow_runner:2020-08-11T19:06:56.178Z: JOB_MESSAGE_DETAILED: Fusing consumer map_to_common_key into metrics
INFO:apache_beam.runners.dataflow.dataflow_runner:2020-08-11T19:06:56.216Z: JOB_MESSAGE_DETAILED: Fusing consumer GroupByKey/Reify into map_to_common_key
INFO:apache_beam.runners.dataflow.dataflow_runner:2020-08-11T19:06:56.248Z: JOB_MESSAGE_DETAILED: Fusing consumer GroupByKey/Write into GroupByKey/Reify
INFO:apache_beam.runners.dataflow.dataflow_runner:2020-08-11T19:06:56.289Z: JOB_MESSAGE_DETAILED: Fusing consumer GroupByKey/GroupByWindow into GroupByKey/Read
INFO:apache_beam.runners.dataflow.dataflow_runner:2020-08-11T19:06:56.323Z: JOB_MESSAGE_DETAILED: Fusing consumer m_out into GroupByKey/GroupByWindow
INFO:apache_beam.runners.dataflow.dataflow_runner:2020-08-11T19:06:56.363Z: JOB_MESSAGE_DEBUG: Workflow config is missing a default resource spec.
INFO:apache_beam.runners.dataflow.dataflow_runner:2020-08-11T19:06:56.400Z: JOB_MESSAGE_DEBUG: Adding StepResource setup and teardown to workflow graph.
INFO:apache_beam.runners.dataflow.dataflow_runner:2020-08-11T19:06:56.437Z: JOB_MESSAGE_DEBUG: Adding workflow start and stop steps.
INFO:apache_beam.runners.dataflow.dataflow_runner:2020-08-11T19:06:56.478Z: JOB_MESSAGE_DEBUG: Assigning stage ids.
INFO:apache_beam.runners.dataflow.dataflow_runner:2020-08-11T19:06:56.626Z: JOB_MESSAGE_DEBUG: Executing wait step start13
INFO:apache_beam.runners.dataflow.dataflow_runner:2020-08-11T19:06:56.701Z: JOB_MESSAGE_BASIC: Executing operation GroupByKey/Create
INFO:apache_beam.runners.dataflow.dataflow_runner:2020-08-11T19:06:56.747Z: JOB_MESSAGE_DEBUG: Starting worker pool setup.
INFO:apache_beam.runners.dataflow.dataflow_runner:2020-08-11T19:06:56.784Z: JOB_MESSAGE_BASIC: Starting 1 workers in us-central1-b...
INFO:apache_beam.runners.dataflow.dataflow_runner:2020-08-11T19:06:56.831Z: JOB_MESSAGE_BASIC: Finished operation GroupByKey/Create
INFO:apache_beam.runners.dataflow.dataflow_runner:2020-08-11T19:06:56.896Z: JOB_MESSAGE_DEBUG: Value "GroupByKey/Session" materialized.
INFO:apache_beam.runners.dataflow.dataflow_runner:2020-08-11T19:06:57.035Z: JOB_MESSAGE_BASIC: Executing operation Create/Read+metrics+map_to_common_key+GroupByKey/Reify+GroupByKey/Write
INFO:apache_beam.runners.dataflow.dataflow_runner:2020-08-11T19:07:10.366Z: JOB_MESSAGE_WARNING: Your project already contains 100 Dataflow-created metric descriptors and Stackdriver will not create new Dataflow custom metrics for this job. Each unique user-defined metric name (independent of the DoFn in which it is defined) produces a new metric descriptor. To delete old / unused metric descriptors see https://developers.google.com/apis-explorer/#p/monitoring/v3/monitoring.projects.metricDescriptors.list and https://developers.google.com/apis-explorer/#p/monitoring/v3/monitoring.projects.metricDescriptors.delete
INFO:apache_beam.runners.dataflow.dataflow_runner:2020-08-11T19:07:08.676Z: JOB_MESSAGE_BASIC: BigQuery import job "dataflow_job_9389175675591366464" done.
INFO:apache_beam.runners.dataflow.dataflow_runner:2020-08-11T19:07:09.534Z: JOB_MESSAGE_BASIC: Finished operation read+write/NativeWrite
INFO:apache_beam.runners.dataflow.dataflow_runner:2020-08-11T19:07:09.601Z: JOB_MESSAGE_DEBUG: Executing success step success1
INFO:apache_beam.runners.dataflow.dataflow_runner:2020-08-11T19:07:09.723Z: JOB_MESSAGE_DETAILED: Cleaning up.
INFO:apache_beam.runners.dataflow.dataflow_runner:2020-08-11T19:07:09.866Z: JOB_MESSAGE_DEBUG: Starting worker pool teardown.
INFO:apache_beam.runners.dataflow.dataflow_runner:2020-08-11T19:07:09.898Z: JOB_MESSAGE_BASIC: Stopping worker pool...
INFO:apache_beam.runners.dataflow.dataflow_runner:2020-08-11T19:07:25.691Z: JOB_MESSAGE_DETAILED: Autoscaling: Raised the number of workers to 1 based on the rate of progress in the currently running stage(s).
INFO:apache_beam.runners.dataflow.dataflow_runner:2020-08-11T19:07:53.167Z: JOB_MESSAGE_DETAILED: Autoscaling: Resized worker pool from 1 to 0.
INFO:apache_beam.runners.dataflow.dataflow_runner:2020-08-11T19:07:53.216Z: JOB_MESSAGE_BASIC: Worker pool stopped.
INFO:apache_beam.runners.dataflow.dataflow_runner:2020-08-11T19:07:53.252Z: JOB_MESSAGE_DEBUG: Tearing down pending resources...
INFO:apache_beam.runners.dataflow.dataflow_runner:2020-08-11T19:07:55.456Z: JOB_MESSAGE_BASIC: Finished operation Create/Read+InspectForDetails/ParDo(_InspectFn)+ParDo(CallableWrapperDoFn)/ParDo(CallableWrapperDoFn)+Type matches/WindowInto(WindowIntoFn)+Type matches/ToVoidKey+Type matches/Group/pair_with_1+Type matches/Group/GroupByKey/Reify+Type matches/Group/GroupByKey/Write
INFO:apache_beam.runners.dataflow.dataflow_runner:2020-08-11T19:07:58.600Z: JOB_MESSAGE_BASIC: Finished operation Type matches/Create/Read+Type matches/Group/pair_with_0+Type matches/Group/GroupByKey/Reify+Type matches/Group/GroupByKey/Write
INFO:apache_beam.runners.dataflow.dataflow_runner:2020-08-11T19:07:58.673Z: JOB_MESSAGE_BASIC: Executing operation Type matches/Group/GroupByKey/Close
INFO:apache_beam.runners.dataflow.dataflow_runner:2020-08-11T19:07:58.724Z: JOB_MESSAGE_BASIC: Finished operation Type matches/Group/GroupByKey/Close
INFO:apache_beam.runners.dataflow.dataflow_runner:2020-08-11T19:07:58.796Z: JOB_MESSAGE_BASIC: Executing operation Type matches/Group/GroupByKey/Read+Type matches/Group/GroupByKey/GroupByWindow+Type matches/Group/Map(_merge_tagged_vals_under_key)+Type matches/Unkey+Type matches/Match
INFO:apache_beam.runners.dataflow.dataflow_runner:Job 2020-08-11_12_01_20-12849135720742242949 is in state JOB_STATE_DONE
INFO:apache_beam.io.gcp.tests.bigquery_matcher:Attempting to perform query SELECT fruit from `python_query_to_table_15971724663345.output_table`; to BQ
DEBUG:google.auth._default:Checking None for explicit credentials as part of auth process...
DEBUG:google.auth._default:Checking Cloud SDK credentials as part of auth process...
DEBUG:google.auth._default:Cloud SDK credentials not found on disk; not using them
DEBUG:google.auth._default:Checking for App Engine runtime as part of auth process...
DEBUG:google.auth._default:No App Engine library was found so cannot authentication via App Engine Identity Credentials.
DEBUG:google.auth.transport._http_client:Making request: GET http://169.254.169.254
DEBUG:google.auth.transport._http_client:Making request: GET http://metadata.google.internal/computeMetadata/v1/project/project-id
DEBUG:urllib3.util.retry:Converted retries value: 3 -> Retry(total=3, connect=None, read=None, redirect=None, status=None)
DEBUG:google.auth.transport.requests:Making request: GET http://metadata.google.internal/computeMetadata/v1/instance/service-accounts/default/?recursive=true
DEBUG:urllib3.connectionpool:Starting new HTTP connection (1): metadata.google.internal:80
DEBUG:urllib3.connectionpool:http://metadata.google.internal:80 "GET /computeMetadata/v1/instance/service-accounts/default/?recursive=true HTTP/1.1" 200 144
DEBUG:google.auth.transport.requests:Making request: GET http://metadata.google.internal/computeMetadata/v1/instance/service-accounts/844138762903-compute@developer.gserviceaccount.com/token
DEBUG:urllib3.connectionpool:http://metadata.google.internal:80 "GET /computeMetadata/v1/instance/service-accounts/844138762903-compute@developer.gserviceaccount.com/token HTTP/1.1" 200 221
DEBUG:urllib3.connectionpool:Starting new HTTPS connection (1): bigquery.googleapis.com:443
DEBUG:urllib3.connectionpool:https://bigquery.googleapis.com:443 "POST /bigquery/v2/projects/apache-beam-testing/jobs HTTP/1.1" 200 None
DEBUG:urllib3.connectionpool:https://bigquery.googleapis.com:443 "GET /bigquery/v2/projects/apache-beam-testing/queries/61620628-77e6-4ecb-8e3d-06c92c6783f0?maxResults=0&location=US HTTP/1.1" 200 None
DEBUG:urllib3.connectionpool:https://bigquery.googleapis.com:443 "GET /bigquery/v2/projects/apache-beam-testing/datasets/_7357fab0f784d2a7327ddbe81cdd1f4ca7e429cd/tables/anon172c23c2ed0d1ac14ccc5cecb06ddf4d0f8502e7/data HTTP/1.1" 200 None
INFO:apache_beam.io.gcp.tests.bigquery_matcher:Read from given query (SELECT fruit from `python_query_to_table_15971724663345.output_table`;), total rows 2
INFO:apache_beam.io.gcp.tests.bigquery_matcher:Generate checksum: 158a8ea1c254fcf40d4ed3e7c0242c3ea0a29e72
INFO:apache_beam.runners.dataflow.dataflow_runner:2020-08-11T19:08:08.010Z: JOB_MESSAGE_BASIC: Finished operation Type matches/Group/GroupByKey/Read+Type matches/Group/GroupByKey/GroupByWindow+Type matches/Group/Map(_merge_tagged_vals_under_key)+Type matches/Unkey+Type matches/Match
INFO:apache_beam.runners.dataflow.dataflow_runner:2020-08-11T19:08:08.080Z: JOB_MESSAGE_DEBUG: Executing success step success19
INFO:apache_beam.runners.dataflow.dataflow_runner:2020-08-11T19:08:08.203Z: JOB_MESSAGE_DETAILED: Cleaning up.
INFO:apache_beam.runners.dataflow.dataflow_runner:2020-08-11T19:08:08.266Z: JOB_MESSAGE_DEBUG: Starting worker pool teardown.
INFO:apache_beam.runners.dataflow.dataflow_runner:2020-08-11T19:08:08.301Z: JOB_MESSAGE_BASIC: Stopping worker pool...
INFO:apache_beam.runners.dataflow.dataflow_runner:2020-08-11T19:08:57.785Z: JOB_MESSAGE_BASIC: Finished operation assert_that/Create/Read+assert_that/Group/pair_with_0+assert_that/Group/GroupByKey/Reify+assert_that/Group/GroupByKey/Write
INFO:apache_beam.runners.dataflow.dataflow_runner:2020-08-11T19:09:04.275Z: JOB_MESSAGE_BASIC: Finished operation Create/Read+ExternalTransform(simple)/Map(<lambda at external_it_test.py:43>)+assert_that/WindowInto(WindowIntoFn)+assert_that/ToVoidKey+assert_that/Group/pair_with_1+assert_that/Group/GroupByKey/Reify+assert_that/Group/GroupByKey/Write
INFO:apache_beam.runners.dataflow.dataflow_runner:2020-08-11T19:09:04.344Z: JOB_MESSAGE_BASIC: Executing operation assert_that/Group/GroupByKey/Close
INFO:apache_beam.runners.dataflow.dataflow_runner:2020-08-11T19:09:04.414Z: JOB_MESSAGE_BASIC: Finished operation assert_that/Group/GroupByKey/Close
INFO:apache_beam.runners.dataflow.dataflow_runner:2020-08-11T19:09:01.962Z: JOB_MESSAGE_DETAILED: Autoscaling: Resized worker pool from 1 to 0.
INFO:apache_beam.runners.dataflow.dataflow_runner:2020-08-11T19:09:02.018Z: JOB_MESSAGE_BASIC: Worker pool stopped.
INFO:apache_beam.runners.dataflow.dataflow_runner:2020-08-11T19:09:02.055Z: JOB_MESSAGE_DEBUG: Tearing down pending resources...
INFO:apache_beam.runners.dataflow.dataflow_runner:2020-08-11T19:09:04.602Z: JOB_MESSAGE_BASIC: Executing operation assert_that/Group/GroupByKey/Read+assert_that/Group/GroupByKey/GroupByWindow+assert_that/Group/Map(_merge_tagged_vals_under_key)+assert_that/Unkey+assert_that/Match
INFO:apache_beam.runners.dataflow.dataflow_runner:Job 2020-08-11_12_02_23-13248430480689201834 is in state JOB_STATE_DONE
INFO:apache_beam.runners.dataflow.dataflow_runner:2020-08-11T19:09:13.640Z: JOB_MESSAGE_BASIC: Finished operation assert_that/Group/GroupByKey/Read+assert_that/Group/GroupByKey/GroupByWindow+assert_that/Group/Map(_merge_tagged_vals_under_key)+assert_that/Unkey+assert_that/Match
INFO:apache_beam.runners.dataflow.dataflow_runner:2020-08-11T19:09:13.708Z: JOB_MESSAGE_DEBUG: Executing success step success19
INFO:apache_beam.runners.dataflow.dataflow_runner:2020-08-11T19:09:13.838Z: JOB_MESSAGE_DETAILED: Cleaning up.
INFO:apache_beam.runners.dataflow.dataflow_runner:2020-08-11T19:09:13.896Z: JOB_MESSAGE_DEBUG: Starting worker pool teardown.
INFO:apache_beam.runners.dataflow.dataflow_runner:2020-08-11T19:09:13.925Z: JOB_MESSAGE_BASIC: Stopping worker pool...
INFO:apache_beam.runners.dataflow.dataflow_runner:2020-08-11T19:09:35.805Z: JOB_MESSAGE_DETAILED: Workers have started successfully.
INFO:apache_beam.runners.dataflow.dataflow_runner:2020-08-11T19:09:35.845Z: JOB_MESSAGE_DETAILED: Workers have started successfully.
INFO:apache_beam.runners.dataflow.dataflow_runner:2020-08-11T19:10:05.209Z: JOB_MESSAGE_DETAILED: Autoscaling: Resized worker pool from 1 to 0.
INFO:apache_beam.runners.dataflow.dataflow_runner:2020-08-11T19:10:05.259Z: JOB_MESSAGE_BASIC: Worker pool stopped.
INFO:apache_beam.runners.dataflow.dataflow_runner:2020-08-11T19:10:05.297Z: JOB_MESSAGE_DEBUG: Tearing down pending resources...
INFO:apache_beam.runners.dataflow.dataflow_runner:Job 2020-08-11_12_03_17-10855894712590698911 is in state JOB_STATE_DONE
INFO:apache_beam.runners.dataflow.dataflow_runner:2020-08-11T19:13:25.781Z: JOB_MESSAGE_BASIC: Finished operation Create/Read+metrics+map_to_common_key+GroupByKey/Reify+GroupByKey/Write
INFO:apache_beam.runners.dataflow.dataflow_runner:2020-08-11T19:13:25.896Z: JOB_MESSAGE_BASIC: Executing operation GroupByKey/Close
INFO:apache_beam.runners.dataflow.dataflow_runner:2020-08-11T19:13:25.955Z: JOB_MESSAGE_BASIC: Finished operation GroupByKey/Close
INFO:apache_beam.runners.dataflow.dataflow_runner:2020-08-11T19:13:26.033Z: JOB_MESSAGE_BASIC: Executing operation GroupByKey/Read+GroupByKey/GroupByWindow+m_out
INFO:apache_beam.runners.dataflow.dataflow_runner:2020-08-11T19:13:34.106Z: JOB_MESSAGE_BASIC: Finished operation GroupByKey/Read+GroupByKey/GroupByWindow+m_out
INFO:apache_beam.runners.dataflow.dataflow_runner:2020-08-11T19:13:34.172Z: JOB_MESSAGE_DEBUG: Executing success step success11
INFO:apache_beam.runners.dataflow.dataflow_runner:2020-08-11T19:13:34.299Z: JOB_MESSAGE_DETAILED: Cleaning up.
INFO:apache_beam.runners.dataflow.dataflow_runner:2020-08-11T19:13:34.355Z: JOB_MESSAGE_DEBUG: Starting worker pool teardown.
INFO:apache_beam.runners.dataflow.dataflow_runner:2020-08-11T19:13:34.387Z: JOB_MESSAGE_BASIC: Stopping worker pool...
INFO:apache_beam.runners.dataflow.dataflow_runner:2020-08-11T19:14:23.264Z: JOB_MESSAGE_DETAILED: Autoscaling: Resized worker pool from 1 to 0.
INFO:apache_beam.runners.dataflow.dataflow_runner:2020-08-11T19:14:23.314Z: JOB_MESSAGE_BASIC: Worker pool stopped.
INFO:apache_beam.runners.dataflow.dataflow_runner:2020-08-11T19:14:23.342Z: JOB_MESSAGE_DEBUG: Tearing down pending resources...
INFO:apache_beam.runners.dataflow.dataflow_runner:Job 2020-08-11_12_06_49-5946104617904938573 is in state JOB_STATE_DONE
test_bigquery_tornadoes_it (apache_beam.examples.cookbook.bigquery_tornadoes_it_test.BigqueryTornadoesIT) ... ok
test_streaming_wordcount_debugging_it (apache_beam.examples.streaming_wordcount_debugging_it_test.StreamingWordcountDebuggingIT) ... SKIP: Skipped due to [BEAM-3377]: assert_that not working for streaming
test_datastore_wordcount_it (apache_beam.examples.cookbook.datastore_wordcount_it_test.DatastoreWordCountIT) ... ok
test_autocomplete_it (apache_beam.examples.complete.autocomplete_test.AutocompleteTest) ... ok
test_leader_board_it (apache_beam.examples.complete.game.leader_board_it_test.LeaderBoardIT) ... ok
test_game_stats_it (apache_beam.examples.complete.game.game_stats_it_test.GameStatsIT) ... ok
test_streaming_wordcount_it (apache_beam.examples.streaming_wordcount_it_test.StreamingWordCountIT) ... ok
test_wordcount_it (apache_beam.examples.wordcount_it_test.WordCountIT) ... ok
test_wordcount_fnapi_it (apache_beam.examples.wordcount_it_test.WordCountIT) ... ok
test_avro_it (apache_beam.examples.fastavro_it_test.FastavroIT) ... ok
test_user_score_it (apache_beam.examples.complete.game.user_score_it_test.UserScoreIT) ... ok
test_hourly_team_score_it (apache_beam.examples.complete.game.hourly_team_score_it_test.HourlyTeamScoreIT) ... ok
test_read_via_sql (apache_beam.io.gcp.experimental.spannerio_read_it_test.SpannerReadIntegrationTest) ... ok
test_read_via_table (apache_beam.io.gcp.experimental.spannerio_read_it_test.SpannerReadIntegrationTest) ... ok
test_bqfl_streaming (apache_beam.io.gcp.bigquery_file_loads_test.BigQueryFileLoadsIT) ... SKIP: TestStream is not supported on TestDataflowRunner
test_multiple_destinations_transform (apache_beam.io.gcp.bigquery_file_loads_test.BigQueryFileLoadsIT) ... ok
test_one_job_fails_all_jobs_fail (apache_beam.io.gcp.bigquery_file_loads_test.BigQueryFileLoadsIT) ... ok
test_iobase_source (apache_beam.io.gcp.bigquery_read_it_test.ReadNewTypesTests) ... ok
test_native_source (apache_beam.io.gcp.bigquery_read_it_test.ReadNewTypesTests) ... ok
test_avro_file_load (apache_beam.io.gcp.bigquery_test.BigQueryFileLoadsIntegrationTests) ... ok
test_bigquery_read_1M_python (apache_beam.io.gcp.bigquery_io_read_it_test.BigqueryIOReadIT) ... ok
test_bigquery_read_custom_1M_python (apache_beam.io.gcp.bigquery_io_read_it_test.BigqueryIOReadIT) ... ok
test_iobase_source (apache_beam.io.gcp.bigquery_read_it_test.ReadTests) ... ok
test_native_source (apache_beam.io.gcp.bigquery_read_it_test.ReadTests) ... ok
test_spanner_error (apache_beam.io.gcp.experimental.spannerio_write_it_test.SpannerWriteIntegrationTest) ... ok
test_spanner_update (apache_beam.io.gcp.experimental.spannerio_write_it_test.SpannerWriteIntegrationTest) ... ok
test_write_batches (apache_beam.io.gcp.experimental.spannerio_write_it_test.SpannerWriteIntegrationTest) ... ok
test_copy (apache_beam.io.gcp.gcsio_integration_test.GcsIOIntegrationTest) ... ok
test_copy_batch (apache_beam.io.gcp.gcsio_integration_test.GcsIOIntegrationTest) ... ok
test_copy_batch_kms (apache_beam.io.gcp.gcsio_integration_test.GcsIOIntegrationTest) ... ok
test_copy_batch_rewrite_token (apache_beam.io.gcp.gcsio_integration_test.GcsIOIntegrationTest) ... ok
test_copy_kms (apache_beam.io.gcp.gcsio_integration_test.GcsIOIntegrationTest) ... ok
test_copy_rewrite_token (apache_beam.io.gcp.gcsio_integration_test.GcsIOIntegrationTest) ... ok
test_multiple_destinations_transform (apache_beam.io.gcp.bigquery_test.BigQueryStreamingInsertTransformIntegrationTests) ... ok
test_value_provider_transform (apache_beam.io.gcp.bigquery_test.BigQueryStreamingInsertTransformIntegrationTests) ... ok
test_datastore_write_limit (apache_beam.io.gcp.datastore.v1new.datastore_write_it_test.DatastoreWriteIT) ... ok
test_transform_on_gcs (apache_beam.io.fileio_test.MatchIntegrationTest) ... ok
test_parquetio_it (apache_beam.io.parquetio_it_test.TestParquetIT) ... ok
test_file_loads (apache_beam.io.gcp.bigquery_test.PubSubBigQueryIT) ... SKIP: https://issuetracker.google.com/issues/118375066
test_streaming_inserts (apache_beam.io.gcp.bigquery_test.PubSubBigQueryIT) ... ok
test_dicom_search_instances (apache_beam.io.gcp.dicomio_integration_test.DICOMIoIntegrationTest) ... ok
test_dicom_store_instance_from_gcs (apache_beam.io.gcp.dicomio_integration_test.DICOMIoIntegrationTest) ... ok
test_streaming_data_only (apache_beam.io.gcp.pubsub_integration_test.PubSubIntegrationTest) ... ok
test_streaming_with_attributes (apache_beam.io.gcp.pubsub_integration_test.PubSubIntegrationTest) ... ok
test_analyzing_syntax (apache_beam.ml.gcp.naturallanguageml_test_it.NaturalLanguageMlTestIT) ... ok
test_big_query_write (apache_beam.io.gcp.bigquery_write_it_test.BigQueryWriteIntegrationTests) ... ok
test_big_query_write_new_types (apache_beam.io.gcp.bigquery_write_it_test.BigQueryWriteIntegrationTests) ... ok
test_big_query_write_schema_autodetect (apache_beam.io.gcp.bigquery_write_it_test.BigQueryWriteIntegrationTests) ... SKIP: DataflowRunner does not support schema autodetection
test_big_query_write_without_schema (apache_beam.io.gcp.bigquery_write_it_test.BigQueryWriteIntegrationTests) ... ok
test_basic_execution (apache_beam.testing.test_stream_it_test.TestStreamIntegrationTests) ... SKIP: The "TestDataflowRunner", does not support the TestStream transform. Supported runners: ['DirectRunner', 'SwitchingDirectRunner']
Tests that the TestStream supports emitting to multiple PCollections. ... SKIP: The "TestDataflowRunner", does not support the TestStream transform. Supported runners: ['DirectRunner', 'SwitchingDirectRunner']
Tests that the TestStream can independently control output watermarks. ... SKIP: The "TestDataflowRunner", does not support the TestStream transform. Supported runners: ['DirectRunner', 'SwitchingDirectRunner']
test_text_detection_with_language_hint (apache_beam.ml.gcp.visionml_test_it.VisionMlTestIT) ... ok
test_label_detection_with_video_context (apache_beam.ml.gcp.videointelligenceml_test_it.VideoIntelligenceMlTestIT) ... ok
Runs streaming Dataflow job and verifies that user metrics are reported ... ok
test_big_query_legacy_sql (apache_beam.io.gcp.big_query_query_to_table_it_test.BigQueryQueryToTableIT) ... ok
test_big_query_new_types (apache_beam.io.gcp.big_query_query_to_table_it_test.BigQueryQueryToTableIT) ... ok
test_big_query_new_types_avro (apache_beam.io.gcp.big_query_query_to_table_it_test.BigQueryQueryToTableIT) ... ok
test_big_query_new_types_native (apache_beam.io.gcp.big_query_query_to_table_it_test.BigQueryQueryToTableIT) ... ok
test_big_query_standard_sql (apache_beam.io.gcp.big_query_query_to_table_it_test.BigQueryQueryToTableIT) ... ok
test_big_query_standard_sql_kms_key_native (apache_beam.io.gcp.big_query_query_to_table_it_test.BigQueryQueryToTableIT) ... ok
test_deidentification (apache_beam.ml.gcp.cloud_dlp_it_test.CloudDLPIT) ... ok
test_inspection (apache_beam.ml.gcp.cloud_dlp_it_test.CloudDLPIT) ... ok
test_job_python_from_python_it (apache_beam.transforms.external_it_test.ExternalTransformIT) ... ok
test_metrics_fnapi_it (apache_beam.runners.dataflow.dataflow_exercise_metrics_pipeline_test.ExerciseMetricsPipelineTest) ... ok
test_metrics_it (apache_beam.runners.dataflow.dataflow_exercise_metrics_pipeline_test.ExerciseMetricsPipelineTest) ... ok
----------------------------------------------------------------------
XML: nosetests-postCommitIT-df-py37.xml
----------------------------------------------------------------------
XML: <https://ci-beam.apache.org/job/beam_PostCommit_Python37/ws/src/sdks/python/nosetests.xml>
----------------------------------------------------------------------
Ran 66 tests in 4310.596s
OK (SKIP=7)
FAILURE: Build failed with an exception.
* Where:
Script '<https://ci-beam.apache.org/job/beam_PostCommit_Python37/ws/src/sdks/python/test-suites/portable/common.gradle'> line: 210
* What went wrong:
Execution failed for task ':sdks:python:test-suites:portable:py37:postCommitPy37IT'.
> Process 'command 'sh'' finished with non-zero exit value 1
* Try:
Run with --stacktrace option to get the stack trace. Run with --info or --debug option to get more log output. Run with --scan to get full insights.
* Get more help at https://help.gradle.org
Deprecated Gradle features were used in this build, making it incompatible with Gradle 6.0.
Use '--warning-mode all' to show the individual deprecation warnings.
See https://docs.gradle.org/5.2.1/userguide/command_line_interface.html#sec:command_line_warnings
BUILD FAILED in 1h 14m 15s
139 actionable tasks: 104 executed, 34 from cache, 1 up-to-date
Publishing build scan...
https://gradle.com/s/xgo76pftts2ya
Build step 'Invoke Gradle script' changed build result to FAILURE
Build step 'Invoke Gradle script' marked build as failure
---------------------------------------------------------------------
To unsubscribe, e-mail: builds-unsubscribe@beam.apache.org
For additional commands, e-mail: builds-help@beam.apache.org