You are viewing a plain text version of this content. The canonical link for it is here.
Posted to builds@solr.apache.org by Apache Jenkins Server <je...@builds.apache.org> on 2022/11/22 22:53:46 UTC
[JENKINS] Solr » Solr-Check-main - Build # 5362 - Unstable!
Build: https://ci-builds.apache.org/job/Solr/job/Solr-Check-main/5362/
2 tests failed.
FAILED: org.apache.solr.search.TestFiltering.testRandomFiltering
Error Message:
java.lang.AssertionError: FAILURE: indexSize=79 iiter=4 qiter=471 request=[q, {!frange v=val_i l=76 u=84 cache=true tag=t}, fq, {! cache=true tag=t}id:RAND-1222284655 OR val_s:[00003 TO 00057}, facet, true, facet.query, *:*, facet.query, {!key=multiSelect ex=t}*:*, facet.query, {!key=facetQuery cache=true} -val_i:1 -val_i:2 -val_i:4 -val_i:5 -val_i:8 -val_i:13 -val_i:15 -val_i:20 -val_i:21 -val_i:22 -val_i:23 -val_i:27 -val_i:29 -val_i:30 -val_i:31 -val_i:33 -val_i:36 -val_i:39 -val_i:41 -val_i:43 -val_i:45 -val_i:46 -val_i:49 -val_i:52 -val_i:56 -val_i:60 -val_i:62 -val_i:64 -val_i:67 -val_i:70 -val_i:71]
Stack Trace:
java.lang.AssertionError: FAILURE: indexSize=79 iiter=4 qiter=471 request=[q, {!frange v=val_i l=76 u=84 cache=true tag=t}, fq, {! cache=true tag=t}id:RAND-1222284655 OR val_s:[00003 TO 00057}, facet, true, facet.query, *:*, facet.query, {!key=multiSelect ex=t}*:*, facet.query, {!key=facetQuery cache=true} -val_i:1 -val_i:2 -val_i:4 -val_i:5 -val_i:8 -val_i:13 -val_i:15 -val_i:20 -val_i:21 -val_i:22 -val_i:23 -val_i:27 -val_i:29 -val_i:30 -val_i:31 -val_i:33 -val_i:36 -val_i:39 -val_i:41 -val_i:43 -val_i:45 -val_i:46 -val_i:49 -val_i:52 -val_i:56 -val_i:60 -val_i:62 -val_i:64 -val_i:67 -val_i:70 -val_i:71]
at __randomizedtesting.SeedInfo.seed([FDBC75D180FA4C63:E2DFD61465DD0C6A]:0)
at org.junit.Assert.fail(Assert.java:89)
at org.apache.solr.search.TestFiltering.testRandomFiltering(TestFiltering.java:578)
at java.base/jdk.internal.reflect.NativeMethodAccessorImpl.invoke0(Native Method)
at java.base/jdk.internal.reflect.NativeMethodAccessorImpl.invoke(NativeMethodAccessorImpl.java:62)
at java.base/jdk.internal.reflect.DelegatingMethodAccessorImpl.invoke(DelegatingMethodAccessorImpl.java:43)
at java.base/java.lang.reflect.Method.invoke(Method.java:566)
at com.carrotsearch.randomizedtesting.RandomizedRunner.invoke(RandomizedRunner.java:1758)
at com.carrotsearch.randomizedtesting.RandomizedRunner$8.evaluate(RandomizedRunner.java:946)
at com.carrotsearch.randomizedtesting.RandomizedRunner$9.evaluate(RandomizedRunner.java:982)
at com.carrotsearch.randomizedtesting.RandomizedRunner$10.evaluate(RandomizedRunner.java:996)
at com.carrotsearch.randomizedtesting.rules.SystemPropertiesRestoreRule$1.evaluate(SystemPropertiesRestoreRule.java:80)
at org.junit.rules.RunRules.evaluate(RunRules.java:20)
at org.apache.lucene.tests.util.TestRuleSetupTeardownChained$1.evaluate(TestRuleSetupTeardownChained.java:44)
at org.apache.lucene.tests.util.AbstractBeforeAfterRule$1.evaluate(AbstractBeforeAfterRule.java:43)
at org.apache.lucene.tests.util.TestRuleThreadAndTestName$1.evaluate(TestRuleThreadAndTestName.java:45)
at org.apache.lucene.tests.util.TestRuleIgnoreAfterMaxFailures$1.evaluate(TestRuleIgnoreAfterMaxFailures.java:60)
at org.apache.lucene.tests.util.TestRuleMarkFailure$1.evaluate(TestRuleMarkFailure.java:44)
at org.junit.rules.RunRules.evaluate(RunRules.java:20)
at com.carrotsearch.randomizedtesting.rules.StatementAdapter.evaluate(StatementAdapter.java:36)
at com.carrotsearch.randomizedtesting.ThreadLeakControl$StatementRunner.run(ThreadLeakControl.java:390)
at com.carrotsearch.randomizedtesting.ThreadLeakControl.forkTimeoutingTask(ThreadLeakControl.java:843)
at com.carrotsearch.randomizedtesting.ThreadLeakControl$3.evaluate(ThreadLeakControl.java:490)
at com.carrotsearch.randomizedtesting.RandomizedRunner.runSingleTest(RandomizedRunner.java:955)
at com.carrotsearch.randomizedtesting.RandomizedRunner$5.evaluate(RandomizedRunner.java:840)
at com.carrotsearch.randomizedtesting.RandomizedRunner$6.evaluate(RandomizedRunner.java:891)
at com.carrotsearch.randomizedtesting.RandomizedRunner$7.evaluate(RandomizedRunner.java:902)
at com.carrotsearch.randomizedtesting.rules.StatementAdapter.evaluate(StatementAdapter.java:36)
at org.apache.lucene.tests.util.AbstractBeforeAfterRule$1.evaluate(AbstractBeforeAfterRule.java:43)
at org.apache.lucene.tests.util.AbstractBeforeAfterRule$1.evaluate(AbstractBeforeAfterRule.java:43)
at com.carrotsearch.randomizedtesting.rules.SystemPropertiesRestoreRule$1.evaluate(SystemPropertiesRestoreRule.java:80)
at org.junit.rules.RunRules.evaluate(RunRules.java:20)
at org.apache.lucene.tests.util.AbstractBeforeAfterRule$1.evaluate(AbstractBeforeAfterRule.java:43)
at com.carrotsearch.randomizedtesting.rules.StatementAdapter.evaluate(StatementAdapter.java:36)
at org.apache.lucene.tests.util.TestRuleStoreClassName$1.evaluate(TestRuleStoreClassName.java:38)
at com.carrotsearch.randomizedtesting.rules.NoShadowingOrOverridesOnMethodsRule$1.evaluate(NoShadowingOrOverridesOnMethodsRule.java:40)
at com.carrotsearch.randomizedtesting.rules.NoShadowingOrOverridesOnMethodsRule$1.evaluate(NoShadowingOrOverridesOnMethodsRule.java:40)
at com.carrotsearch.randomizedtesting.rules.StatementAdapter.evaluate(StatementAdapter.java:36)
at com.carrotsearch.randomizedtesting.rules.StatementAdapter.evaluate(StatementAdapter.java:36)
at org.apache.lucene.tests.util.TestRuleAssertionsRequired$1.evaluate(TestRuleAssertionsRequired.java:53)
at org.apache.lucene.tests.util.AbstractBeforeAfterRule$1.evaluate(AbstractBeforeAfterRule.java:43)
at org.apache.lucene.tests.util.TestRuleMarkFailure$1.evaluate(TestRuleMarkFailure.java:44)
at org.apache.lucene.tests.util.TestRuleIgnoreAfterMaxFailures$1.evaluate(TestRuleIgnoreAfterMaxFailures.java:60)
at org.apache.lucene.tests.util.TestRuleIgnoreTestSuites$1.evaluate(TestRuleIgnoreTestSuites.java:47)
at org.junit.rules.RunRules.evaluate(RunRules.java:20)
at com.carrotsearch.randomizedtesting.rules.StatementAdapter.evaluate(StatementAdapter.java:36)
at com.carrotsearch.randomizedtesting.ThreadLeakControl$StatementRunner.run(ThreadLeakControl.java:390)
at com.carrotsearch.randomizedtesting.ThreadLeakControl.lambda$forkTimeoutingTask$0(ThreadLeakControl.java:850)
at java.base/java.lang.Thread.run(Thread.java:829)
FAILED: org.apache.solr.util.TestCircuitBreaker.testResponseWithCBTiming
Error Message:
java.lang.RuntimeException: Exception during query
Stack Trace:
java.lang.RuntimeException: Exception during query
at __randomizedtesting.SeedInfo.seed([FDBC75D180FA4C63:1560D83373125643]:0)
at org.apache.solr.SolrTestCaseJ4.assertQ(SolrTestCaseJ4.java:1044)
at org.apache.solr.SolrTestCaseJ4.assertQ(SolrTestCaseJ4.java:1002)
at org.apache.solr.util.TestCircuitBreaker.testResponseWithCBTiming(TestCircuitBreaker.java:220)
at java.base/jdk.internal.reflect.NativeMethodAccessorImpl.invoke0(Native Method)
at java.base/jdk.internal.reflect.NativeMethodAccessorImpl.invoke(NativeMethodAccessorImpl.java:62)
at java.base/jdk.internal.reflect.DelegatingMethodAccessorImpl.invoke(DelegatingMethodAccessorImpl.java:43)
at java.base/java.lang.reflect.Method.invoke(Method.java:566)
at com.carrotsearch.randomizedtesting.RandomizedRunner.invoke(RandomizedRunner.java:1758)
at com.carrotsearch.randomizedtesting.RandomizedRunner$8.evaluate(RandomizedRunner.java:946)
at com.carrotsearch.randomizedtesting.RandomizedRunner$9.evaluate(RandomizedRunner.java:982)
at com.carrotsearch.randomizedtesting.RandomizedRunner$10.evaluate(RandomizedRunner.java:996)
at com.carrotsearch.randomizedtesting.rules.SystemPropertiesRestoreRule$1.evaluate(SystemPropertiesRestoreRule.java:80)
at org.junit.rules.RunRules.evaluate(RunRules.java:20)
at org.apache.lucene.tests.util.TestRuleSetupTeardownChained$1.evaluate(TestRuleSetupTeardownChained.java:44)
at org.apache.lucene.tests.util.AbstractBeforeAfterRule$1.evaluate(AbstractBeforeAfterRule.java:43)
at org.apache.lucene.tests.util.TestRuleThreadAndTestName$1.evaluate(TestRuleThreadAndTestName.java:45)
at org.apache.lucene.tests.util.TestRuleIgnoreAfterMaxFailures$1.evaluate(TestRuleIgnoreAfterMaxFailures.java:60)
at org.apache.lucene.tests.util.TestRuleMarkFailure$1.evaluate(TestRuleMarkFailure.java:44)
at org.junit.rules.RunRules.evaluate(RunRules.java:20)
at com.carrotsearch.randomizedtesting.rules.StatementAdapter.evaluate(StatementAdapter.java:36)
at com.carrotsearch.randomizedtesting.ThreadLeakControl$StatementRunner.run(ThreadLeakControl.java:390)
at com.carrotsearch.randomizedtesting.ThreadLeakControl.forkTimeoutingTask(ThreadLeakControl.java:843)
at com.carrotsearch.randomizedtesting.ThreadLeakControl$3.evaluate(ThreadLeakControl.java:490)
at com.carrotsearch.randomizedtesting.RandomizedRunner.runSingleTest(RandomizedRunner.java:955)
at com.carrotsearch.randomizedtesting.RandomizedRunner$5.evaluate(RandomizedRunner.java:840)
at com.carrotsearch.randomizedtesting.RandomizedRunner$6.evaluate(RandomizedRunner.java:891)
at com.carrotsearch.randomizedtesting.RandomizedRunner$7.evaluate(RandomizedRunner.java:902)
at com.carrotsearch.randomizedtesting.rules.StatementAdapter.evaluate(StatementAdapter.java:36)
at org.apache.lucene.tests.util.AbstractBeforeAfterRule$1.evaluate(AbstractBeforeAfterRule.java:43)
at org.apache.lucene.tests.util.AbstractBeforeAfterRule$1.evaluate(AbstractBeforeAfterRule.java:43)
at com.carrotsearch.randomizedtesting.rules.SystemPropertiesRestoreRule$1.evaluate(SystemPropertiesRestoreRule.java:80)
at org.junit.rules.RunRules.evaluate(RunRules.java:20)
at org.apache.lucene.tests.util.AbstractBeforeAfterRule$1.evaluate(AbstractBeforeAfterRule.java:43)
at com.carrotsearch.randomizedtesting.rules.StatementAdapter.evaluate(StatementAdapter.java:36)
at org.apache.lucene.tests.util.TestRuleStoreClassName$1.evaluate(TestRuleStoreClassName.java:38)
at com.carrotsearch.randomizedtesting.rules.NoShadowingOrOverridesOnMethodsRule$1.evaluate(NoShadowingOrOverridesOnMethodsRule.java:40)
at com.carrotsearch.randomizedtesting.rules.NoShadowingOrOverridesOnMethodsRule$1.evaluate(NoShadowingOrOverridesOnMethodsRule.java:40)
at com.carrotsearch.randomizedtesting.rules.StatementAdapter.evaluate(StatementAdapter.java:36)
at com.carrotsearch.randomizedtesting.rules.StatementAdapter.evaluate(StatementAdapter.java:36)
at org.apache.lucene.tests.util.TestRuleAssertionsRequired$1.evaluate(TestRuleAssertionsRequired.java:53)
at org.apache.lucene.tests.util.AbstractBeforeAfterRule$1.evaluate(AbstractBeforeAfterRule.java:43)
at org.apache.lucene.tests.util.TestRuleMarkFailure$1.evaluate(TestRuleMarkFailure.java:44)
at org.apache.lucene.tests.util.TestRuleIgnoreAfterMaxFailures$1.evaluate(TestRuleIgnoreAfterMaxFailures.java:60)
at org.apache.lucene.tests.util.TestRuleIgnoreTestSuites$1.evaluate(TestRuleIgnoreTestSuites.java:47)
at org.junit.rules.RunRules.evaluate(RunRules.java:20)
at com.carrotsearch.randomizedtesting.rules.StatementAdapter.evaluate(StatementAdapter.java:36)
at com.carrotsearch.randomizedtesting.ThreadLeakControl$StatementRunner.run(ThreadLeakControl.java:390)
at com.carrotsearch.randomizedtesting.ThreadLeakControl.lambda$forkTimeoutingTask$0(ThreadLeakControl.java:850)
at java.base/java.lang.Thread.run(Thread.java:829)
Caused by: org.apache.solr.common.SolrException: Circuit Breakers tripped Memory Circuit Breaker triggered as JVM heap usage values are greater than allocated threshold.Seen JVM heap memory usage 440980392 and allocated threshold 397541376
at app//org.apache.solr.handler.component.SearchHandler.handleRequestBody(SearchHandler.java:369)
at app//org.apache.solr.handler.RequestHandlerBase.handleRequest(RequestHandlerBase.java:224)
at app//org.apache.solr.core.SolrCore.execute(SolrCore.java:2873)
at app//org.apache.solr.util.TestHarness.query(TestHarness.java:357)
at app//org.apache.solr.util.TestHarness.query(TestHarness.java:337)
at app//org.apache.solr.SolrTestCaseJ4.assertQ(SolrTestCaseJ4.java:1016)
... 48 more
Build Log:
[...truncated 4802 lines...]
ERROR: The following test(s) have failed:
- org.apache.solr.search.TestFiltering.testRandomFiltering (:solr:core)
Test output: /home/jenkins/jenkins-slave/workspace/Solr/Solr-Check-main/solr/core/build/test-results/test/outputs/OUTPUT-org.apache.solr.search.TestFiltering.txt
Reproduce with: gradlew :solr:core:test --tests "org.apache.solr.search.TestFiltering.testRandomFiltering" -Ptests.jvms=4 -Ptests.haltonfailure=false "-Ptests.jvmargs=-XX:TieredStopAtLevel=1 -XX:+UseParallelGC -XX:ActiveProcessorCount=1 -XX:ReservedCodeCacheSize=120m" -Ptests.seed=FDBC75D180FA4C63 -Ptests.multiplier=2 -Ptests.badapples=false -Ptests.file.encoding=UTF-8
- org.apache.solr.util.TestCircuitBreaker.testResponseWithCBTiming (:solr:core)
Test output: /home/jenkins/jenkins-slave/workspace/Solr/Solr-Check-main/solr/core/build/test-results/test/outputs/OUTPUT-org.apache.solr.util.TestCircuitBreaker.txt
Reproduce with: gradlew :solr:core:test --tests "org.apache.solr.util.TestCircuitBreaker.testResponseWithCBTiming" -Ptests.jvms=4 -Ptests.haltonfailure=false "-Ptests.jvmargs=-XX:TieredStopAtLevel=1 -XX:+UseParallelGC -XX:ActiveProcessorCount=1 -XX:ReservedCodeCacheSize=120m" -Ptests.seed=FDBC75D180FA4C63 -Ptests.multiplier=2 -Ptests.badapples=false -Ptests.file.encoding=UTF-8
Deprecated Gradle features were used in this build, making it incompatible with Gradle 8.0.
You can use '--warning-mode all' to show the individual deprecation warnings and determine if they come from your own scripts or plugins.
See https://docs.gradle.org/7.5.1/userguide/command_line_interface.html#sec:command_line_warnings
BUILD SUCCESSFUL in 47m 36s
609 actionable tasks: 609 executed
Build step 'Invoke Gradle script' changed build result to SUCCESS
Archiving artifacts
hudson.FilePath$ValidateAntFileMask$1Cancel
at hudson.FilePath$ValidateAntFileMask$1.isCaseSensitive(FilePath.java:3209)
at org.apache.tools.ant.DirectoryScanner.isIncluded(DirectoryScanner.java:1370)
at org.apache.tools.ant.DirectoryScanner.scandir(DirectoryScanner.java:1260)
at org.apache.tools.ant.DirectoryScanner.scandir(DirectoryScanner.java:1267)
at org.apache.tools.ant.DirectoryScanner.scandir(DirectoryScanner.java:1267)
at org.apache.tools.ant.DirectoryScanner.scandir(DirectoryScanner.java:1194)
at org.apache.tools.ant.DirectoryScanner.scandir(DirectoryScanner.java:1156)
at org.apache.tools.ant.DirectoryScanner.checkIncludePatterns(DirectoryScanner.java:954)
at org.apache.tools.ant.DirectoryScanner.scan(DirectoryScanner.java:912)
at hudson.FilePath$ValidateAntFileMask.hasMatch(FilePath.java:3222)
Caused: java.lang.InterruptedException: no matches found within 10000
at hudson.FilePath$ValidateAntFileMask.hasMatch(FilePath.java:3227)
at hudson.FilePath$ValidateAntFileMask.invoke(FilePath.java:3105)
at hudson.FilePath$ValidateAntFileMask.invoke(FilePath.java:3083)
at hudson.FilePath$FileCallableWrapper.call(FilePath.java:3487)
Also: hudson.remoting.Channel$CallSiteStackTrace: Remote call to lucene-solr-1
at hudson.remoting.Channel.attachCallSiteStackTrace(Channel.java:1784)
at hudson.remoting.UserRequest$ExceptionResponse.retrieve(UserRequest.java:356)
at hudson.remoting.Channel.call(Channel.java:1000)
at hudson.FilePath.act(FilePath.java:1194)
at hudson.FilePath.act(FilePath.java:1183)
at hudson.FilePath.validateAntFileMask(FilePath.java:3080)
at hudson.tasks.ArtifactArchiver.perform(ArtifactArchiver.java:269)
at hudson.tasks.BuildStepCompatibilityLayer.perform(BuildStepCompatibilityLayer.java:79)
at hudson.tasks.BuildStepMonitor$1.perform(BuildStepMonitor.java:20)
at hudson.model.AbstractBuild$AbstractBuildExecution.perform(AbstractBuild.java:814)
at hudson.model.AbstractBuild$AbstractBuildExecution.performAllBuildSteps(AbstractBuild.java:763)
at hudson.model.Build$BuildExecution.post2(Build.java:179)
at hudson.model.AbstractBuild$AbstractBuildExecution.post(AbstractBuild.java:707)
at hudson.model.Run.execute(Run.java:1921)
at hudson.model.FreeStyleBuild.run(FreeStyleBuild.java:44)
at hudson.model.ResourceController.execute(ResourceController.java:101)
at hudson.model.Executor.run(Executor.java:442)
Caused: hudson.FilePath$TunneledInterruptedException
at hudson.FilePath$FileCallableWrapper.call(FilePath.java:3489)
at hudson.remoting.UserRequest.perform(UserRequest.java:211)
at hudson.remoting.UserRequest.perform(UserRequest.java:54)
at hudson.remoting.Request$2.run(Request.java:376)
at hudson.remoting.InterceptingExecutorService.lambda$wrap$0(InterceptingExecutorService.java:78)
at java.base/java.util.concurrent.FutureTask.run(FutureTask.java:264)
at java.base/java.util.concurrent.ThreadPoolExecutor.runWorker(ThreadPoolExecutor.java:1128)
at java.base/java.util.concurrent.ThreadPoolExecutor$Worker.run(ThreadPoolExecutor.java:628)
at java.base/java.lang.Thread.run(Thread.java:829)
Caused: java.lang.InterruptedException: java.lang.InterruptedException: no matches found within 10000
at hudson.FilePath.act(FilePath.java:1196)
at hudson.FilePath.act(FilePath.java:1183)
at hudson.FilePath.validateAntFileMask(FilePath.java:3080)
at hudson.tasks.ArtifactArchiver.perform(ArtifactArchiver.java:269)
at hudson.tasks.BuildStepCompatibilityLayer.perform(BuildStepCompatibilityLayer.java:79)
at hudson.tasks.BuildStepMonitor$1.perform(BuildStepMonitor.java:20)
at hudson.model.AbstractBuild$AbstractBuildExecution.perform(AbstractBuild.java:814)
at hudson.model.AbstractBuild$AbstractBuildExecution.performAllBuildSteps(AbstractBuild.java:763)
at hudson.model.Build$BuildExecution.post2(Build.java:179)
at hudson.model.AbstractBuild$AbstractBuildExecution.post(AbstractBuild.java:707)
at hudson.model.Run.execute(Run.java:1921)
at hudson.model.FreeStyleBuild.run(FreeStyleBuild.java:44)
at hudson.model.ResourceController.execute(ResourceController.java:101)
at hudson.model.Executor.run(Executor.java:442)
No artifacts found that match the file pattern "**/*.events,heapdumps/**,**/hs_err_pid*". Configuration error?
Recording test results
[Checks API] No suitable checks publisher found.
Build step 'Publish JUnit test result report' changed build result to UNSTABLE
Email was triggered for: Unstable (Test Failures)
Sending email for trigger: Unstable (Test Failures)