You are viewing a plain text version of this content. The canonical link for it is here.
Posted to commits@beam.apache.org by Apache Jenkins Server <je...@builds.apache.org> on 2018/06/07 15:46:23 UTC

Build failed in Jenkins: beam_PerformanceTests_MongoDBIO_IT #278

See <https://builds.apache.org/job/beam_PerformanceTests_MongoDBIO_IT/278/display/redirect>

------------------------------------------
[...truncated 246.61 KB...]
    INFO: 2018-06-07T15:39:31.686Z: Fusing consumer Calculate hashcode/Combine.perKey(Hashing)/Combine.GroupedValues into Calculate hashcode/Combine.perKey(Hashing)/GroupByKey/Read
    Jun 07, 2018 3:39:38 PM org.apache.beam.runners.dataflow.util.MonitoringUtil$LoggingHandler process
    INFO: 2018-06-07T15:39:31.722Z: Fusing consumer Calculate hashcode/Combine.perKey(Hashing)/GroupByKey+Calculate hashcode/Combine.perKey(Hashing)/Combine.GroupedValues/Partial into Calculate hashcode/WithKeys/AddKeys/Map
    Jun 07, 2018 3:39:38 PM org.apache.beam.runners.dataflow.util.MonitoringUtil$LoggingHandler process
    INFO: 2018-06-07T15:39:31.767Z: Fusing consumer Map documents to Strings/Map into Read all documents/Read(BoundedMongoDbSource)
    Jun 07, 2018 3:39:38 PM org.apache.beam.runners.dataflow.util.MonitoringUtil$LoggingHandler process
    INFO: 2018-06-07T15:39:31.802Z: Fusing consumer Calculate hashcode/Combine.perKey(Hashing)/GroupByKey/Write into Calculate hashcode/Combine.perKey(Hashing)/GroupByKey/Reify
    Jun 07, 2018 3:39:38 PM org.apache.beam.runners.dataflow.util.MonitoringUtil$LoggingHandler process
    INFO: 2018-06-07T15:39:31.841Z: Fusing consumer Calculate hashcode/Values/Values/Map into Calculate hashcode/Combine.perKey(Hashing)/Combine.GroupedValues/Extract
    Jun 07, 2018 3:39:38 PM org.apache.beam.runners.dataflow.util.MonitoringUtil$LoggingHandler process
    INFO: 2018-06-07T15:39:31.885Z: Fusing consumer Calculate hashcode/WithKeys/AddKeys/Map into Map documents to Strings/Map
    Jun 07, 2018 3:39:38 PM org.apache.beam.runners.dataflow.util.MonitoringUtil$LoggingHandler process
    INFO: 2018-06-07T15:39:31.937Z: Fusing consumer Calculate hashcode/Combine.perKey(Hashing)/GroupByKey/Reify into Calculate hashcode/Combine.perKey(Hashing)/GroupByKey+Calculate hashcode/Combine.perKey(Hashing)/Combine.GroupedValues/Partial
    Jun 07, 2018 3:39:38 PM org.apache.beam.runners.dataflow.util.MonitoringUtil$LoggingHandler process
    INFO: 2018-06-07T15:39:31.984Z: Fusing consumer Calculate hashcode/ProduceDefault into Calculate hashcode/CreateVoid/Read(CreateSource)
    Jun 07, 2018 3:39:38 PM org.apache.beam.runners.dataflow.util.MonitoringUtil$LoggingHandler process
    INFO: 2018-06-07T15:39:32.033Z: Fusing consumer PAssert$0/VerifyAssertions/ParDo(DefaultConclude) into PAssert$0/RunChecks
    Jun 07, 2018 3:39:38 PM org.apache.beam.runners.dataflow.util.MonitoringUtil$LoggingHandler process
    INFO: 2018-06-07T15:39:32.075Z: Fusing consumer PAssert$0/WindowToken/Window.Assign into PAssert$0/Create.Values/Read(CreateSource)
    Jun 07, 2018 3:39:38 PM org.apache.beam.runners.dataflow.util.MonitoringUtil$LoggingHandler process
    INFO: 2018-06-07T15:39:32.123Z: Fusing consumer PAssert$0/RunChecks into PAssert$0/WindowToken/Window.Assign
    Jun 07, 2018 3:39:38 PM org.apache.beam.runners.dataflow.util.MonitoringUtil$LoggingHandler process
    INFO: 2018-06-07T15:39:32.741Z: Executing operation PAssert$0/CreateActual/GatherPanes/GroupByKey/Create
    Jun 07, 2018 3:39:38 PM org.apache.beam.runners.dataflow.util.MonitoringUtil$LoggingHandler process
    INFO: 2018-06-07T15:39:32.771Z: Executing operation PAssert$0/CreateActual/View.AsSingleton/Combine.GloballyAsSingletonView/Combine.globally(Singleton)/Combine.perKey(Singleton)/GroupByKey/Create
    Jun 07, 2018 3:39:38 PM org.apache.beam.runners.dataflow.util.MonitoringUtil$LoggingHandler process
    INFO: 2018-06-07T15:39:32.815Z: Executing operation PAssert$0/CreateActual/View.AsSingleton/Combine.GloballyAsSingletonView/BatchViewOverrides.GroupByWindowHashAsKeyAndWindowAsSortKey/BatchViewOverrides.GroupByKeyAndSortValuesOnly/Create
    Jun 07, 2018 3:39:38 PM org.apache.beam.runners.dataflow.util.MonitoringUtil$LoggingHandler process
    INFO: 2018-06-07T15:39:32.850Z: Starting 1 workers in us-central1-b...
    Jun 07, 2018 3:39:38 PM org.apache.beam.runners.dataflow.util.MonitoringUtil$LoggingHandler process
    INFO: 2018-06-07T15:39:32.862Z: Executing operation Calculate hashcode/Combine.perKey(Hashing)/GroupByKey/Create
    Jun 07, 2018 3:39:38 PM org.apache.beam.runners.dataflow.util.MonitoringUtil$LoggingHandler process
    INFO: 2018-06-07T15:39:33.357Z: Executing operation Read all documents/Read(BoundedMongoDbSource)+Map documents to Strings/Map+Calculate hashcode/WithKeys/AddKeys/Map+Calculate hashcode/Combine.perKey(Hashing)/GroupByKey+Calculate hashcode/Combine.perKey(Hashing)/Combine.GroupedValues/Partial+Calculate hashcode/Combine.perKey(Hashing)/GroupByKey/Reify+Calculate hashcode/Combine.perKey(Hashing)/GroupByKey/Write
    Jun 07, 2018 3:39:41 PM org.apache.beam.runners.dataflow.util.MonitoringUtil$LoggingHandler process
    INFO: 2018-06-07T15:39:40.367Z: Autoscaling: Raised the number of workers to 0 based on the rate of progress in the currently running step(s).
    Jun 07, 2018 3:39:57 PM org.apache.beam.runners.dataflow.util.MonitoringUtil$LoggingHandler process
    INFO: 2018-06-07T15:39:56.184Z: Autoscaling: Raised the number of workers to 1 based on the rate of progress in the currently running step(s).
    Jun 07, 2018 3:39:57 PM org.apache.beam.runners.dataflow.util.MonitoringUtil$LoggingHandler process
    INFO: 2018-06-07T15:39:56.238Z: Autoscaling: Would further reduce the number of workers but reached the minimum number allowed for the job.
    Jun 07, 2018 3:40:17 PM org.apache.beam.runners.dataflow.util.MonitoringUtil$LoggingHandler process
    INFO: 2018-06-07T15:40:15.505Z: Workers have started successfully.
    Jun 07, 2018 3:43:48 PM org.apache.beam.runners.dataflow.util.MonitoringUtil$LoggingHandler process
    INFO: 2018-06-07T15:43:48.688Z: Executing operation Calculate hashcode/Combine.perKey(Hashing)/GroupByKey/Close
    Jun 07, 2018 3:43:50 PM org.apache.beam.runners.dataflow.util.MonitoringUtil$LoggingHandler process
    INFO: 2018-06-07T15:43:48.883Z: Executing operation Calculate hashcode/Combine.perKey(Hashing)/GroupByKey/Read+Calculate hashcode/Combine.perKey(Hashing)/Combine.GroupedValues+Calculate hashcode/Combine.perKey(Hashing)/Combine.GroupedValues/Extract+Calculate hashcode/Values/Values/Map+Calculate hashcode/View.AsIterable/ParDo(ToIsmRecordForGlobalWindow)+PAssert$0/CreateActual/FilterActuals/Window.Assign+PAssert$0/CreateActual/GatherPanes/Reify.Window/ParDo(Anonymous)+PAssert$0/CreateActual/GatherPanes/WithKeys/AddKeys/Map+PAssert$0/CreateActual/GatherPanes/Window.Into()/Window.Assign+PAssert$0/CreateActual/GatherPanes/GroupByKey/Reify+PAssert$0/CreateActual/GatherPanes/GroupByKey/Write
    Jun 07, 2018 3:43:55 PM org.apache.beam.runners.dataflow.util.MonitoringUtil$LoggingHandler process
    INFO: 2018-06-07T15:43:54.096Z: Executing operation Calculate hashcode/View.AsIterable/CreateDataflowView
    Jun 07, 2018 3:43:55 PM org.apache.beam.runners.dataflow.util.MonitoringUtil$LoggingHandler process
    INFO: 2018-06-07T15:43:54.333Z: Executing operation Calculate hashcode/CreateVoid/Read(CreateSource)+Calculate hashcode/ProduceDefault+PAssert$0/CreateActual/FilterActuals/Window.Assign+PAssert$0/CreateActual/GatherPanes/Reify.Window/ParDo(Anonymous)+PAssert$0/CreateActual/GatherPanes/WithKeys/AddKeys/Map+PAssert$0/CreateActual/GatherPanes/Window.Into()/Window.Assign+PAssert$0/CreateActual/GatherPanes/GroupByKey/Reify+PAssert$0/CreateActual/GatherPanes/GroupByKey/Write
    Jun 07, 2018 3:43:55 PM org.apache.beam.runners.dataflow.util.MonitoringUtil$LoggingHandler process
    INFO: 2018-06-07T15:43:55.285Z: Executing operation PAssert$0/CreateActual/GatherPanes/GroupByKey/Close
    Jun 07, 2018 3:43:57 PM org.apache.beam.runners.dataflow.util.MonitoringUtil$LoggingHandler process
    INFO: 2018-06-07T15:43:55.455Z: Executing operation PAssert$0/CreateActual/GatherPanes/GroupByKey/Read+PAssert$0/CreateActual/GatherPanes/GroupByKey/GroupByWindow+PAssert$0/CreateActual/GatherPanes/Values/Values/Map+PAssert$0/CreateActual/ExtractPane/Map+PAssert$0/CreateActual/Flatten.Iterables/FlattenIterables/FlatMap+PAssert$0/CreateActual/RewindowActuals/Window.Assign+PAssert$0/CreateActual/ParDo(Anonymous)+PAssert$0/CreateActual/View.AsSingleton/Combine.GloballyAsSingletonView/Combine.globally(Singleton)/WithKeys/AddKeys/Map+PAssert$0/CreateActual/View.AsSingleton/Combine.GloballyAsSingletonView/Combine.globally(Singleton)/Combine.perKey(Singleton)/GroupByKey+PAssert$0/CreateActual/View.AsSingleton/Combine.GloballyAsSingletonView/Combine.globally(Singleton)/Combine.perKey(Singleton)/Combine.GroupedValues/Partial+PAssert$0/CreateActual/View.AsSingleton/Combine.GloballyAsSingletonView/Combine.globally(Singleton)/Combine.perKey(Singleton)/GroupByKey/Reify+PAssert$0/CreateActual/View.AsSingleton/Combine.GloballyAsSingletonView/Combine.globally(Singleton)/Combine.perKey(Singleton)/GroupByKey/Write
    Jun 07, 2018 3:43:57 PM org.apache.beam.runners.dataflow.util.MonitoringUtil$LoggingHandler process
    INFO: 2018-06-07T15:43:56.292Z: Executing operation PAssert$0/CreateActual/View.AsSingleton/Combine.GloballyAsSingletonView/Combine.globally(Singleton)/Combine.perKey(Singleton)/GroupByKey/Close
    Jun 07, 2018 3:43:57 PM org.apache.beam.runners.dataflow.util.MonitoringUtil$LoggingHandler process
    INFO: 2018-06-07T15:43:56.463Z: Executing operation PAssert$0/CreateActual/View.AsSingleton/Combine.GloballyAsSingletonView/Combine.globally(Singleton)/Combine.perKey(Singleton)/GroupByKey/Read+PAssert$0/CreateActual/View.AsSingleton/Combine.GloballyAsSingletonView/Combine.globally(Singleton)/Combine.perKey(Singleton)/Combine.GroupedValues+PAssert$0/CreateActual/View.AsSingleton/Combine.GloballyAsSingletonView/Combine.globally(Singleton)/Combine.perKey(Singleton)/Combine.GroupedValues/Extract+PAssert$0/CreateActual/View.AsSingleton/Combine.GloballyAsSingletonView/Combine.globally(Singleton)/Values/Values/Map+PAssert$0/CreateActual/View.AsSingleton/Combine.GloballyAsSingletonView/BatchViewOverrides.GroupByWindowHashAsKeyAndWindowAsSortKey/ParDo(UseWindowHashAsKeyAndWindowAsSortKey)+PAssert$0/CreateActual/View.AsSingleton/Combine.GloballyAsSingletonView/BatchViewOverrides.GroupByWindowHashAsKeyAndWindowAsSortKey/BatchViewOverrides.GroupByKeyAndSortValuesOnly/Write
    Jun 07, 2018 3:43:57 PM org.apache.beam.runners.dataflow.util.MonitoringUtil$LoggingHandler process
    INFO: 2018-06-07T15:43:57.041Z: Executing operation PAssert$0/CreateActual/View.AsSingleton/Combine.GloballyAsSingletonView/BatchViewOverrides.GroupByWindowHashAsKeyAndWindowAsSortKey/BatchViewOverrides.GroupByKeyAndSortValuesOnly/Close
    Jun 07, 2018 3:43:57 PM org.apache.beam.runners.dataflow.util.MonitoringUtil$LoggingHandler process
    INFO: 2018-06-07T15:43:57.212Z: Executing operation PAssert$0/CreateActual/View.AsSingleton/Combine.GloballyAsSingletonView/BatchViewOverrides.GroupByWindowHashAsKeyAndWindowAsSortKey/BatchViewOverrides.GroupByKeyAndSortValuesOnly/Read+PAssert$0/CreateActual/View.AsSingleton/Combine.GloballyAsSingletonView/ParDo(IsmRecordForSingularValuePerWindow)
    Jun 07, 2018 3:44:01 PM org.apache.beam.runners.dataflow.util.MonitoringUtil$LoggingHandler process
    INFO: 2018-06-07T15:44:00.876Z: Executing operation PAssert$0/CreateActual/View.AsSingleton/Combine.GloballyAsSingletonView/CreateDataflowView
    Jun 07, 2018 3:44:01 PM org.apache.beam.runners.dataflow.util.MonitoringUtil$LoggingHandler process
    INFO: 2018-06-07T15:44:01.174Z: Executing operation PAssert$0/Create.Values/Read(CreateSource)+PAssert$0/WindowToken/Window.Assign+PAssert$0/RunChecks+PAssert$0/VerifyAssertions/ParDo(DefaultConclude)
    Jun 07, 2018 3:44:04 PM org.apache.beam.runners.dataflow.util.MonitoringUtil$LoggingHandler process
    INFO: 2018-06-07T15:44:02.371Z: Cleaning up.
    Jun 07, 2018 3:44:04 PM org.apache.beam.runners.dataflow.util.MonitoringUtil$LoggingHandler process
    INFO: 2018-06-07T15:44:02.707Z: Stopping worker pool...
    Jun 07, 2018 3:45:40 PM org.apache.beam.runners.dataflow.util.MonitoringUtil$LoggingHandler process
    INFO: 2018-06-07T15:45:39.928Z: Autoscaling: Resized worker pool from 1 to 0.
    Jun 07, 2018 3:45:40 PM org.apache.beam.runners.dataflow.util.MonitoringUtil$LoggingHandler process
    INFO: 2018-06-07T15:45:39.983Z: Autoscaling: Would further reduce the number of workers but reached the minimum number allowed for the job.
    Jun 07, 2018 3:45:40 PM org.apache.beam.runners.dataflow.util.MonitoringUtil$LoggingHandler process
    INFO: 2018-06-07T15:45:40.095Z: Worker pool stopped.
    Jun 07, 2018 3:45:49 PM org.apache.beam.runners.dataflow.DataflowPipelineJob waitUntilFinish
    INFO: Job 2018-06-07_08_39_21-82456919377424850 finished with status DONE.
    Jun 07, 2018 3:45:49 PM org.apache.beam.runners.dataflow.TestDataflowRunner checkForPAssertSuccess
    INFO: Success result for Dataflow job 2018-06-07_08_39_21-82456919377424850. Found 1 success, 0 failures out of 1 expected assertions.
    Jun 07, 2018 3:45:49 PM org.apache.beam.runners.dataflow.DataflowPipelineJob waitUntilFinish
    INFO: Job 2018-06-07_08_39_21-82456919377424850 finished with status DONE.

org.apache.beam.sdk.io.mongodb.MongoDBIOIT STANDARD_ERROR
    Jun 07, 2018 3:45:49 PM com.mongodb.diagnostics.logging.SLF4JLogger info
    INFO: Cluster created with settings {hosts=[35.224.199.51:27017], mode=SINGLE, requiredClusterType=UNKNOWN, serverSelectionTimeout='30000 ms', maxWaitQueueSize=500}
    Jun 07, 2018 3:45:49 PM com.mongodb.diagnostics.logging.SLF4JLogger info
    INFO: No server chosen by WritableServerSelector from cluster description ClusterDescription{type=UNKNOWN, connectionMode=SINGLE, all=[ServerDescription{address=35.224.199.51:27017, type=UNKNOWN, state=CONNECTING}]}. Waiting for 30000 ms before timing out
    Jun 07, 2018 3:46:09 PM com.mongodb.diagnostics.logging.SLF4JLogger info
    INFO: Exception in monitor thread while connecting to server 35.224.199.51:27017
    com.mongodb.MongoSocketOpenException: Exception opening socket
    	at com.mongodb.connection.SocketStream.open(SocketStream.java:63)
    	at com.mongodb.connection.InternalStreamConnection.open(InternalStreamConnection.java:114)
    	at com.mongodb.connection.DefaultServerMonitor$ServerMonitorRunnable.run(DefaultServerMonitor.java:128)
    	at java.lang.Thread.run(Thread.java:748)
    Caused by: java.net.SocketTimeoutException: connect timed out
    	at java.net.PlainSocketImpl.socketConnect(Native Method)
    	at java.net.AbstractPlainSocketImpl.doConnect(AbstractPlainSocketImpl.java:350)
    	at java.net.AbstractPlainSocketImpl.connectToAddress(AbstractPlainSocketImpl.java:206)
    	at java.net.AbstractPlainSocketImpl.connect(AbstractPlainSocketImpl.java:188)
    	at java.net.SocksSocketImpl.connect(SocksSocketImpl.java:392)
    	at java.net.Socket.connect(Socket.java:589)
    	at com.mongodb.connection.SocketStreamHelper.initialize(SocketStreamHelper.java:50)
    	at com.mongodb.connection.SocketStream.open(SocketStream.java:58)
    	... 3 more


Gradle Test Executor 1 finished executing tests.

> Task :beam-sdks-java-io-mongodb:integrationTest

org.apache.beam.sdk.io.mongodb.MongoDBIOIT > classMethod FAILED
    com.mongodb.MongoTimeoutException: Timed out after 30000 ms while waiting for a server that matches WritableServerSelector. Client view of cluster state is {type=UNKNOWN, servers=[{address=35.224.199.51:27017, type=UNKNOWN, state=CONNECTING, exception={com.mongodb.MongoSocketOpenException: Exception opening socket}, caused by {java.net.SocketTimeoutException: connect timed out}}]
        at com.mongodb.connection.BaseCluster.createTimeoutException(BaseCluster.java:369)
        at com.mongodb.connection.BaseCluster.selectServer(BaseCluster.java:101)
        at com.mongodb.binding.ClusterBinding$ClusterBindingConnectionSource.<init>(ClusterBinding.java:75)
        at com.mongodb.binding.ClusterBinding$ClusterBindingConnectionSource.<init>(ClusterBinding.java:71)
        at com.mongodb.binding.ClusterBinding.getWriteConnectionSource(ClusterBinding.java:68)
        at com.mongodb.operation.CommandOperationHelper.executeWrappedCommandProtocol(CommandOperationHelper.java:158)
        at com.mongodb.operation.CommandOperationHelper.executeWrappedCommandProtocol(CommandOperationHelper.java:133)
        at com.mongodb.operation.CommandOperationHelper.executeWrappedCommandProtocol(CommandOperationHelper.java:128)
        at com.mongodb.operation.DropDatabaseOperation.execute(DropDatabaseOperation.java:51)
        at com.mongodb.operation.DropDatabaseOperation.execute(DropDatabaseOperation.java:36)
        at com.mongodb.Mongo.execute(Mongo.java:781)
        at com.mongodb.Mongo$2.execute(Mongo.java:764)
        at com.mongodb.MongoDatabaseImpl.drop(MongoDatabaseImpl.java:136)
        at org.apache.beam.sdk.io.mongodb.MongoDBIOIT.tearDown(MongoDBIOIT.java:112)

2 tests completed, 1 failed
Finished generating test XML results (0.023 secs) into: <https://builds.apache.org/job/beam_PerformanceTests_MongoDBIO_IT/ws/src/sdks/java/io/mongodb/build/test-results/integrationTest>
Generating HTML test report...
Finished generating test html results (0.032 secs) into: <https://builds.apache.org/job/beam_PerformanceTests_MongoDBIO_IT/ws/src/sdks/java/io/mongodb/build/reports/tests/integrationTest>

> Task :beam-sdks-java-io-mongodb:integrationTest FAILED
:beam-sdks-java-io-mongodb:integrationTest (Thread[Task worker for ':' Thread 3,5,main]) completed. Took 12 mins 42.637 secs.

Deprecated Gradle features were used in this build, making it incompatible with Gradle 5.0.
See https://docs.gradle.org/4.7/userguide/command_line_interface.html#sec:command_line_warnings

BUILD FAILED in 12m 53s
62 actionable tasks: 1 executed, 61 up-to-date

Publishing build scan...
https://gradle.com/s/rt4b6na5yu5fu


STDERR: 
FAILURE: Build failed with an exception.

* What went wrong:
Execution failed for task ':beam-sdks-java-io-mongodb:integrationTest'.
> There were failing tests. See the report at: file://<https://builds.apache.org/job/beam_PerformanceTests_MongoDBIO_IT/ws/src/sdks/java/io/mongodb/build/reports/tests/integrationTest/index.html>

* Try:
Run with --debug option to get more log output. Run with --scan to get full insights.

* Exception is:
org.gradle.api.tasks.TaskExecutionException: Execution failed for task ':beam-sdks-java-io-mongodb:integrationTest'.
	at org.gradle.api.internal.tasks.execution.ExecuteActionsTaskExecuter.executeActions(ExecuteActionsTaskExecuter.java:103)
	at org.gradle.api.internal.tasks.execution.ExecuteActionsTaskExecuter.execute(ExecuteActionsTaskExecuter.java:73)
	at org.gradle.api.internal.tasks.execution.OutputDirectoryCreatingTaskExecuter.execute(OutputDirectoryCreatingTaskExecuter.java:51)
	at org.gradle.api.internal.tasks.execution.SkipCachedTaskExecuter.execute(SkipCachedTaskExecuter.java:105)
	at org.gradle.api.internal.tasks.execution.SkipUpToDateTaskExecuter.execute(SkipUpToDateTaskExecuter.java:59)
	at org.gradle.api.internal.tasks.execution.ResolveTaskOutputCachingStateExecuter.execute(ResolveTaskOutputCachingStateExecuter.java:54)
	at org.gradle.api.internal.tasks.execution.ResolveBuildCacheKeyExecuter.execute(ResolveBuildCacheKeyExecuter.java:66)
	at org.gradle.api.internal.tasks.execution.ValidatingTaskExecuter.execute(ValidatingTaskExecuter.java:59)
	at org.gradle.api.internal.tasks.execution.SkipEmptySourceFilesTaskExecuter.execute(SkipEmptySourceFilesTaskExecuter.java:101)
	at org.gradle.api.internal.tasks.execution.FinalizeInputFilePropertiesTaskExecuter.execute(FinalizeInputFilePropertiesTaskExecuter.java:44)
	at org.gradle.api.internal.tasks.execution.CleanupStaleOutputsExecuter.execute(CleanupStaleOutputsExecuter.java:91)
	at org.gradle.api.internal.tasks.execution.ResolveTaskArtifactStateTaskExecuter.execute(ResolveTaskArtifactStateTaskExecuter.java:62)
	at org.gradle.api.internal.tasks.execution.SkipTaskWithNoActionsExecuter.execute(SkipTaskWithNoActionsExecuter.java:59)
	at org.gradle.api.internal.tasks.execution.SkipOnlyIfTaskExecuter.execute(SkipOnlyIfTaskExecuter.java:54)
	at org.gradle.api.internal.tasks.execution.ExecuteAtMostOnceTaskExecuter.execute(ExecuteAtMostOnceTaskExecuter.java:43)
	at org.gradle.api.internal.tasks.execution.CatchExceptionTaskExecuter.execute(CatchExceptionTaskExecuter.java:34)
	at org.gradle.execution.taskgraph.DefaultTaskGraphExecuter$EventFiringTaskWorker$1.run(DefaultTaskGraphExecuter.java:256)
	at org.gradle.internal.operations.DefaultBuildOperationExecutor$RunnableBuildOperationWorker.execute(DefaultBuildOperationExecutor.java:317)
	at org.gradle.internal.operations.DefaultBuildOperationExecutor$RunnableBuildOperationWorker.execute(DefaultBuildOperationExecutor.java:309)
	at org.gradle.internal.operations.DefaultBuildOperationExecutor.execute(DefaultBuildOperationExecutor.java:185)
	at org.gradle.internal.operations.DefaultBuildOperationExecutor.run(DefaultBuildOperationExecutor.java:97)
	at org.gradle.internal.operations.DelegatingBuildOperationExecutor.run(DelegatingBuildOperationExecutor.java:31)
	at org.gradle.execution.taskgraph.DefaultTaskGraphExecuter$EventFiringTaskWorker.execute(DefaultTaskGraphExecuter.java:249)
	at org.gradle.execution.taskgraph.DefaultTaskGraphExecuter$EventFiringTaskWorker.execute(DefaultTaskGraphExecuter.java:238)
	at org.gradle.execution.taskgraph.DefaultTaskPlanExecutor$TaskExecutorWorker$1.execute(DefaultTaskPlanExecutor.java:104)
	at org.gradle.execution.taskgraph.DefaultTaskPlanExecutor$TaskExecutorWorker$1.execute(DefaultTaskPlanExecutor.java:98)
	at org.gradle.execution.taskgraph.DefaultTaskExecutionPlan.execute(DefaultTaskExecutionPlan.java:663)
	at org.gradle.execution.taskgraph.DefaultTaskExecutionPlan.executeWithTask(DefaultTaskExecutionPlan.java:596)
	at org.gradle.execution.taskgraph.DefaultTaskPlanExecutor$TaskExecutorWorker.run(DefaultTaskPlanExecutor.java:98)
	at org.gradle.internal.concurrent.ExecutorPolicy$CatchAndRecordFailures.onExecute(ExecutorPolicy.java:63)
	at org.gradle.internal.concurrent.ManagedExecutorImpl$1.run(ManagedExecutorImpl.java:46)
	at org.gradle.internal.concurrent.ThreadFactoryImpl$ManagedThreadRunnable.run(ThreadFactoryImpl.java:55)
Caused by: org.gradle.api.GradleException: There were failing tests. See the report at: file://<https://builds.apache.org/job/beam_PerformanceTests_MongoDBIO_IT/ws/src/sdks/java/io/mongodb/build/reports/tests/integrationTest/index.html>
	at org.gradle.api.tasks.testing.AbstractTestTask.handleTestFailures(AbstractTestTask.java:612)
	at org.gradle.api.tasks.testing.AbstractTestTask.executeTests(AbstractTestTask.java:484)
	at org.gradle.api.tasks.testing.Test.executeTests(Test.java:583)
	at org.gradle.internal.reflect.JavaMethod.invoke(JavaMethod.java:73)
	at org.gradle.api.internal.project.taskfactory.StandardTaskAction.doExecute(StandardTaskAction.java:46)
	at org.gradle.api.internal.project.taskfactory.StandardTaskAction.execute(StandardTaskAction.java:39)
	at org.gradle.api.internal.project.taskfactory.StandardTaskAction.execute(StandardTaskAction.java:26)
	at org.gradle.api.internal.AbstractTask$TaskActionWrapper.execute(AbstractTask.java:794)
	at org.gradle.api.internal.AbstractTask$TaskActionWrapper.execute(AbstractTask.java:761)
	at org.gradle.api.internal.tasks.execution.ExecuteActionsTaskExecuter$1.run(ExecuteActionsTaskExecuter.java:124)
	at org.gradle.internal.operations.DefaultBuildOperationExecutor$RunnableBuildOperationWorker.execute(DefaultBuildOperationExecutor.java:317)
	at org.gradle.internal.operations.DefaultBuildOperationExecutor$RunnableBuildOperationWorker.execute(DefaultBuildOperationExecutor.java:309)
	at org.gradle.internal.operations.DefaultBuildOperationExecutor.execute(DefaultBuildOperationExecutor.java:185)
	at org.gradle.internal.operations.DefaultBuildOperationExecutor.run(DefaultBuildOperationExecutor.java:97)
	at org.gradle.internal.operations.DelegatingBuildOperationExecutor.run(DelegatingBuildOperationExecutor.java:31)
	at org.gradle.api.internal.tasks.execution.ExecuteActionsTaskExecuter.executeAction(ExecuteActionsTaskExecuter.java:113)
	at org.gradle.api.internal.tasks.execution.ExecuteActionsTaskExecuter.executeActions(ExecuteActionsTaskExecuter.java:95)
	... 31 more


* Get more help at https://help.gradle.org

2018-06-07 15:46:22,086 5aed3ea5 MainThread beam_integration_benchmark(1/1) ERROR    Error during benchmark beam_integration_benchmark
Traceback (most recent call last):
  File "<https://builds.apache.org/job/beam_PerformanceTests_MongoDBIO_IT/ws/PerfKitBenchmarker/perfkitbenchmarker/pkb.py",> line 667, in RunBenchmark
    DoRunPhase(spec, collector, detailed_timer)
  File "<https://builds.apache.org/job/beam_PerformanceTests_MongoDBIO_IT/ws/PerfKitBenchmarker/perfkitbenchmarker/pkb.py",> line 547, in DoRunPhase
    samples = spec.BenchmarkRun(spec)
  File "<https://builds.apache.org/job/beam_PerformanceTests_MongoDBIO_IT/ws/PerfKitBenchmarker/perfkitbenchmarker/linux_benchmarks/beam_integration_benchmark.py",> line 159, in Run
    job_type=job_type)
  File "<https://builds.apache.org/job/beam_PerformanceTests_MongoDBIO_IT/ws/PerfKitBenchmarker/perfkitbenchmarker/providers/gcp/gcp_dpb_dataflow.py",> line 90, in SubmitJob
    assert retcode == 0, "Integration Test Failed."
AssertionError: Integration Test Failed.
2018-06-07 15:46:22,087 5aed3ea5 MainThread beam_integration_benchmark(1/1) INFO     Cleaning up benchmark beam_integration_benchmark
2018-06-07 15:46:22,088 5aed3ea5 MainThread beam_integration_benchmark(1/1) INFO     Running: kubectl --kubeconfig=<https://builds.apache.org/job/beam_PerformanceTests_MongoDBIO_IT/ws/config-beam-performancetests-mongodbio-it-278> delete -f <https://builds.apache.org/job/beam_PerformanceTests_MongoDBIO_IT/ws/src/.test-infra/kubernetes/mongodb/load-balancer/mongo.yml> --ignore-not-found
2018-06-07 15:46:22,892 5aed3ea5 MainThread beam_integration_benchmark(1/1) ERROR    Exception running benchmark
Traceback (most recent call last):
  File "<https://builds.apache.org/job/beam_PerformanceTests_MongoDBIO_IT/ws/PerfKitBenchmarker/perfkitbenchmarker/pkb.py",> line 801, in RunBenchmarkTask
    RunBenchmark(spec, collector)
  File "<https://builds.apache.org/job/beam_PerformanceTests_MongoDBIO_IT/ws/PerfKitBenchmarker/perfkitbenchmarker/pkb.py",> line 667, in RunBenchmark
    DoRunPhase(spec, collector, detailed_timer)
  File "<https://builds.apache.org/job/beam_PerformanceTests_MongoDBIO_IT/ws/PerfKitBenchmarker/perfkitbenchmarker/pkb.py",> line 547, in DoRunPhase
    samples = spec.BenchmarkRun(spec)
  File "<https://builds.apache.org/job/beam_PerformanceTests_MongoDBIO_IT/ws/PerfKitBenchmarker/perfkitbenchmarker/linux_benchmarks/beam_integration_benchmark.py",> line 159, in Run
    job_type=job_type)
  File "<https://builds.apache.org/job/beam_PerformanceTests_MongoDBIO_IT/ws/PerfKitBenchmarker/perfkitbenchmarker/providers/gcp/gcp_dpb_dataflow.py",> line 90, in SubmitJob
    assert retcode == 0, "Integration Test Failed."
AssertionError: Integration Test Failed.
2018-06-07 15:46:22,893 5aed3ea5 MainThread beam_integration_benchmark(1/1) ERROR    Benchmark 1/1 beam_integration_benchmark (UID: beam_integration_benchmark0) failed. Execution will continue.
2018-06-07 15:46:22,947 5aed3ea5 MainThread INFO     Benchmark run statuses:
---------------------------------------------------------------------------------
Name                        UID                          Status  Failed Substatus
---------------------------------------------------------------------------------
beam_integration_benchmark  beam_integration_benchmark0  FAILED                  
---------------------------------------------------------------------------------
Success rate: 0.00% (0/1)
2018-06-07 15:46:22,948 5aed3ea5 MainThread INFO     Complete logs can be found at: <https://builds.apache.org/job/beam_PerformanceTests_MongoDBIO_IT/ws/runs/5aed3ea5/pkb.log>
2018-06-07 15:46:22,948 5aed3ea5 MainThread INFO     Completion statuses can be found at: <https://builds.apache.org/job/beam_PerformanceTests_MongoDBIO_IT/ws/runs/5aed3ea5/completion_statuses.json>
Build step 'Execute shell' marked build as failure

Jenkins build is back to normal : beam_PerformanceTests_MongoDBIO_IT #279

Posted by Apache Jenkins Server <je...@builds.apache.org>.
See <https://builds.apache.org/job/beam_PerformanceTests_MongoDBIO_IT/279/display/redirect>