You are viewing a plain text version of this content. The canonical link for it is here.
Posted to builds@cassandra.apache.org by Apache Jenkins Server <je...@builds.apache.org> on 2021/09/24 19:28:53 UTC
Build complete: Cassandra-4.0 #226 [UNSTABLE]
77144aa472df87ac9d79012f097c5b1a868d8803
-------------------------------------------------------------------------------
Build Cassandra-4.0 #226 Still Unstable
URL: https://ci-cassandra.apache.org/job/Cassandra-4.0/226/
-------------------------------------------------------------------------------
Changes:
[a.penya.garcia] Fix flaky ViewTest#testTruncateWhileBuilding
-------------------------------------------------------------------------------
Failed Tests:
6 tests failed.
FAILED: dtest-upgrade.upgrade_tests.cql_tests.TestCQLNodes3RF3_Upgrade_current_4_0_x_To_indev_4_0_x.test_static_cf
FAILED: org.apache.cassandra.utils.LongBTreeTest.testRandomRangeAndBatches
FAILED: org.apache.cassandra.utils.memory.LongBufferPoolTest.testPoolAllocateWithRecyclePartially
FAILED: dtest-novnode.scrub_test.TestScrubIndexes.test_scrub_collections_table
FAILED: dtest-offheap.scrub_test.TestScrubIndexes.test_scrub_collections_table
FAILED: dtest.scrub_test.TestScrubIndexes.test_scrub_collections_table
-------------------------------------------------------------------------------
For complete test report and logs see https://nightlies.apache.org/cassandra/Cassandra-4.0/226/