You are viewing a plain text version of this content. The canonical link for it is here.
Posted to commits@struts.apache.org by Atlassian Open Source Bamboo <ba...@apache.org> on 2009/08/11 00:02:50 UTC
[OSS Bamboo] Struts 2 SVN - Main Build (Java 6) build 922 has
FAILED (0 tests failed). Change made by Musachy Barroso
-----------------------------------------------------------
STRUTS-MAINJ6-922 failed.
-----------------------------------------------------------
Code has been updated by Musachy Barroso.
No failed tests found, a possible compilation error.
http://opensource.bamboo.atlassian.com/browse/STRUTS-MAINJ6-922/
--------------
Code Changes
--------------
Musachy Barroso (802937):
>WW-3166 Prevent NPE when there is a null element in an array
>
>thanks to Zoran Avtarovski for the patch
--------------
Error Summary
--------------
[INFO] ------------------------------------------------------------------------
[ERROR] BUILD FAILURE
[INFO] ------------------------------------------------------------------------
[INFO] Compilation failure
/opt/j2ee/domains/bamboo.atlassian.com/opensource/home/xml-data/build-dir/STRUTS-MAINJ6/plugins/junit/src/main/java/org/apache/struts2/StrutsTestCase.java:[200,22] cannot access javax.servlet.jsp.PageContext
class file for javax.servlet.jsp.PageContext not found
pageContext = new MockPageContext(servletContext, request, response);
/opt/j2ee/domains/bamboo.atlassian.com/opensource/home/xml-data/build-dir/STRUTS-MAINJ6/plugins/junit/src/main/java/org/apache/struts2/StrutsTestCase.java:[200,22] cannot access javax.servlet.jsp.PageContext
class file for javax.servlet.jsp.PageContext not found
pageContext = new MockPageContext(servletContext, request, response);
[INFO] ------------------------------------------------------------------------
[INFO] For more information, run Maven with the -e switch
--
This message is automatically generated by Atlassian Bamboo