You are viewing a plain text version of this content. The canonical link for it is here.
Posted to dev@brooklyn.apache.org by Apache Jenkins Server <je...@builds.apache.org> on 2018/10/08 06:48:09 UTC

Build failed in Jenkins: brooklyn-master-build-docker #768

See <https://builds.apache.org/job/brooklyn-master-build-docker/768/display/redirect>

------------------------------------------
[...truncated 5.70 MB...]
2018-10-08 06:47:45,174 INFO  - TESTNG INVOKING: "Surefire test" - org.apache.brooklyn.core.objs.ConstraintSerializationTest.testAltPred()
2018-10-08 06:47:45,174 INFO  - TESTNG PASSED: "Surefire test" - org.apache.brooklyn.core.objs.ConstraintSerializationTest.testAltPred() finished in 0 ms
2018-10-08 06:47:45,174 INFO  - TESTNG INVOKING CONFIGURATION: "Surefire test" - @AfterMethod org.apache.brooklyn.core.test.BrooklynMgmtUnitTestSupport.tearDown()
2018-10-08 06:47:45,175 INFO  - TESTNG PASSED CONFIGURATION: "Surefire test" - @AfterMethod org.apache.brooklyn.core.test.BrooklynMgmtUnitTestSupport.tearDown() finished in 1 ms
2018-10-08 06:47:45,175 INFO  - TESTNG INVOKING CONFIGURATION: "Surefire test" - @BeforeMethod org.apache.brooklyn.core.test.BrooklynMgmtUnitTestSupport.setUp()
2018-10-08 06:47:45,175 INFO  - Added external config supplier named 'brooklyn-demo-sample': org.apache.brooklyn.core.config.external.InPlaceExternalConfigSupplier@37b60222
2018-10-08 06:47:45,175 INFO  - TESTNG PASSED CONFIGURATION: "Surefire test" - @BeforeMethod org.apache.brooklyn.core.test.BrooklynMgmtUnitTestSupport.setUp() finished in 0 ms
2018-10-08 06:47:45,175 INFO  - TESTNG INVOKING: "Surefire test" - org.apache.brooklyn.core.objs.ConstraintSerializationTest.testAnd()
2018-10-08 06:47:45,176 INFO  - TESTNG PASSED: "Surefire test" - org.apache.brooklyn.core.objs.ConstraintSerializationTest.testAnd() finished in 1 ms
2018-10-08 06:47:45,176 INFO  - TESTNG INVOKING CONFIGURATION: "Surefire test" - @AfterMethod org.apache.brooklyn.core.test.BrooklynMgmtUnitTestSupport.tearDown()
2018-10-08 06:47:45,176 INFO  - TESTNG PASSED CONFIGURATION: "Surefire test" - @AfterMethod org.apache.brooklyn.core.test.BrooklynMgmtUnitTestSupport.tearDown() finished in 0 ms
2018-10-08 06:47:45,176 INFO  - TESTNG INVOKING CONFIGURATION: "Surefire test" - @BeforeMethod org.apache.brooklyn.core.test.BrooklynMgmtUnitTestSupport.setUp()
2018-10-08 06:47:45,177 INFO  - Added external config supplier named 'brooklyn-demo-sample': org.apache.brooklyn.core.config.external.InPlaceExternalConfigSupplier@4467e3b4
2018-10-08 06:47:45,177 INFO  - TESTNG PASSED CONFIGURATION: "Surefire test" - @BeforeMethod org.apache.brooklyn.core.test.BrooklynMgmtUnitTestSupport.setUp() finished in 1 ms
2018-10-08 06:47:45,177 INFO  - TESTNG INVOKING: "Surefire test" - org.apache.brooklyn.core.objs.ConstraintSerializationTest.testEmpty()
2018-10-08 06:47:45,177 INFO  - TESTNG PASSED: "Surefire test" - org.apache.brooklyn.core.objs.ConstraintSerializationTest.testEmpty() finished in 0 ms
2018-10-08 06:47:45,177 INFO  - TESTNG INVOKING CONFIGURATION: "Surefire test" - @AfterMethod org.apache.brooklyn.core.test.BrooklynMgmtUnitTestSupport.tearDown()
2018-10-08 06:47:45,178 INFO  - TESTNG PASSED CONFIGURATION: "Surefire test" - @AfterMethod org.apache.brooklyn.core.test.BrooklynMgmtUnitTestSupport.tearDown() finished in 1 ms
2018-10-08 06:47:45,178 INFO  - TESTNG INVOKING CONFIGURATION: "Surefire test" - @BeforeMethod org.apache.brooklyn.core.test.BrooklynMgmtUnitTestSupport.setUp()
2018-10-08 06:47:45,178 INFO  - Added external config supplier named 'brooklyn-demo-sample': org.apache.brooklyn.core.config.external.InPlaceExternalConfigSupplier@ab289be
2018-10-08 06:47:45,178 INFO  - TESTNG PASSED CONFIGURATION: "Surefire test" - @BeforeMethod org.apache.brooklyn.core.test.BrooklynMgmtUnitTestSupport.setUp() finished in 0 ms
2018-10-08 06:47:45,178 INFO  - TESTNG INVOKING: "Surefire test" - org.apache.brooklyn.core.objs.ConstraintSerializationTest.testFlattens()
2018-10-08 06:47:45,178 INFO  - TESTNG PASSED: "Surefire test" - org.apache.brooklyn.core.objs.ConstraintSerializationTest.testFlattens() finished in 0 ms
2018-10-08 06:47:45,178 INFO  - TESTNG INVOKING CONFIGURATION: "Surefire test" - @AfterMethod org.apache.brooklyn.core.test.BrooklynMgmtUnitTestSupport.tearDown()
2018-10-08 06:47:45,179 INFO  - TESTNG PASSED CONFIGURATION: "Surefire test" - @AfterMethod org.apache.brooklyn.core.test.BrooklynMgmtUnitTestSupport.tearDown() finished in 1 ms
2018-10-08 06:47:45,179 INFO  - TESTNG INVOKING CONFIGURATION: "Surefire test" - @BeforeMethod org.apache.brooklyn.core.test.BrooklynMgmtUnitTestSupport.setUp()
2018-10-08 06:47:45,179 INFO  - Added external config supplier named 'brooklyn-demo-sample': org.apache.brooklyn.core.config.external.InPlaceExternalConfigSupplier@31bd8f1f
2018-10-08 06:47:45,179 INFO  - TESTNG PASSED CONFIGURATION: "Surefire test" - @BeforeMethod org.apache.brooklyn.core.test.BrooklynMgmtUnitTestSupport.setUp() finished in 0 ms
2018-10-08 06:47:45,179 INFO  - TESTNG INVOKING: "Surefire test" - org.apache.brooklyn.core.objs.ConstraintSerializationTest.testInteresting()
2018-10-08 06:47:45,180 INFO  - TESTNG PASSED: "Surefire test" - org.apache.brooklyn.core.objs.ConstraintSerializationTest.testInteresting() finished in 1 ms
2018-10-08 06:47:45,180 INFO  - TESTNG INVOKING CONFIGURATION: "Surefire test" - @AfterMethod org.apache.brooklyn.core.test.BrooklynMgmtUnitTestSupport.tearDown()
2018-10-08 06:47:45,180 INFO  - TESTNG PASSED CONFIGURATION: "Surefire test" - @AfterMethod org.apache.brooklyn.core.test.BrooklynMgmtUnitTestSupport.tearDown() finished in 0 ms
2018-10-08 06:47:45,180 INFO  - TESTNG INVOKING CONFIGURATION: "Surefire test" - @BeforeMethod org.apache.brooklyn.core.test.BrooklynMgmtUnitTestSupport.setUp()
2018-10-08 06:47:45,180 INFO  - Added external config supplier named 'brooklyn-demo-sample': org.apache.brooklyn.core.config.external.InPlaceExternalConfigSupplier@2ff2bf6b
2018-10-08 06:47:45,180 INFO  - TESTNG PASSED CONFIGURATION: "Surefire test" - @BeforeMethod org.apache.brooklyn.core.test.BrooklynMgmtUnitTestSupport.setUp() finished in 0 ms
2018-10-08 06:47:45,181 INFO  - TESTNG INVOKING: "Surefire test" - org.apache.brooklyn.core.objs.ConstraintSerializationTest.testNestedAndIsSimplified()
2018-10-08 06:47:45,181 INFO  - TESTNG PASSED: "Surefire test" - org.apache.brooklyn.core.objs.ConstraintSerializationTest.testNestedAndIsSimplified() finished in 0 ms
2018-10-08 06:47:45,181 INFO  - TESTNG INVOKING CONFIGURATION: "Surefire test" - @AfterMethod org.apache.brooklyn.core.test.BrooklynMgmtUnitTestSupport.tearDown()
2018-10-08 06:47:45,182 INFO  - TESTNG PASSED CONFIGURATION: "Surefire test" - @AfterMethod org.apache.brooklyn.core.test.BrooklynMgmtUnitTestSupport.tearDown() finished in 1 ms
2018-10-08 06:47:45,182 INFO  - TESTNG INVOKING CONFIGURATION: "Surefire test" - @BeforeMethod org.apache.brooklyn.core.test.BrooklynMgmtUnitTestSupport.setUp()
2018-10-08 06:47:45,182 INFO  - Added external config supplier named 'brooklyn-demo-sample': org.apache.brooklyn.core.config.external.InPlaceExternalConfigSupplier@3986d67f
2018-10-08 06:47:45,182 INFO  - TESTNG PASSED CONFIGURATION: "Surefire test" - @BeforeMethod org.apache.brooklyn.core.test.BrooklynMgmtUnitTestSupport.setUp() finished in 0 ms
2018-10-08 06:47:45,182 INFO  - TESTNG INVOKING: "Surefire test" - org.apache.brooklyn.core.objs.ConstraintSerializationTest.testOr()
2018-10-08 06:47:45,183 INFO  - TESTNG PASSED: "Surefire test" - org.apache.brooklyn.core.objs.ConstraintSerializationTest.testOr() finished in 1 ms
2018-10-08 06:47:45,183 INFO  - TESTNG INVOKING CONFIGURATION: "Surefire test" - @AfterMethod org.apache.brooklyn.core.test.BrooklynMgmtUnitTestSupport.tearDown()
2018-10-08 06:47:45,183 INFO  - TESTNG PASSED CONFIGURATION: "Surefire test" - @AfterMethod org.apache.brooklyn.core.test.BrooklynMgmtUnitTestSupport.tearDown() finished in 0 ms
2018-10-08 06:47:45,183 INFO  - TESTNG INVOKING CONFIGURATION: "Surefire test" - @BeforeMethod org.apache.brooklyn.core.test.BrooklynMgmtUnitTestSupport.setUp()
2018-10-08 06:47:45,183 INFO  - Added external config supplier named 'brooklyn-demo-sample': org.apache.brooklyn.core.config.external.InPlaceExternalConfigSupplier@25b7bdbc
2018-10-08 06:47:45,184 INFO  - TESTNG PASSED CONFIGURATION: "Surefire test" - @BeforeMethod org.apache.brooklyn.core.test.BrooklynMgmtUnitTestSupport.setUp() finished in 1 ms
2018-10-08 06:47:45,184 INFO  - TESTNG INVOKING: "Surefire test" - org.apache.brooklyn.core.objs.ConstraintSerializationTest.testSimple()
2018-10-08 06:47:45,185 INFO  - TESTNG PASSED: "Surefire test" - org.apache.brooklyn.core.objs.ConstraintSerializationTest.testSimple() finished in 1 ms
2018-10-08 06:47:45,185 INFO  - TESTNG INVOKING CONFIGURATION: "Surefire test" - @AfterMethod org.apache.brooklyn.core.test.BrooklynMgmtUnitTestSupport.tearDown()
2018-10-08 06:47:45,185 INFO  - TESTNG PASSED CONFIGURATION: "Surefire test" - @AfterMethod org.apache.brooklyn.core.test.BrooklynMgmtUnitTestSupport.tearDown() finished in 0 ms
2018-10-08 06:47:45,186 INFO  - TESTNG INVOKING CONFIGURATION: "Surefire test" - @BeforeMethod org.apache.brooklyn.core.test.BrooklynMgmtUnitTestSupport.setUp()
2018-10-08 06:47:45,186 INFO  - Added external config supplier named 'brooklyn-demo-sample': org.apache.brooklyn.core.config.external.InPlaceExternalConfigSupplier@395512d3
2018-10-08 06:47:45,186 INFO  - TESTNG PASSED CONFIGURATION: "Surefire test" - @BeforeMethod org.apache.brooklyn.core.test.BrooklynMgmtUnitTestSupport.setUp() finished in 0 ms
2018-10-08 06:47:45,186 INFO  - TESTNG INVOKING: "Surefire test" - org.apache.brooklyn.core.objs.ConstraintSerializationTest.testSimpleEquivalents()
2018-10-08 06:47:45,215 INFO  - TESTNG PASSED: "Surefire test" - org.apache.brooklyn.core.objs.ConstraintSerializationTest.testSimpleEquivalents() finished in 29 ms
2018-10-08 06:47:45,215 INFO  - TESTNG INVOKING CONFIGURATION: "Surefire test" - @AfterMethod org.apache.brooklyn.core.test.BrooklynMgmtUnitTestSupport.tearDown()
2018-10-08 06:47:45,216 INFO  - TESTNG PASSED CONFIGURATION: "Surefire test" - @AfterMethod org.apache.brooklyn.core.test.BrooklynMgmtUnitTestSupport.tearDown() finished in 1 ms
2018-10-08 06:47:45,216 INFO  - TESTNG INVOKING CONFIGURATION: "Surefire test" - @BeforeMethod org.apache.brooklyn.core.objs.proxy.ClassLoaderCacheTest.setUp()
2018-10-08 06:47:45,217 INFO  - TESTNG PASSED CONFIGURATION: "Surefire test" - @BeforeMethod org.apache.brooklyn.core.objs.proxy.ClassLoaderCacheTest.setUp() finished in 1 ms
2018-10-08 06:47:45,217 INFO  - TESTNG INVOKING: "Surefire test" - org.apache.brooklyn.core.objs.proxy.ClassLoaderCacheTest.testDifferentLoader()
2018-10-08 06:47:45,218 INFO  - TESTNG PASSED: "Surefire test" - org.apache.brooklyn.core.objs.proxy.ClassLoaderCacheTest.testDifferentLoader() finished in 1 ms
2018-10-08 06:47:45,218 INFO  - TESTNG INVOKING CONFIGURATION: "Surefire test" - @BeforeMethod org.apache.brooklyn.core.objs.proxy.ClassLoaderCacheTest.setUp()
2018-10-08 06:47:45,219 INFO  - TESTNG PASSED CONFIGURATION: "Surefire test" - @BeforeMethod org.apache.brooklyn.core.objs.proxy.ClassLoaderCacheTest.setUp() finished in 0 ms
2018-10-08 06:47:45,219 INFO  - TESTNG INVOKING: "Surefire test" - org.apache.brooklyn.core.objs.proxy.ClassLoaderCacheTest.testSameLoader()
2018-10-08 06:47:45,219 INFO  - TESTNG PASSED: "Surefire test" - org.apache.brooklyn.core.objs.proxy.ClassLoaderCacheTest.testSameLoader() finished in 0 ms
2018-10-08 06:47:45,219 INFO  - TESTNG INVOKING CONFIGURATION: "Surefire test" - @BeforeMethod org.apache.brooklyn.core.test.BrooklynMgmtUnitTestSupport.setUp()
2018-10-08 06:47:45,220 INFO  - Added external config supplier named 'brooklyn-demo-sample': org.apache.brooklyn.core.config.external.InPlaceExternalConfigSupplier@779fff61
2018-10-08 06:47:45,220 INFO  - TESTNG PASSED CONFIGURATION: "Surefire test" - @BeforeMethod org.apache.brooklyn.core.test.BrooklynMgmtUnitTestSupport.setUp() finished in 1 ms
2018-10-08 06:47:45,220 INFO  - TESTNG INVOKING: "Surefire test" - org.apache.brooklyn.core.objs.BasicSpecParameterFromClassTest.testConfigInImplVisible()
2018-10-08 06:47:45,226 INFO  - TESTNG PASSED: "Surefire test" - org.apache.brooklyn.core.objs.BasicSpecParameterFromClassTest.testConfigInImplVisible() finished in 6 ms
2018-10-08 06:47:45,226 INFO  - TESTNG INVOKING CONFIGURATION: "Surefire test" - @AfterMethod org.apache.brooklyn.core.test.BrooklynMgmtUnitTestSupport.tearDown()
2018-10-08 06:47:45,227 INFO  - TESTNG PASSED CONFIGURATION: "Surefire test" - @AfterMethod org.apache.brooklyn.core.test.BrooklynMgmtUnitTestSupport.tearDown() finished in 1 ms
2018-10-08 06:47:45,227 INFO  - TESTNG INVOKING CONFIGURATION: "Surefire test" - @BeforeMethod org.apache.brooklyn.core.test.BrooklynMgmtUnitTestSupport.setUp()
2018-10-08 06:47:45,227 INFO  - Added external config supplier named 'brooklyn-demo-sample': org.apache.brooklyn.core.config.external.InPlaceExternalConfigSupplier@49fcb93c
2018-10-08 06:47:45,228 INFO  - TESTNG PASSED CONFIGURATION: "Surefire test" - @BeforeMethod org.apache.brooklyn.core.test.BrooklynMgmtUnitTestSupport.setUp() finished in 1 ms
2018-10-08 06:47:45,228 INFO  - TESTNG INVOKING: "Surefire test" - org.apache.brooklyn.core.objs.BasicSpecParameterFromClassTest.testDebug()
[BasicSpecParameter{label=application.stop.shouldDestroy, pinned=false, type=application.stop.shouldDestroy[ConfigKey:java.lang.Boolean]}, BasicSpecParameter{label=defaultDisplayName, pinned=false, type=defaultDisplayName[ConfigKey:java.lang.String]}, BasicSpecParameter{label=latch.start, pinned=false, type=latch.start[ConfigKey:java.lang.Boolean]}, BasicSpecParameter{label=quorum.running, pinned=false, type=quorum.running[ConfigKey:org.apache.brooklyn.util.collections.QuorumCheck]}, BasicSpecParameter{label=quorum.up, pinned=false, type=quorum.up[ConfigKey:org.apache.brooklyn.util.collections.QuorumCheck]}]
2018-10-08 06:47:45,229 INFO  - TESTNG PASSED: "Surefire test" - org.apache.brooklyn.core.objs.BasicSpecParameterFromClassTest.testDebug() finished in 1 ms
2018-10-08 06:47:45,229 INFO  - TESTNG INVOKING CONFIGURATION: "Surefire test" - @AfterMethod org.apache.brooklyn.core.test.BrooklynMgmtUnitTestSupport.tearDown()
2018-10-08 06:47:45,230 INFO  - TESTNG PASSED CONFIGURATION: "Surefire test" - @AfterMethod org.apache.brooklyn.core.test.BrooklynMgmtUnitTestSupport.tearDown() finished in 1 ms
2018-10-08 06:47:45,230 INFO  - TESTNG INVOKING CONFIGURATION: "Surefire test" - @BeforeMethod org.apache.brooklyn.core.test.BrooklynMgmtUnitTestSupport.setUp()
2018-10-08 06:47:45,231 INFO  - Added external config supplier named 'brooklyn-demo-sample': org.apache.brooklyn.core.config.external.InPlaceExternalConfigSupplier@500da926
2018-10-08 06:47:45,231 INFO  - TESTNG PASSED CONFIGURATION: "Surefire test" - @BeforeMethod org.apache.brooklyn.core.test.BrooklynMgmtUnitTestSupport.setUp() finished in 1 ms
2018-10-08 06:47:45,231 INFO  - TESTNG INVOKING: "Surefire test" - org.apache.brooklyn.core.objs.BasicSpecParameterFromClassTest.testFullDefinition()
2018-10-08 06:47:45,233 INFO  - TESTNG PASSED: "Surefire test" - org.apache.brooklyn.core.objs.BasicSpecParameterFromClassTest.testFullDefinition() finished in 2 ms
2018-10-08 06:47:45,233 INFO  - TESTNG INVOKING CONFIGURATION: "Surefire test" - @AfterMethod org.apache.brooklyn.core.test.BrooklynMgmtUnitTestSupport.tearDown()
2018-10-08 06:47:45,234 INFO  - TESTNG PASSED CONFIGURATION: "Surefire test" - @AfterMethod org.apache.brooklyn.core.test.BrooklynMgmtUnitTestSupport.tearDown() finished in 1 ms
2018-10-08 06:47:45,541 INFO  - TESTNG 
===============================================
    Surefire test
    Tests run: 2346, Failures: 1, Skips: 0
===============================================
[GC (Allocation Failure)  431938K->251080K(747520K), 0.0269748 secs]
[GC (Allocation Failure)  436424K->248279K(751104K), 0.0589412 secs]
[GC (Allocation Failure)  438592K->249778K(750080K), 0.0131454 secs]
[GC (Allocation Failure)  440242K->249371K(753152K), 0.0063861 secs]
[GC (Allocation Failure)  443931K->249243K(752128K), 0.0400014 secs]
[GC (Allocation Failure)  443803K->249147K(755712K), 0.0092171 secs]
[GC (Allocation Failure)  448315K->249219K(754176K), 0.0206458 secs]
Tests run: 2346, Failures: 1, Errors: 0, Skipped: 0, Time elapsed: 236.064 sec <<< FAILURE! - in TestSuite
testUnsubmittedTaskWithExecutionContextTimesOutWhenImmediate(org.apache.brooklyn.util.core.task.ValueResolverTest)  Time elapsed: 0.016 sec  <<< FAILURE!
java.lang.AssertionError: result=Present[value=Present[value=foo]] expected [true] but found [false]
	at org.apache.brooklyn.util.core.task.ValueResolverTest.testUnsubmittedTaskWithExecutionContextTimesOutWhenImmediate(ValueResolverTest.java:160)

2018-10-08 06:47:49,623 INFO  - Brooklyn shutdown: stopping entities [TestEntityImpl{id=yyh9tgugub}, TestEntityImpl{id=ieysb5haud}, BlockingEntityImpl{id=tfikspmz3z}]

Results :

Failed tests: 
  ValueResolverTest.testUnsubmittedTaskWithExecutionContextTimesOutWhenImmediate:160 result=Present[value=Present[value=foo]] expected [true] but found [false]

Tests run: 2346, Failures: 1, Errors: 0, Skipped: 0

[INFO] ------------------------------------------------------------------------
[INFO] Reactor Summary:
[INFO] 
[INFO] Brooklyn Server Root ............................... SUCCESS [  5.146 s]
[INFO] Brooklyn Parent Project ............................ SUCCESS [  6.629 s]
[INFO] Brooklyn Test Support Utilities .................... SUCCESS [  9.569 s]
[INFO] Brooklyn Logback Includable Configuration .......... SUCCESS [  0.550 s]
[INFO] Brooklyn Common Utilities .......................... SUCCESS [ 34.378 s]
[INFO] Brooklyn API ....................................... SUCCESS [  2.161 s]
[INFO] CAMP Server Parent Project ......................... SUCCESS [  0.148 s]
[INFO] CAMP Base .......................................... SUCCESS [  4.272 s]
[INFO] Brooklyn Test Support .............................. SUCCESS [  1.378 s]
[INFO] Brooklyn REST Swagger Apidoc Utilities ............. SUCCESS [ 14.337 s]
[INFO] Brooklyn Logback Configuration ..................... SUCCESS [  0.272 s]
[INFO] CAMP Server ........................................ SUCCESS [ 13.628 s]
[INFO] Brooklyn Felix Runtime ............................. SUCCESS [  4.121 s]
[INFO] Brooklyn Groovy Utilities .......................... SUCCESS [  4.850 s]
[INFO] Brooklyn Core ...................................... FAILURE [05:01 min]
[INFO] Brooklyn Policies .................................. SKIPPED
[INFO] Brooklyn WinRM Software Entities ................... SKIPPED
[INFO] Brooklyn Secure JMXMP Agent ........................ SKIPPED
[INFO] Brooklyn JMX RMI Agent ............................. SKIPPED
[INFO] Brooklyn Jclouds Location Targets .................. SKIPPED
[INFO] Brooklyn Software Base ............................. SKIPPED
[INFO] Brooklyn CAMP ...................................... SKIPPED
[INFO] Brooklyn Launcher Common ........................... SKIPPED
[INFO] Brooklyn REST API .................................. SKIPPED
[INFO] Brooklyn REST Resources ............................ SKIPPED
[INFO] Brooklyn REST Server ............................... SKIPPED
[INFO] Brooklyn Launcher .................................. SKIPPED
[INFO] Brooklyn Container Location Targets ................ SKIPPED
[INFO] Brooklyn Command Line Interface .................... SKIPPED
[INFO] Brooklyn Test Framework ............................ SKIPPED
[INFO] Brooklyn OSGi init ................................. SKIPPED
[INFO] Brooklyn OSGi start ................................ SKIPPED
[INFO] Brooklyn Karaf ..................................... SKIPPED
[INFO] Jetty config fragment .............................. SKIPPED
[INFO] Apache Http Component extension .................... SKIPPED
[INFO] Brooklyn Karaf Features ............................ SKIPPED
[INFO] Brooklyn Karaf Shell Commands ...................... SKIPPED
[INFO] Brooklyn UI :: Parent .............................. SKIPPED
[INFO] Brooklyn UI :: Modularity Server (parent) .......... SKIPPED
[INFO] Brooklyn UI :: Modularity Server :: UI Module API .. SKIPPED
[INFO] Brooklyn UI :: Modularity Server :: UI Module Registry SKIPPED
[INFO] Brooklyn UI :: Modularity Server :: UI Proxy ....... SKIPPED
[INFO] Brooklyn UI :: Modularity Server :: UI Metadata Registry SKIPPED
[INFO] Brooklyn UI :: Modularity Server :: External UI Modules Registration Hooks SKIPPED
[INFO] Brooklyn UI :: Modularity Server :: Features ....... SKIPPED
[INFO] Brooklyn UI :: Modules (parent) .................... SKIPPED
[INFO] Brooklyn UI :: Modules - UI Utils .................. SKIPPED
[INFO] Brooklyn UI :: Modules - Home ...................... SKIPPED
[INFO] Brooklyn UI :: Modules - App inspector ............. SKIPPED
[INFO] Brooklyn UI :: Modules - Blueprint composer ........ SKIPPED
[INFO] Brooklyn UI :: Modules - Blueprint importer ........ SKIPPED
[INFO] Brooklyn UI :: Modules - Catalog ................... SKIPPED
[INFO] Brooklyn UI :: Modules - Location manager .......... SKIPPED
[INFO] Brooklyn UI :: Modules - REST API Docs ............. SKIPPED
[INFO] Brooklyn UI :: Modules - Groovy console ............ SKIPPED
[INFO] Brooklyn UI :: Modules - Logout .................... SKIPPED
[INFO] Brooklyn UI :: Modules - Features .................. SKIPPED
[INFO] Brooklyn UI :: Features ............................ SKIPPED
[INFO] Brooklyn Library Root .............................. SKIPPED
[INFO] Brooklyn CM Chef ................................... SKIPPED
[INFO] Brooklyn CM SaltStack .............................. SKIPPED
[INFO] Brooklyn CM Ansible ................................ SKIPPED
[INFO] Brooklyn CM Integration Root ....................... SKIPPED
[INFO] Brooklyn Network Software Entities ................. SKIPPED
[INFO] Brooklyn OSGi Software Entities .................... SKIPPED
[INFO] Brooklyn Database Software Entities ................ SKIPPED
[INFO] Brooklyn Web App Software Entities ................. SKIPPED
[INFO] Brooklyn Messaging Software Entities ............... SKIPPED
[INFO] Brooklyn NoSQL Data Store Software Entities ........ SKIPPED
[INFO] Brooklyn Monitoring Software Entities .............. SKIPPED
[INFO] Brooklyn Web App Software Entities ................. SKIPPED
[INFO] Brooklyn QA ........................................ SKIPPED
[INFO] Brooklyn Examples Aggregator Project ............... SKIPPED
[INFO] Brooklyn Examples Aggregator Project - Webapps ..... SKIPPED
[INFO] hello-world-webapp Maven Webapp .................... SKIPPED
[INFO] hello-world-sql-webapp Maven Webapp ................ SKIPPED
[INFO] Brooklyn Simple Web Cluster Example ................ SKIPPED
[INFO] Brooklyn Library Karaf integration ................. SKIPPED
[INFO] Brooklyn Library Catalog ........................... SKIPPED
[INFO] Brooklyn Library Karaf Features .................... SKIPPED
[INFO] Brooklyn Client .................................... SKIPPED
[INFO] Brooklyn Client Command Line Interface ............. SKIPPED
[INFO] Brooklyn REST java Client .......................... SKIPPED
[INFO] Brooklyn Downstream Project Parent ................. SKIPPED
[INFO] Brooklyn Dist Root ................................. SKIPPED
[INFO] Brooklyn All Things ................................ SKIPPED
[INFO] Brooklyn Distribution .............................. SKIPPED
[INFO] Brooklyn Karaf Distribution Parent ................. SKIPPED
[INFO] Brooklyn Karaf Server Configuration ................ SKIPPED
[INFO] Brooklyn Dist Karaf Features ....................... SKIPPED
[INFO] Brooklyn Karaf Distribution ........................ SKIPPED
[INFO] Brooklyn Karaf pax-exam itest ...................... SKIPPED
[INFO] Brooklyn Vagrant Getting Started Environment ....... SKIPPED
[INFO] Brooklyn Quick-Start Project Archetype ............. SKIPPED
[INFO] Brooklyn Shared Package Files ...................... SKIPPED
[INFO] Brooklyn RPM Package ............................... SKIPPED
[INFO] Brooklyn DEB Package ............................... SKIPPED
[INFO] Brooklyn Root 1.0.0-SNAPSHOT ....................... SKIPPED
[INFO] ------------------------------------------------------------------------
[INFO] BUILD FAILURE
[INFO] ------------------------------------------------------------------------
[INFO] Total time: 07:04 min
[INFO] Finished at: 2018-10-08T06:47:50Z
[INFO] ------------------------------------------------------------------------
[ERROR] Failed to execute goal org.apache.maven.plugins:maven-surefire-plugin:2.19.1:test (default-test) on project brooklyn-core: There are test failures.
[ERROR] 
[ERROR] Please refer to /usr/build/brooklyn-server/core/target/surefire-reports for the individual test results.
[ERROR] -> [Help 1]
[ERROR] 
[ERROR] To see the full stack trace of the errors, re-run Maven with the -e switch.
[ERROR] Re-run Maven using the -X switch to enable full debug logging.
[ERROR] 
[ERROR] For more information about the errors and possible solutions, please read the following articles:
[ERROR] [Help 1] http://cwiki.apache.org/confluence/display/MAVEN/MojoFailureException
[ERROR] 
[ERROR] After correcting the problems, you can resume the build with the command
[ERROR]   mvn <goals> -rf :brooklyn-core
Build step 'Execute shell' marked build as failure
Recording test results
TestNG Reports Processing: START
Looking for TestNG results report in workspace using pattern: **/testng-results.xml
Saving reports...
Processing '/x1/jenkins/jenkins-home/jobs/brooklyn-master-build-docker/builds/768/testng/testng-results-1.xml'
Processing '/x1/jenkins/jenkins-home/jobs/brooklyn-master-build-docker/builds/768/testng/testng-results-2.xml'
Processing '/x1/jenkins/jenkins-home/jobs/brooklyn-master-build-docker/builds/768/testng/testng-results-3.xml'
Processing '/x1/jenkins/jenkins-home/jobs/brooklyn-master-build-docker/builds/768/testng/testng-results-4.xml'
Processing '/x1/jenkins/jenkins-home/jobs/brooklyn-master-build-docker/builds/768/testng/testng-results-5.xml'
Processing '/x1/jenkins/jenkins-home/jobs/brooklyn-master-build-docker/builds/768/testng/testng-results.xml'
0.033852% of tests failed, which exceeded threshold of 0%. Marking build as UNSTABLE
TestNG Reports Processing: FINISH

Jenkins build is back to normal : brooklyn-master-build-docker #769

Posted by Apache Jenkins Server <je...@builds.apache.org>.
See <https://builds.apache.org/job/brooklyn-master-build-docker/769/display/redirect>