You are viewing a plain text version of this content. The canonical link for it is here.
Posted to issues@tez.apache.org by Apache Jenkins Server <je...@builds.apache.org> on 2015/03/13 19:24:06 UTC
Failed: TEZ-2064 PreCommit Build #301
Jira: https://issues.apache.org/jira/browse/TEZ-2064
Build: https://builds.apache.org/job/PreCommit-TEZ-Build/301/
###################################################################################
########################## LAST 60 LINES OF THE CONSOLE ###########################
[...truncated 2536 lines...]
{color:red}-1 overall{color}. Here are the results of testing the latest attachment
http://issues.apache.org/jira/secure/attachment/12698474/TEZ-2064.2.patch
against master revision a809f96.
{color:green}+1 @author{color}. The patch does not contain any @author tags.
{color:red}-1 tests included{color}. The patch doesn't appear to include any new or modified tests.
Please justify why no new tests are needed for this patch.
Also please list what manual steps were performed to verify this patch.
{color:green}+1 javac{color}. The applied patch does not increase the total number of javac compiler warnings.
{color:green}+1 javadoc{color}. There were no new javadoc warning messages.
{color:green}+1 findbugs{color}. The patch does not introduce any new Findbugs (version 2.0.3) warnings.
{color:green}+1 release audit{color}. The applied patch does not increase the total number of release audit warnings.
{color:red}-1 core tests{color}. The patch failed these unit tests in :
org.apache.tez.test.TestAMRecovery
Test results: https://builds.apache.org/job/PreCommit-TEZ-Build/301//testReport/
Console output: https://builds.apache.org/job/PreCommit-TEZ-Build/301//console
This message is automatically generated.
======================================================================
======================================================================
Adding comment to Jira.
======================================================================
======================================================================
Comment added.
cda39fff49b136e145b567c990028cad4831b8fc logged out
======================================================================
======================================================================
Finished build.
======================================================================
======================================================================
Build step 'Execute shell' marked build as failure
Archiving artifacts
Sending artifact delta relative to PreCommit-TEZ-Build #297
Archived 44 artifacts
Archive block size is 32768
Received 4 blocks and 2588594 bytes
Compression is 4.8%
Took 1.4 sec
[description-setter] Could not determine description.
Recording test results
Email was triggered for: Failure
Sending email for trigger: Failure
###################################################################################
############################## FAILED TESTS (if any) ##############################
1 tests failed.
FAILED: org.apache.tez.test.TestAMRecovery.testVertexCompletelyFinished_Broadcast
Error Message:
File does not exist: /user/jenkins/target/org.apache.tez.test.TestAMRecovery-tmpDir/14711/.tez/application_1426269594468_0007/recovery/2/dag_1426269594468_0007_1.recovery
at org.apache.hadoop.hdfs.server.namenode.INodeFile.valueOf(INodeFile.java:66)
at org.apache.hadoop.hdfs.server.namenode.INodeFile.valueOf(INodeFile.java:56)
at org.apache.hadoop.hdfs.server.namenode.FSNamesystem.getBlockLocationsUpdateTimes(FSNamesystem.java:1891)
at org.apache.hadoop.hdfs.server.namenode.FSNamesystem.getBlockLocationsInt(FSNamesystem.java:1832)
at org.apache.hadoop.hdfs.server.namenode.FSNamesystem.getBlockLocations(FSNamesystem.java:1812)
at org.apache.hadoop.hdfs.server.namenode.FSNamesystem.getBlockLocations(FSNamesystem.java:1784)
at org.apache.hadoop.hdfs.server.namenode.NameNodeRpcServer.getBlockLocations(NameNodeRpcServer.java:542)
at org.apache.hadoop.hdfs.protocolPB.ClientNamenodeProtocolServerSideTranslatorPB.getBlockLocations(ClientNamenodeProtocolServerSideTranslatorPB.java:362)
at org.apache.hadoop.hdfs.protocol.proto.ClientNamenodeProtocolProtos$ClientNamenodeProtocol$2.callBlockingMethod(ClientNamenodeProtocolProtos.java)
at org.apache.hadoop.ipc.ProtobufRpcEngine$Server$ProtoBufRpcInvoker.call(ProtobufRpcEngine.java:619)
at org.apache.hadoop.ipc.RPC$Server.call(RPC.java:962)
at org.apache.hadoop.ipc.Server$Handler$1.run(Server.java:2039)
at org.apache.hadoop.ipc.Server$Handler$1.run(Server.java:2035)
at java.security.AccessController.doPrivileged(Native Method)
at javax.security.auth.Subject.doAs(Subject.java:415)
at org.apache.hadoop.security.UserGroupInformation.doAs(UserGroupInformation.java:1628)
at org.apache.hadoop.ipc.Server$Handler.run(Server.java:2033)
Stack Trace:
java.io.FileNotFoundException: File does not exist: /user/jenkins/target/org.apache.tez.test.TestAMRecovery-tmpDir/14711/.tez/application_1426269594468_0007/recovery/2/dag_1426269594468_0007_1.recovery
at org.apache.hadoop.hdfs.server.namenode.INodeFile.valueOf(INodeFile.java:66)
at org.apache.hadoop.hdfs.server.namenode.INodeFile.valueOf(INodeFile.java:56)
at org.apache.hadoop.hdfs.server.namenode.FSNamesystem.getBlockLocationsUpdateTimes(FSNamesystem.java:1891)
at org.apache.hadoop.hdfs.server.namenode.FSNamesystem.getBlockLocationsInt(FSNamesystem.java:1832)
at org.apache.hadoop.hdfs.server.namenode.FSNamesystem.getBlockLocations(FSNamesystem.java:1812)
at org.apache.hadoop.hdfs.server.namenode.FSNamesystem.getBlockLocations(FSNamesystem.java:1784)
at org.apache.hadoop.hdfs.server.namenode.NameNodeRpcServer.getBlockLocations(NameNodeRpcServer.java:542)
at org.apache.hadoop.hdfs.protocolPB.ClientNamenodeProtocolServerSideTranslatorPB.getBlockLocations(ClientNamenodeProtocolServerSideTranslatorPB.java:362)
at org.apache.hadoop.hdfs.protocol.proto.ClientNamenodeProtocolProtos$ClientNamenodeProtocol$2.callBlockingMethod(ClientNamenodeProtocolProtos.java)
at org.apache.hadoop.ipc.ProtobufRpcEngine$Server$ProtoBufRpcInvoker.call(ProtobufRpcEngine.java:619)
at org.apache.hadoop.ipc.RPC$Server.call(RPC.java:962)
at org.apache.hadoop.ipc.Server$Handler$1.run(Server.java:2039)
at org.apache.hadoop.ipc.Server$Handler$1.run(Server.java:2035)
at java.security.AccessController.doPrivileged(Native Method)
at javax.security.auth.Subject.doAs(Subject.java:415)
at org.apache.hadoop.security.UserGroupInformation.doAs(UserGroupInformation.java:1628)
at org.apache.hadoop.ipc.Server$Handler.run(Server.java:2033)
at org.apache.hadoop.ipc.Client.call(Client.java:1468)
at org.apache.hadoop.ipc.Client.call(Client.java:1399)
at org.apache.hadoop.ipc.ProtobufRpcEngine$Invoker.invoke(ProtobufRpcEngine.java:232)
at com.sun.proxy.$Proxy21.getBlockLocations(Unknown Source)
at org.apache.hadoop.hdfs.protocolPB.ClientNamenodeProtocolTranslatorPB.getBlockLocations(ClientNamenodeProtocolTranslatorPB.java:254)
at sun.reflect.GeneratedMethodAccessor72.invoke(Unknown Source)
at sun.reflect.DelegatingMethodAccessorImpl.invoke(DelegatingMethodAccessorImpl.java:43)
at java.lang.reflect.Method.invoke(Method.java:606)
at org.apache.hadoop.io.retry.RetryInvocationHandler.invokeMethod(RetryInvocationHandler.java:187)
at org.apache.hadoop.io.retry.RetryInvocationHandler.invoke(RetryInvocationHandler.java:102)
at com.sun.proxy.$Proxy22.getBlockLocations(Unknown Source)
at org.apache.hadoop.hdfs.DFSClient.callGetBlockLocations(DFSClient.java:1220)
at org.apache.hadoop.hdfs.DFSClient.getLocatedBlocks(DFSClient.java:1210)
at org.apache.hadoop.hdfs.DFSClient.getLocatedBlocks(DFSClient.java:1200)
at org.apache.hadoop.hdfs.DFSInputStream.fetchLocatedBlocksAndGetLastBlockLength(DFSInputStream.java:271)
at org.apache.hadoop.hdfs.DFSInputStream.openInfo(DFSInputStream.java:238)
at org.apache.hadoop.hdfs.DFSInputStream.<init>(DFSInputStream.java:231)
at org.apache.hadoop.hdfs.DFSClient.open(DFSClient.java:1498)
at org.apache.hadoop.hdfs.DistributedFileSystem$3.doCall(DistributedFileSystem.java:302)
at org.apache.hadoop.hdfs.DistributedFileSystem$3.doCall(DistributedFileSystem.java:298)
at org.apache.hadoop.fs.FileSystemLinkResolver.resolve(FileSystemLinkResolver.java:81)
at org.apache.hadoop.hdfs.DistributedFileSystem.open(DistributedFileSystem.java:298)
at org.apache.hadoop.fs.FileSystem.open(FileSystem.java:766)
at org.apache.tez.test.TestAMRecovery.readRecoveryLog(TestAMRecovery.java:477)
at org.apache.tez.test.TestAMRecovery.testVertexCompletelyFinished_Broadcast(TestAMRecovery.java:241)
Success: TEZ-2199 PreCommit Build #303
Posted by Apache Jenkins Server <je...@builds.apache.org>.
Jira: https://issues.apache.org/jira/browse/TEZ-2199
Build: https://builds.apache.org/job/PreCommit-TEZ-Build/303/
###################################################################################
########################## LAST 60 LINES OF THE CONSOLE ###########################
[...truncated 2748 lines...]
[INFO] Final Memory: 70M/967M
[INFO] ------------------------------------------------------------------------
{color:green}+1 overall{color}. Here are the results of testing the latest attachment
http://issues.apache.org/jira/secure/attachment/12704551/TEZ-2199.1.patch
against master revision b18552b.
{color:green}+1 @author{color}. The patch does not contain any @author tags.
{color:green}+1 tests included{color}. The patch appears to include 1 new or modified test files.
{color:green}+1 javac{color}. The applied patch does not increase the total number of javac compiler warnings.
{color:green}+1 javadoc{color}. There were no new javadoc warning messages.
{color:green}+1 findbugs{color}. The patch does not introduce any new Findbugs (version 2.0.3) warnings.
{color:green}+1 release audit{color}. The applied patch does not increase the total number of release audit warnings.
{color:green}+1 core tests{color}. The patch passed unit tests in .
Test results: https://builds.apache.org/job/PreCommit-TEZ-Build/303//testReport/
Console output: https://builds.apache.org/job/PreCommit-TEZ-Build/303//console
This message is automatically generated.
======================================================================
======================================================================
Adding comment to Jira.
======================================================================
======================================================================
Comment added.
ae43047303f0ec5a143958f9f93034a82f2a8dbd logged out
======================================================================
======================================================================
Finished build.
======================================================================
======================================================================
Archiving artifacts
Sending artifact delta relative to PreCommit-TEZ-Build #297
Archived 44 artifacts
Archive block size is 32768
Received 4 blocks and 2592123 bytes
Compression is 4.8%
Took 0.91 sec
Description set: TEZ-2199
Recording test results
Email was triggered for: Success
Sending email for trigger: Success
###################################################################################
############################## FAILED TESTS (if any) ##############################
All tests passed
Failed: TEZ-2064 PreCommit Build #302
Posted by Apache Jenkins Server <je...@builds.apache.org>.
Jira: https://issues.apache.org/jira/browse/TEZ-2064
Build: https://builds.apache.org/job/PreCommit-TEZ-Build/302/
###################################################################################
########################## LAST 60 LINES OF THE CONSOLE ###########################
[...truncated 2750 lines...]
{color:red}-1 overall{color}. Here are the results of testing the latest attachment
http://issues.apache.org/jira/secure/attachment/12698474/TEZ-2064.2.patch
against master revision a809f96.
{color:green}+1 @author{color}. The patch does not contain any @author tags.
{color:red}-1 tests included{color}. The patch doesn't appear to include any new or modified tests.
Please justify why no new tests are needed for this patch.
Also please list what manual steps were performed to verify this patch.
{color:green}+1 javac{color}. The applied patch does not increase the total number of javac compiler warnings.
{color:green}+1 javadoc{color}. There were no new javadoc warning messages.
{color:green}+1 findbugs{color}. The patch does not introduce any new Findbugs (version 2.0.3) warnings.
{color:green}+1 release audit{color}. The applied patch does not increase the total number of release audit warnings.
{color:green}+1 core tests{color}. The patch passed unit tests in .
Test results: https://builds.apache.org/job/PreCommit-TEZ-Build/302//testReport/
Console output: https://builds.apache.org/job/PreCommit-TEZ-Build/302//console
This message is automatically generated.
======================================================================
======================================================================
Adding comment to Jira.
======================================================================
======================================================================
Comment added.
159038a8b30e33d20ce11bc080b3ea5f7c3959b0 logged out
======================================================================
======================================================================
Finished build.
======================================================================
======================================================================
Build step 'Execute shell' marked build as failure
Archiving artifacts
Sending artifact delta relative to PreCommit-TEZ-Build #297
Archived 44 artifacts
Archive block size is 32768
Received 4 blocks and 2590348 bytes
Compression is 4.8%
Took 0.86 sec
[description-setter] Could not determine description.
Recording test results
Email was triggered for: Failure
Sending email for trigger: Failure
###################################################################################
############################## FAILED TESTS (if any) ##############################
All tests passed