You are viewing a plain text version of this content. The canonical link for it is here.
Posted to notifications@maven.apache.org by Apache Jenkins Server <je...@builds.apache.org> on 2021/01/17 22:17:06 UTC
Build failed in Jenkins: Maven » Maven TLP » maven-artifact-plugin » master #36
See https://ci-builds.apache.org/job/Maven/job/maven-box/job/maven-artifact-plugin/job/master/36/
Changes:
* use Maven Shared Utils instead of Plexus Utils
No tests ran.
Build log:
[...truncated 3059 lines...]
/f:/jenkins/jenkins-slave/712657a4/workspace/box_maven-artifact-plugin_master@2/windows-jdk11-m3.6.x_build/src/main/java/org/apache/maven/plugins/artifact/buildinfo/BuildInfoWriter.java:[240,9] exception java.io.IOException is never thrown in body of corresponding try statement
at org.apache.maven.lifecycle.internal.MojoExecutor.execute (MojoExecutor.java:215)
at org.apache.maven.lifecycle.internal.MojoExecutor.execute (MojoExecutor.java:156)
at org.apache.maven.lifecycle.internal.MojoExecutor.execute (MojoExecutor.java:148)
at org.apache.maven.lifecycle.internal.LifecycleModuleBuilder.buildProject (LifecycleModuleBuilder.java:117)
at org.apache.maven.lifecycle.internal.LifecycleModuleBuilder.buildProject (LifecycleModuleBuilder.java:81)
at org.apache.maven.lifecycle.internal.builder.singlethreaded.SingleThreadedBuilder.build (SingleThreadedBuilder.java:56)
at org.apache.maven.lifecycle.internal.LifecycleStarter.execute (LifecycleStarter.java:128)
at org.apache.maven.DefaultMaven.doExecute (DefaultMaven.java:305)
at org.apache.maven.DefaultMaven.doExecute (DefaultMaven.java:192)
at org.apache.maven.DefaultMaven.execute (DefaultMaven.java:105)
at org.apache.maven.cli.MavenCli.execute (MavenCli.java:956)
at org.apache.maven.cli.MavenCli.doMain (MavenCli.java:288)
at org.apache.maven.cli.MavenCli.main (MavenCli.java:192)
at jdk.internal.reflect.NativeMethodAccessorImpl.invoke0 (Native Method)
at jdk.internal.reflect.NativeMethodAccessorImpl.invoke (NativeMethodAccessorImpl.java:62)
at jdk.internal.reflect.DelegatingMethodAccessorImpl.invoke (DelegatingMethodAccessorImpl.java:43)
at java.lang.reflect.Method.invoke (Method.java:566)
at org.codehaus.plexus.classworlds.launcher.Launcher.launchEnhanced (Launcher.java:282)
at org.codehaus.plexus.classworlds.launcher.Launcher.launch (Launcher.java:225)
at org.codehaus.plexus.classworlds.launcher.Launcher.mainWithExitCode (Launcher.java:406)
at org.codehaus.plexus.classworlds.launcher.Launcher.main (Launcher.java:347)
Caused by: org.apache.maven.plugin.compiler.CompilationFailureException: Compilation failure
/f:/jenkins/jenkins-slave/712657a4/workspace/box_maven-artifact-plugin_master@2/windows-jdk11-m3.6.x_build/src/main/java/org/apache/maven/plugins/artifact/buildinfo/BuildInfoWriter.java:[240,9] exception java.io.IOException is never thrown in body of corresponding try statement
at org.apache.maven.plugin.compiler.AbstractCompilerMojo.execute (AbstractCompilerMojo.java:1220)
at org.apache.maven.plugin.compiler.CompilerMojo.execute (CompilerMojo.java:187)
at org.apache.maven.plugin.DefaultBuildPluginManager.executeMojo (DefaultBuildPluginManager.java:137)
at org.apache.maven.lifecycle.internal.MojoExecutor.execute (MojoExecutor.java:210)
at org.apache.maven.lifecycle.internal.MojoExecutor.execute (MojoExecutor.java:156)
at org.apache.maven.lifecycle.internal.MojoExecutor.execute (MojoExecutor.java:148)
at org.apache.maven.lifecycle.internal.LifecycleModuleBuilder.buildProject (LifecycleModuleBuilder.java:117)
at org.apache.maven.lifecycle.internal.LifecycleModuleBuilder.buildProject (LifecycleModuleBuilder.java:81)
at org.apache.maven.lifecycle.internal.builder.singlethreaded.SingleThreadedBuilder.build (SingleThreadedBuilder.java:56)
at org.apache.maven.lifecycle.internal.LifecycleStarter.execute (LifecycleStarter.java:128)
at org.apache.maven.DefaultMaven.doExecute (DefaultMaven.java:305)
at org.apache.maven.DefaultMaven.doExecute (DefaultMaven.java:192)
at org.apache.maven.DefaultMaven.execute (DefaultMaven.java:105)
at org.apache.maven.cli.MavenCli.execute (MavenCli.java:956)
at org.apache.maven.cli.MavenCli.doMain (MavenCli.java:288)
at org.apache.maven.cli.MavenCli.main (MavenCli.java:192)
at jdk.internal.reflect.NativeMethodAccessorImpl.invoke0 (Native Method)
at jdk.internal.reflect.NativeMethodAccessorImpl.invoke (NativeMethodAccessorImpl.java:62)
at jdk.internal.reflect.DelegatingMethodAccessorImpl.invoke (DelegatingMethodAccessorImpl.java:43)
at java.lang.reflect.Method.invoke (Method.java:566)
at org.codehaus.plexus.classworlds.launcher.Launcher.launchEnhanced (Launcher.java:282)
at org.codehaus.plexus.classworlds.launcher.Launcher.launch (Launcher.java:225)
at org.codehaus.plexus.classworlds.launcher.Launcher.mainWithExitCode (Launcher.java:406)
at org.codehaus.plexus.classworlds.launcher.Launcher.main (Launcher.java:347)
[ERROR]
[ERROR] Re-run Maven using the -X switch to enable full debug logging.
[ERROR]
[ERROR] For more information about the errors and possible solutions, please read the following articles:
[ERROR] [Help 1] http://cwiki.apache.org/confluence/display/MAVEN/MojoFailureException
[Pipeline] bat
[Pipeline] }
[Pipeline] // dir
[Pipeline] }
f:\jenkins\jenkins-slave\712657a4\workspace\box_maven-artifact-plugin_master@2\windows-jdk8-m3.6.x_build>mvn -P+run-its -Dmaven.test.failure.ignore=true -Dfindbugs.failOnError=false -e clean verify
----- withMaven Wrapper script -----
[withMaven] openTasksPublisher - Scan Tasks for Maven artifact org.apache.maven.plugins:maven-artifact-plugin:maven-plugin:1.0-SNAPSHOT in source directory windows-jdk11-m3.6.x_build\src\main\java
[TASKS] Scanning folder 'f:\jenkins\jenkins-slave\712657a4\workspace\box_maven-artifact-plugin_master@2' for files matching the pattern 'windows-jdk11-m3.6.x_build\src\main\java\**\*' - excludes: null
[TASKS] Found 6 files to scan for tasks
[TASKS] Found 2 open tasks.
Skipping warnings blame since pipelines do not have an SCM link.%n
[TASKS] Computing warning deltas based on reference build #34
[withMaven] Publishers: Generated Artifacts Publisher: 73 ms, Open Task Scanner Publisher: 112 ms
[Pipeline] // withMaven
[Pipeline] cleanWs
[WS-CLEANUP] Deleting project workspace...
[WS-CLEANUP] Deferred wipeout is used...
[WS-CLEANUP] done
[Pipeline] cleanWs
[WS-CLEANUP] Deleting project workspace...
[WS-CLEANUP] Deferred wipeout is used...
[WS-CLEANUP] done
[Pipeline] }
[Pipeline] // stage
[Pipeline] }
[Pipeline] // ws
[Pipeline] }
[Pipeline] // node
[Pipeline] }
Failed in branch windows-jdk11-m3.6.x_build
Apache Maven 3.6.2 (40f52333136460af0dc0d7232c0dc0bcf0d9e117; 2019-08-27T08:06:16-07:00)
Maven home: F:\jenkins\tools\maven\apache-maven-3.6.2\bin\..
Java version: 1.8.0_252, vendor: AdoptOpenJDK, runtime: f:\jenkins\tools\java\latest1.8\jre
Default locale: en_US, platform encoding: Cp1252
OS name: "windows server 2016", version: "10.0", arch: "amd64", family: "windows"
[INFO] [jenkins-event-spy] Generate F:\jenkins\jenkins-slave\712657a4\workspace\box_maven-artifact-plugin_master@2@tmp\withMaven51bd97df\maven-spy-20210117-141638-3537006094870213500078.log.tmp ...
[INFO] Error stacktraces are turned on.
[INFO] Scanning for projects...
[INFO]
[INFO] -----------< org.apache.maven.plugins:maven-artifact-plugin >-----------
[INFO] Building Apache Maven Artifact Plugin 1.0-SNAPSHOT
[INFO] ----------------------------[ maven-plugin ]----------------------------
[INFO]
[INFO] --- maven-clean-plugin:3.1.0:clean (default-clean) @ maven-artifact-plugin ---
[INFO]
[INFO] --- maven-enforcer-plugin:1.4.1:enforce (enforce-maven-version) @ maven-artifact-plugin ---
[INFO]
[INFO] --- maven-enforcer-plugin:1.4.1:enforce (enforce-bytecode-version) @ maven-artifact-plugin ---
[INFO] Adding ignore: module-info
[INFO]
[INFO] --- maven-enforcer-plugin:1.4.1:enforce (ensure-no-container-api) @ maven-artifact-plugin ---
[INFO]
[INFO] --- apache-rat-plugin:0.13:check (rat-check) @ maven-artifact-plugin ---
[INFO] Enabled default license matchers.
[INFO] Will parse SCM ignores for exclusions...
[INFO] Parsing exclusions from f:\jenkins\jenkins-slave\712657a4\workspace\box_maven-artifact-plugin_master@2\windows-jdk8-m3.6.x_build\.gitignore
[INFO] Finished adding exclusions from SCM ignore files.
[INFO] 72 implicit excludes (use -debug for more details).
[INFO] 5 explicit excludes (use -debug for more details).
[INFO] 30 resources included (use -debug for more details)
[INFO] Rat check: Summary over all files. Unapproved: 0, unknown: 0, generated: 0, approved: 30 licenses.
[INFO]
[INFO] --- maven-plugin-plugin:3.5.2:helpmojo (generate-helpmojo) @ maven-artifact-plugin ---
[INFO] Using 'UTF-8' encoding to read mojo source files.
[INFO] java-javadoc mojo extractor found 0 mojo descriptor.
[INFO] java-annotations mojo extractor found 0 mojo descriptor.
[INFO]
[INFO] --- maven-remote-resources-plugin:1.7.0:process (process-resource-bundles) @ maven-artifact-plugin ---
[INFO] Preparing remote bundle org.apache:apache-jar-resource-bundle:1.4
[INFO] Copying 3 resources from 1 bundle.
[INFO]
[INFO] --- maven-resources-plugin:3.1.0:resources (default-resources) @ maven-artifact-plugin ---
[INFO] Using 'UTF-8' encoding to copy filtered resources.
[INFO] skip non existing resourceDirectory f:\jenkins\jenkins-slave\712657a4\workspace\box_maven-artifact-plugin_master@2\windows-jdk8-m3.6.x_build\src\main\resources
[INFO] Copying 3 resources
[INFO]
[INFO] --- maven-compiler-plugin:3.8.1:compile (default-compile) @ maven-artifact-plugin ---
[INFO] Changes detected - recompiling the module!
[INFO] Compiling 7 source files to f:\jenkins\jenkins-slave\712657a4\workspace\box_maven-artifact-plugin_master@2\windows-jdk8-m3.6.x_build\target\classes
[INFO] /f:/jenkins/jenkins-slave/712657a4/workspace/box_maven-artifact-plugin_master@2/windows-jdk8-m3.6.x_build/src/main/java/org/apache/maven/plugins/artifact/buildinfo/BuildinfoMojo.java: Some input files use or override a deprecated API.
[INFO] /f:/jenkins/jenkins-slave/712657a4/workspace/box_maven-artifact-plugin_master@2/windows-jdk8-m3.6.x_build/src/main/java/org/apache/maven/plugins/artifact/buildinfo/BuildinfoMojo.java: Recompile with -Xlint:deprecation for details.
[INFO] -------------------------------------------------------------
[ERROR] COMPILATION ERROR :
[INFO] -------------------------------------------------------------
[ERROR] /f:/jenkins/jenkins-slave/712657a4/workspace/box_maven-artifact-plugin_master@2/windows-jdk8-m3.6.x_build/src/main/java/org/apache/maven/plugins/artifact/buildinfo/BuildInfoWriter.java:[240,9] exception java.io.IOException is never thrown in body of corresponding try statement
[INFO] 1 error
[INFO] -------------------------------------------------------------
[INFO] ------------------------------------------------------------------------
[INFO] BUILD FAILURE
[INFO] ------------------------------------------------------------------------
[INFO] Total time: 23.325 s
[INFO] Finished at: 2021-01-17T14:17:01-08:00
[INFO] ------------------------------------------------------------------------
[INFO] [jenkins-event-spy] Generated F:\jenkins\jenkins-slave\712657a4\workspace\box_maven-artifact-plugin_master@2@tmp\withMaven51bd97df\maven-spy-20210117-141638-3537006094870213500078.log
[ERROR] Failed to execute goal org.apache.maven.plugins:maven-compiler-plugin:3.8.1:compile (default-compile) on project maven-artifact-plugin: Compilation failure
[ERROR] /f:/jenkins/jenkins-slave/712657a4/workspace/box_maven-artifact-plugin_master@2/windows-jdk8-m3.6.x_build/src/main/java/org/apache/maven/plugins/artifact/buildinfo/BuildInfoWriter.java:[240,9] exception java.io.IOException is never thrown in body of corresponding try statement
[ERROR] -> [Help 1]
org.apache.maven.lifecycle.LifecycleExecutionException: Failed to execute goal org.apache.maven.plugins:maven-compiler-plugin:3.8.1:compile (default-compile) on project maven-artifact-plugin: Compilation failure
/f:/jenkins/jenkins-slave/712657a4/workspace/box_maven-artifact-plugin_master@2/windows-jdk8-m3.6.x_build/src/main/java/org/apache/maven/plugins/artifact/buildinfo/BuildInfoWriter.java:[240,9] exception java.io.IOException is never thrown in body of corresponding try statement
at org.apache.maven.lifecycle.internal.MojoExecutor.execute (MojoExecutor.java:215)
at org.apache.maven.lifecycle.internal.MojoExecutor.execute (MojoExecutor.java:156)
at org.apache.maven.lifecycle.internal.MojoExecutor.execute (MojoExecutor.java:148)
at org.apache.maven.lifecycle.internal.LifecycleModuleBuilder.buildProject (LifecycleModuleBuilder.java:117)
at org.apache.maven.lifecycle.internal.LifecycleModuleBuilder.buildProject (LifecycleModuleBuilder.java:81)
at org.apache.maven.lifecycle.internal.builder.singlethreaded.SingleThreadedBuilder.build (SingleThreadedBuilder.java:56)
at org.apache.maven.lifecycle.internal.LifecycleStarter.execute (LifecycleStarter.java:128)
at org.apache.maven.DefaultMaven.doExecute (DefaultMaven.java:305)
at org.apache.maven.DefaultMaven.doExecute (DefaultMaven.java:192)
at org.apache.maven.DefaultMaven.execute (DefaultMaven.java:105)
at org.apache.maven.cli.MavenCli.execute (MavenCli.java:956)
at org.apache.maven.cli.MavenCli.doMain (MavenCli.java:288)
at org.apache.maven.cli.MavenCli.main (MavenCli.java:192)
at sun.reflect.NativeMethodAccessorImpl.invoke0 (Native Method)
at sun.reflect.NativeMethodAccessorImpl.invoke (NativeMethodAccessorImpl.java:62)
at sun.reflect.DelegatingMethodAccessorImpl.invoke (DelegatingMethodAccessorImpl.java:43)
at java.lang.reflect.Method.invoke (Method.java:498)
at org.codehaus.plexus.classworlds.launcher.Launcher.launchEnhanced (Launcher.java:282)
at org.codehaus.plexus.classworlds.launcher.Launcher.launch (Launcher.java:225)
at org.codehaus.plexus.classworlds.launcher.Launcher.mainWithExitCode (Launcher.java:406)
at org.codehaus.plexus.classworlds.launcher.Launcher.main (Launcher.java:347)
Caused by: org.apache.maven.plugin.compiler.CompilationFailureException: Compilation failure
/f:/jenkins/jenkins-slave/712657a4/workspace/box_maven-artifact-plugin_master@2/windows-jdk8-m3.6.x_build/src/main/java/org/apache/maven/plugins/artifact/buildinfo/BuildInfoWriter.java:[240,9] exception java.io.IOException is never thrown in body of corresponding try statement
at org.apache.maven.plugin.compiler.AbstractCompilerMojo.execute (AbstractCompilerMojo.java:1220)
at org.apache.maven.plugin.compiler.CompilerMojo.execute (CompilerMojo.java:187)
at org.apache.maven.plugin.DefaultBuildPluginManager.executeMojo (DefaultBuildPluginManager.java:137)
at org.apache.maven.lifecycle.internal.MojoExecutor.execute (MojoExecutor.java:210)
at org.apache.maven.lifecycle.internal.MojoExecutor.execute (MojoExecutor.java:156)
at org.apache.maven.lifecycle.internal.MojoExecutor.execute (MojoExecutor.java:148)
at org.apache.maven.lifecycle.internal.LifecycleModuleBuilder.buildProject (LifecycleModuleBuilder.java:117)
at org.apache.maven.lifecycle.internal.LifecycleModuleBuilder.buildProject (LifecycleModuleBuilder.java:81)
at org.apache.maven.lifecycle.internal.builder.singlethreaded.SingleThreadedBuilder.build (SingleThreadedBuilder.java:56)
at org.apache.maven.lifecycle.internal.LifecycleStarter.execute (LifecycleStarter.java:128)
at org.apache.maven.DefaultMaven.doExecute (DefaultMaven.java:305)
at org.apache.maven.DefaultMaven.doExecute (DefaultMaven.java:192)
at org.apache.maven.DefaultMaven.execute (DefaultMaven.java:105)
at org.apache.maven.cli.MavenCli.execute (MavenCli.java:956)
at org.apache.maven.cli.MavenCli.doMain (MavenCli.java:288)
at org.apache.maven.cli.MavenCli.main (MavenCli.java:192)
at sun.reflect.NativeMethodAccessorImpl.invoke0 (Native Method)
at sun.reflect.NativeMethodAccessorImpl.invoke (NativeMethodAccessorImpl.java:62)
at sun.reflect.DelegatingMethodAccessorImpl.invoke (DelegatingMethodAccessorImpl.java:43)
at java.lang.reflect.Method.invoke (Method.java:498)
at org.codehaus.plexus.classworlds.launcher.Launcher.launchEnhanced (Launcher.java:282)
at org.codehaus.plexus.classworlds.launcher.Launcher.launch (Launcher.java:225)
at org.codehaus.plexus.classworlds.launcher.Launcher.mainWithExitCode (Launcher.java:406)
at org.codehaus.plexus.classworlds.launcher.Launcher.main (Launcher.java:347)
[ERROR]
[ERROR] Re-run Maven using the -X switch to enable full debug logging.
[ERROR]
[ERROR] For more information about the errors and possible solutions, please read the following articles:
[ERROR] [Help 1] http://cwiki.apache.org/confluence/display/MAVEN/MojoFailureException
Picked up JAVA_TOOL_OPTIONS: -Dmaven.ext.class.path="f:\jenkins\jenkins-slave\712657a4\workspace\box_maven-artifact-plugin_master@2@tmp\withMaven51bd97df\pipeline-maven-spy.jar" -Dorg.jenkinsci.plugins.pipeline.maven.reportsFolder="f:\jenkins\jenkins-slave\712657a4\workspace\box_maven-artifact-plugin_master@2@tmp\withMaven51bd97df"
[Pipeline] }
[Pipeline] // dir
[Pipeline] }
[withMaven] openTasksPublisher - Scan Tasks for Maven artifact org.apache.maven.plugins:maven-artifact-plugin:maven-plugin:1.0-SNAPSHOT in source directory windows-jdk8-m3.6.x_build\src\main\java
[TASKS] Scanning folder 'f:\jenkins\jenkins-slave\712657a4\workspace\box_maven-artifact-plugin_master@2' for files matching the pattern 'windows-jdk8-m3.6.x_build\src\main\java\**\*' - excludes: null
[TASKS] Found 6 files to scan for tasks
[TASKS] Found 2 open tasks.
Skipping warnings blame since pipelines do not have an SCM link.%n
[TASKS] Computing warning deltas based on reference build #34
[withMaven] Publishers: Generated Artifacts Publisher: 1637 ms, Open Task Scanner Publisher: 955 ms
[Pipeline] // withMaven
[Pipeline] cleanWs
[WS-CLEANUP] Deleting project workspace...
[WS-CLEANUP] Deferred wipeout is used...
[WS-CLEANUP] done
[Pipeline] cleanWs
[WS-CLEANUP] Deleting project workspace...
[WS-CLEANUP] Deferred wipeout is used...
[WS-CLEANUP] done
[Pipeline] }
[Pipeline] // stage
[Pipeline] }
[Pipeline] // ws
[Pipeline] }
[Pipeline] // node
[Pipeline] }
Failed in branch windows-jdk8-m3.6.x_build
[Pipeline] // parallel
[Pipeline] stage
[Pipeline] { (Notifications)
[Pipeline] echo
Build result: FAILURE
[Pipeline] jiraIssueSelector
[Pipeline] echo
The authors of changes [hboutemy].
[Pipeline] echo
Sending email ...
[Pipeline] emailext
Build succeeded in Jenkins: Maven » Maven TLP » maven-artifact-plugin » master #38
Posted by Apache Jenkins Server <je...@builds.apache.org>.
See https://ci-builds.apache.org/job/Maven/job/maven-box/job/maven-artifact-plugin/job/master/38/
Changes:
* JDK 16 and Maven 3.6.3 now available on Windows
* Still issue with maven_3.6.3_windows -> try with maven_latest
No tests ran.
Build failed in Jenkins: Maven » Maven TLP » maven-artifact-plugin » master #37
Posted by Apache Jenkins Server <je...@builds.apache.org>.
See https://ci-builds.apache.org/job/Maven/job/maven-box/job/maven-artifact-plugin/job/master/37/
Changes:
* fix Maven Shared Utils use
No tests ran.
Build log:
[...truncated 2918 lines...]
[Pipeline] bat
f:\jenkins\jenkins-slave\712657a4\workspace\box_maven-artifact-plugin_master@2\windows-jdk15-m3.6.x_build>mvn -P+run-its -Dmaven.test.failure.ignore=true -Dfindbugs.failOnError=false -e clean verify
----- withMaven Wrapper script -----
The JAVA_HOME environment variable is not defined correctly
This environment variable is needed to run this program
NB: JAVA_HOME should point to a JDK not a JRE
[Pipeline] }
[Pipeline] // dir
[Pipeline] }
f:\jenkins\jenkins-slave\712657a4\workspace\box_maven-artifact-plugin_master@2\windows-jdk11-m3.6.x_build>wmic logicaldisk get size,freespace,caption
C a p t i o n F r e e S p a c e S i z e
C : 2 1 0 7 9 6 9 8 9 2 3 5 2 2 1 9 8 4 9 7 9 1 4 8 8 0
F : 2 9 0 4 7 5 5 8 5 1 2 6 4 3 0 0 0 2 4 6 4 6 4 5 1 2
[Pipeline] bat
[Pipeline] // withMaven
[Pipeline] cleanWs
f:\jenkins\jenkins-slave\712657a4\workspace\box_maven-artifact-plugin_master@2\windows-jdk11-m3.6.x_build>mvn -P+run-its -Dmaven.test.failure.ignore=true -Dfindbugs.failOnError=false -e clean verify
----- withMaven Wrapper script -----
Picked up JAVA_TOOL_OPTIONS: -Dmaven.ext.class.path="f:\jenkins\jenkins-slave\712657a4\workspace\box_maven-artifact-plugin_master@2@tmp\withMavend9237781\pipeline-maven-spy.jar" -Dorg.jenkinsci.plugins.pipeline.maven.reportsFolder="f:\jenkins\jenkins-slave\712657a4\workspace\box_maven-artifact-plugin_master@2@tmp\withMavend9237781"
[WS-CLEANUP] Deleting project workspace...
[WS-CLEANUP] Deferred wipeout is used...
[WS-CLEANUP] done
[Pipeline] cleanWs
[WS-CLEANUP] Deleting project workspace...
[WS-CLEANUP] Deferred wipeout is used...
[WS-CLEANUP] done
[Pipeline] }
Apache Maven 3.6.2 (40f52333136460af0dc0d7232c0dc0bcf0d9e117; 2019-08-27T08:06:16-07:00)
Maven home: F:\jenkins\tools\maven\apache-maven-3.6.2\bin\..
Java version: 11, vendor: Oracle Corporation, runtime: f:\jenkins\tools\java\latest11
Default locale: en_US, platform encoding: Cp1252
OS name: "windows server 2016", version: "10.0", arch: "amd64", family: "windows"
[Pipeline] // stage
[Pipeline] }
[Pipeline] // ws
[Pipeline] }
[Pipeline] // node
[Pipeline] }
Failed in branch windows-jdk15-m3.6.x_build
[INFO] [jenkins-event-spy] Generate F:\jenkins\jenkins-slave\712657a4\workspace\box_maven-artifact-plugin_master@2@tmp\withMavend9237781\maven-spy-20210117-142503-4916052555255037200492.log.tmp ...
[INFO] Error stacktraces are turned on.
[INFO] Scanning for projects...
[INFO]
[INFO] -----------< org.apache.maven.plugins:maven-artifact-plugin >-----------
[INFO] Building Apache Maven Artifact Plugin 1.0-SNAPSHOT
[INFO] ----------------------------[ maven-plugin ]----------------------------
[INFO] Skipping because packaging 'maven-plugin' is not pom.
[INFO]
[INFO] --- maven-invoker-plugin:3.2.1:install (integration-test) @ maven-artifact-plugin ---
[INFO]
[INFO] --- maven-clean-plugin:3.1.0:clean (default-clean) @ maven-artifact-plugin ---
[INFO]
[INFO] --- maven-enforcer-plugin:1.4.1:enforce (enforce-maven-version) @ maven-artifact-plugin ---
[INFO]
[INFO] --- maven-enforcer-plugin:1.4.1:enforce (enforce-bytecode-version) @ maven-artifact-plugin ---
[INFO] Adding ignore: module-info
[INFO]
[INFO] --- maven-enforcer-plugin:1.4.1:enforce (ensure-no-container-api) @ maven-artifact-plugin ---
[INFO]
[INFO] --- apache-rat-plugin:0.13:check (rat-check) @ maven-artifact-plugin ---
[INFO] Installing f:\jenkins\jenkins-slave\712657a4\workspace\box_maven-artifact-plugin_master@2\windows-jdk8-m3.6.x_build\pom.xml to f:\jenkins\jenkins-slave\712657a4\workspace\box_maven-artifact-plugin_master@2\windows-jdk8-m3.6.x_build\target\local-repo\org\apache\maven\plugins\maven-artifact-plugin\1.0-SNAPSHOT\maven-artifact-plugin-1.0-SNAPSHOT.pom
[INFO] Installing f:\jenkins\jenkins-slave\712657a4\workspace\box_maven-artifact-plugin_master@2\windows-jdk8-m3.6.x_build\target\maven-artifact-plugin-1.0-SNAPSHOT.jar to f:\jenkins\jenkins-slave\712657a4\workspace\box_maven-artifact-plugin_master@2\windows-jdk8-m3.6.x_build\target\local-repo\org\apache\maven\plugins\maven-artifact-plugin\1.0-SNAPSHOT\maven-artifact-plugin-1.0-SNAPSHOT.jar
[INFO]
[INFO] --- maven-invoker-plugin:3.2.1:integration-test (integration-test) @ maven-artifact-plugin ---
[INFO] Enabled default license matchers.
[INFO] Will parse SCM ignores for exclusions...
[INFO] Parsing exclusions from f:\jenkins\jenkins-slave\712657a4\workspace\box_maven-artifact-plugin_master@2\windows-jdk11-m3.6.x_build\.gitignore
[INFO] Finished adding exclusions from SCM ignore files.
[INFO] 72 implicit excludes (use -debug for more details).
[INFO] 5 explicit excludes (use -debug for more details).
[INFO] 30 resources included (use -debug for more details)
[INFO] Building: mono\pom.xml
[INFO] Rat check: Summary over all files. Unapproved: 0, unknown: 0, generated: 0, approved: 30 licenses.
[INFO]
[INFO] --- maven-plugin-plugin:3.5.2:helpmojo (generate-helpmojo) @ maven-artifact-plugin ---
[INFO] Using 'UTF-8' encoding to read mojo source files.
[INFO] java-javadoc mojo extractor found 0 mojo descriptor.
[INFO] java-annotations mojo extractor found 0 mojo descriptor.
[INFO]
[INFO] --- maven-remote-resources-plugin:1.7.0:process (process-resource-bundles) @ maven-artifact-plugin ---
[INFO] Preparing remote bundle org.apache:apache-jar-resource-bundle:1.4
[INFO] Copying 3 resources from 1 bundle.
[INFO]
[INFO] --- maven-resources-plugin:3.1.0:resources (default-resources) @ maven-artifact-plugin ---
[INFO] Using 'UTF-8' encoding to copy filtered resources.
[INFO] skip non existing resourceDirectory f:\jenkins\jenkins-slave\712657a4\workspace\box_maven-artifact-plugin_master@2\windows-jdk11-m3.6.x_build\src\main\resources
[INFO] Copying 3 resources
[INFO]
[INFO] --- maven-compiler-plugin:3.8.1:compile (default-compile) @ maven-artifact-plugin ---
[INFO] Changes detected - recompiling the module!
[INFO] Compiling 7 source files to f:\jenkins\jenkins-slave\712657a4\workspace\box_maven-artifact-plugin_master@2\windows-jdk11-m3.6.x_build\target\classes
[INFO] /f:/jenkins/jenkins-slave/712657a4/workspace/box_maven-artifact-plugin_master@2/windows-jdk11-m3.6.x_build/src/main/java/org/apache/maven/plugins/artifact/buildinfo/ReferenceBuildinfoUtil.java: Some input files use or override a deprecated API.
[INFO] /f:/jenkins/jenkins-slave/712657a4/workspace/box_maven-artifact-plugin_master@2/windows-jdk11-m3.6.x_build/src/main/java/org/apache/maven/plugins/artifact/buildinfo/ReferenceBuildinfoUtil.java: Recompile with -Xlint:deprecation for details.
[INFO]
[INFO] --- maven-plugin-plugin:3.5.2:descriptor (default-descriptor) @ maven-artifact-plugin ---
[INFO] Using 'UTF-8' encoding to read mojo source files.
[INFO] java-javadoc mojo extractor found 0 mojo descriptor.
[INFO] java-annotations mojo extractor found 2 mojo descriptors.
[INFO]
[INFO] --- maven-resources-plugin:3.1.0:testResources (default-testResources) @ maven-artifact-plugin ---
[INFO] Using 'UTF-8' encoding to copy filtered resources.
[INFO] skip non existing resourceDirectory f:\jenkins\jenkins-slave\712657a4\workspace\box_maven-artifact-plugin_master@2\windows-jdk11-m3.6.x_build\src\test\resources
[INFO] Copying 3 resources
[INFO]
[INFO] --- maven-compiler-plugin:3.8.1:testCompile (default-testCompile) @ maven-artifact-plugin ---
[INFO] No sources to compile
[INFO]
[INFO] --- maven-surefire-plugin:2.22.0:test (default-test) @ maven-artifact-plugin ---
[INFO]
[INFO] --- maven-jar-plugin:3.2.0:jar (default-jar) @ maven-artifact-plugin ---
[INFO] Building jar: f:\jenkins\jenkins-slave\712657a4\workspace\box_maven-artifact-plugin_master@2\windows-jdk11-m3.6.x_build\target\maven-artifact-plugin-1.0-SNAPSHOT.jar
[INFO]
[INFO] --- maven-plugin-plugin:3.5.2:addPluginArtifactMetadata (default-addPluginArtifactMetadata) @ maven-artifact-plugin ---
[INFO]
[INFO] --- maven-site-plugin:3.7.1:attach-descriptor (attach-descriptor) @ maven-artifact-plugin ---
[INFO] Skipping because packaging 'maven-plugin' is not pom.
[INFO]
[INFO] --- maven-invoker-plugin:3.2.1:install (integration-test) @ maven-artifact-plugin ---
[INFO] Installing f:\jenkins\jenkins-slave\712657a4\workspace\box_maven-artifact-plugin_master@2\windows-jdk11-m3.6.x_build\pom.xml to f:\jenkins\jenkins-slave\712657a4\workspace\box_maven-artifact-plugin_master@2\windows-jdk11-m3.6.x_build\target\local-repo\org\apache\maven\plugins\maven-artifact-plugin\1.0-SNAPSHOT\maven-artifact-plugin-1.0-SNAPSHOT.pom
[INFO] Installing f:\jenkins\jenkins-slave\712657a4\workspace\box_maven-artifact-plugin_master@2\windows-jdk11-m3.6.x_build\target\maven-artifact-plugin-1.0-SNAPSHOT.jar to f:\jenkins\jenkins-slave\712657a4\workspace\box_maven-artifact-plugin_master@2\windows-jdk11-m3.6.x_build\target\local-repo\org\apache\maven\plugins\maven-artifact-plugin\1.0-SNAPSHOT\maven-artifact-plugin-1.0-SNAPSHOT.jar
[INFO]
[INFO] --- maven-invoker-plugin:3.2.1:integration-test (integration-test) @ maven-artifact-plugin ---
[INFO] Building: mono\pom.xml
[INFO] run post-build script verify.groovy
[INFO] mono\pom.xml ..................................... SUCCESS (17.8 s)
[INFO] Building: multi\pom.xml
[INFO] run post-build script verify.groovy
WARNING: An illegal reflective access operation has occurred
WARNING: Illegal reflective access by org.codehaus.groovy.reflection.CachedClass (file:/f:/jenkins/jenkins-slave/712657a4/workspace/.maven_repositories/0/org/codehaus/groovy/groovy-all/2.4.8/groovy-all-2.4.8.jar) to method java.lang.Object.finalize()
WARNING: Please consider reporting this to the maintainers of org.codehaus.groovy.reflection.CachedClass
WARNING: Use --illegal-access=warn to enable warnings of further illegal reflective access operations
WARNING: All illegal access operations will be denied in a future release
[INFO] mono\pom.xml ..................................... SUCCESS (16.2 s)
[INFO] Building: multi\pom.xml
[INFO] run post-build script verify.groovy
[INFO] multi\pom.xml .................................... SUCCESS (5.2 s)
[INFO] Building: skip-install-deploy\pom.xml
[INFO] run post-build script verify.groovy
[INFO] skip-install-deploy\pom.xml ...................... SUCCESS (4.0 s)
[INFO]
[INFO] --- maven-checkstyle-plugin:3.0.0:check (checkstyle-check) @ maven-artifact-plugin ---
[INFO] run post-build script verify.groovy
[INFO] multi\pom.xml .................................... SUCCESS (5.9 s)
[INFO] Building: skip-install-deploy\pom.xml
[INFO]
[INFO] --- maven-invoker-plugin:3.2.1:verify (integration-test) @ maven-artifact-plugin ---
[INFO] -------------------------------------------------
[INFO] Build Summary:
[INFO] Passed: 3, Failed: 0, Errors: 0, Skipped: 0
[INFO] -------------------------------------------------
[INFO] ------------------------------------------------------------------------
[INFO] BUILD SUCCESS
[INFO] ------------------------------------------------------------------------
[INFO] Total time: 44.824 s
[INFO] Finished at: 2021-01-17T14:25:29-08:00
[INFO] ------------------------------------------------------------------------
[INFO] [jenkins-event-spy] Generated F:\jenkins\jenkins-slave\712657a4\workspace\box_maven-artifact-plugin_master@2@tmp\withMaven6065ec46\maven-spy-20210117-142444-3951315158921124067164.log
Picked up JAVA_TOOL_OPTIONS: -Dmaven.ext.class.path="f:\jenkins\jenkins-slave\712657a4\workspace\box_maven-artifact-plugin_master@2@tmp\withMaven6065ec46\pipeline-maven-spy.jar" -Dorg.jenkinsci.plugins.pipeline.maven.reportsFolder="f:\jenkins\jenkins-slave\712657a4\workspace\box_maven-artifact-plugin_master@2@tmp\withMaven6065ec46"
[Pipeline] }
[Pipeline] // dir
[Pipeline] }
[withMaven] artifactsPublisher - Archive artifact windows-jdk8-m3.6.x_build\pom.xml under org\apache\maven\plugins\maven-artifact-plugin\1.0-SNAPSHOT\maven-artifact-plugin-1.0-SNAPSHOT.pom
[withMaven] artifactsPublisher - Archive artifact windows-jdk8-m3.6.x_build\target\maven-artifact-plugin-1.0-SNAPSHOT.jar under org\apache\maven\plugins\maven-artifact-plugin\1.0-SNAPSHOT\maven-artifact-plugin-1.0-SNAPSHOT.jar
[withMaven] junitPublisher - Archive test results for Maven artifact org.apache.maven.plugins:maven-artifact-plugin:maven-plugin:1.0-SNAPSHOT generated by maven-surefire-plugin:test (default-test): windows-jdk8-m3.6.x_build\target\surefire-reports\*.xml
Recording test results
None of the test reports contained any result
[withMaven] openTasksPublisher - Scan Tasks for Maven artifact org.apache.maven.plugins:maven-artifact-plugin:maven-plugin:1.0-SNAPSHOT in source directory windows-jdk8-m3.6.x_build\src\main\java
[TASKS] Scanning folder 'f:\jenkins\jenkins-slave\712657a4\workspace\box_maven-artifact-plugin_master@2' for files matching the pattern 'windows-jdk8-m3.6.x_build\src\main\java\**\*' - excludes: null
[TASKS] Found 6 files to scan for tasks
[TASKS] Found 2 open tasks.
Skipping warnings blame since pipelines do not have an SCM link.%n
[TASKS] Computing warning deltas based on reference build #34
[INFO] run post-build script verify.groovy
[INFO] skip-install-deploy\pom.xml ...................... SUCCESS (4.8 s)
[INFO]
[INFO] --- maven-checkstyle-plugin:3.0.0:check (checkstyle-check) @ maven-artifact-plugin ---
[withMaven] invokerPublisher - Archive invoker results for Maven artifact MavenArtifact{org.apache.maven.plugins:maven-artifact-plugin:maven-plugin:1.0-SNAPSHOT(version: 1.0-SNAPSHOT, snapshot:false) } generated by PluginInvocation{org.apache.maven.plugins:maven-invoker-plugin:3.2.1@integration-test integration-test}: windows-jdk8-m3.6.x_build\target\invoker-reports\*.xml
[withMaven] Publishers: Generated Artifacts Publisher: 1352 ms, Junit Publisher: 615 ms, Open Task Scanner Publisher: 887 ms, Invoker Publisher: 1385 ms
[Pipeline] // withMaven
[Pipeline] cleanWs
[WS-CLEANUP] Deleting project workspace...
[WS-CLEANUP] Deferred wipeout is used...
[WS-CLEANUP] done
[Pipeline] }
[INFO]
[INFO] --- maven-invoker-plugin:3.2.1:verify (integration-test) @ maven-artifact-plugin ---
[INFO] -------------------------------------------------
[INFO] Build Summary:
[INFO] Passed: 3, Failed: 0, Errors: 0, Skipped: 0
[INFO] -------------------------------------------------
[INFO] ------------------------------------------------------------------------
[INFO] BUILD SUCCESS
[INFO] ------------------------------------------------------------------------
[INFO] Total time: 37.759 s
[INFO] Finished at: 2021-01-17T14:25:41-08:00
[INFO] ------------------------------------------------------------------------
[INFO] [jenkins-event-spy] Generated F:\jenkins\jenkins-slave\712657a4\workspace\box_maven-artifact-plugin_master@2@tmp\withMavend9237781\maven-spy-20210117-142503-4916052555255037200492.log
[Pipeline] // stage
[Pipeline] }
[Pipeline] }
[Pipeline] // ws
[Pipeline] // dir
[Pipeline] }
[Pipeline] }
[Pipeline] // node
[Pipeline] }
[withMaven] artifactsPublisher - Archive artifact windows-jdk11-m3.6.x_build\pom.xml under org\apache\maven\plugins\maven-artifact-plugin\1.0-SNAPSHOT\maven-artifact-plugin-1.0-SNAPSHOT.pom
[withMaven] artifactsPublisher - Archive artifact windows-jdk11-m3.6.x_build\target\maven-artifact-plugin-1.0-SNAPSHOT.jar under org\apache\maven\plugins\maven-artifact-plugin\1.0-SNAPSHOT\maven-artifact-plugin-1.0-SNAPSHOT.jar
[withMaven] junitPublisher - Archive test results for Maven artifact org.apache.maven.plugins:maven-artifact-plugin:maven-plugin:1.0-SNAPSHOT generated by maven-surefire-plugin:test (default-test): windows-jdk11-m3.6.x_build\target\surefire-reports\*.xml
Recording test results
None of the test reports contained any result
[withMaven] openTasksPublisher - Scan Tasks for Maven artifact org.apache.maven.plugins:maven-artifact-plugin:maven-plugin:1.0-SNAPSHOT in source directory windows-jdk11-m3.6.x_build\src\main\java
[TASKS] Scanning folder 'f:\jenkins\jenkins-slave\712657a4\workspace\box_maven-artifact-plugin_master@2' for files matching the pattern 'windows-jdk11-m3.6.x_build\src\main\java\**\*' - excludes: null
[TASKS] Found 6 files to scan for tasks
[TASKS] Found 2 open tasks.
Skipping warnings blame since pipelines do not have an SCM link.%n
[TASKS] Computing warning deltas based on reference build #34
[withMaven] invokerPublisher - Archive invoker results for Maven artifact MavenArtifact{org.apache.maven.plugins:maven-artifact-plugin:maven-plugin:1.0-SNAPSHOT(version: 1.0-SNAPSHOT, snapshot:false) } generated by PluginInvocation{org.apache.maven.plugins:maven-invoker-plugin:3.2.1@integration-test integration-test}: windows-jdk11-m3.6.x_build\target\invoker-reports\*.xml
[withMaven] Publishers: Generated Artifacts Publisher: 1351 ms, Junit Publisher: 680 ms, Open Task Scanner Publisher: 883 ms, Invoker Publisher: 1348 ms
[Pipeline] // withMaven
[Pipeline] cleanWs
[WS-CLEANUP] Deleting project workspace...
[WS-CLEANUP] Deferred wipeout is used...
[WS-CLEANUP] done
[Pipeline] }
[Pipeline] // stage
[Pipeline] }
[Pipeline] // ws
[Pipeline] }
[Pipeline] // node
[Pipeline] }
[Pipeline] // parallel
[Pipeline] stage
[Pipeline] { (Notifications)
[Pipeline] echo
Build result: FAILURE
[Pipeline] jiraIssueSelector
[Pipeline] echo
The authors of changes [hboutemy].
[Pipeline] echo
Sending email ...
[Pipeline] emailext