You are viewing a plain text version of this content. The canonical link for it is here.
Posted to dev@lucene.apache.org by Policeman Jenkins Server <je...@thetaphi.de> on 2019/06/05 14:48:21 UTC
[JENKINS-EA] Lucene-Solr-master-Linux
(64bit/jdk-13-ea+shipilev-fastdebug) - Build # 24188 - Unstable!
Build: https://jenkins.thetaphi.de/job/Lucene-Solr-master-Linux/24188/
Java: 64bit/jdk-13-ea+shipilev-fastdebug -XX:+UseCompressedOops -XX:+UseConcMarkSweepGC
4 tests failed.
FAILED: org.apache.solr.cloud.LeaderFailoverAfterPartitionTest.test
Error Message:
Timeout occurred while waiting response from server at: http://127.0.0.1:38305
Stack Trace:
org.apache.solr.client.solrj.SolrServerException: Timeout occurred while waiting response from server at: http://127.0.0.1:38305
at __randomizedtesting.SeedInfo.seed([76CC894DFD25A044:FE98B69753D9CDBC]:0)
at org.apache.solr.client.solrj.impl.HttpSolrClient.executeMethod(HttpSolrClient.java:667)
at org.apache.solr.client.solrj.impl.HttpSolrClient.request(HttpSolrClient.java:262)
at org.apache.solr.client.solrj.impl.HttpSolrClient.request(HttpSolrClient.java:245)
at org.apache.solr.client.solrj.impl.LBSolrClient.doRequest(LBSolrClient.java:368)
at org.apache.solr.client.solrj.impl.LBSolrClient.request(LBSolrClient.java:296)
at org.apache.solr.client.solrj.impl.BaseCloudSolrClient.sendRequest(BaseCloudSolrClient.java:1068)
at org.apache.solr.client.solrj.impl.BaseCloudSolrClient.requestWithRetryOnStaleState(BaseCloudSolrClient.java:837)
at org.apache.solr.client.solrj.impl.BaseCloudSolrClient.request(BaseCloudSolrClient.java:769)
at org.apache.solr.client.solrj.SolrRequest.process(SolrRequest.java:211)
at org.apache.solr.client.solrj.SolrRequest.process(SolrRequest.java:228)
at org.apache.solr.cloud.AbstractFullDistribZkTestBase.createServers(AbstractFullDistribZkTestBase.java:338)
at org.apache.solr.BaseDistributedSearchTestCase$ShardsRepeatRule$ShardsFixedStatement.callStatement(BaseDistributedSearchTestCase.java:1080)
at org.apache.solr.BaseDistributedSearchTestCase$ShardsRepeatRule$ShardsStatement.evaluate(BaseDistributedSearchTestCase.java:1054)
at com.carrotsearch.randomizedtesting.rules.SystemPropertiesRestoreRule$1.evaluate(SystemPropertiesRestoreRule.java:57)
at org.apache.lucene.util.TestRuleSetupTeardownChained$1.evaluate(TestRuleSetupTeardownChained.java:49)
at org.apache.lucene.util.AbstractBeforeAfterRule$1.evaluate(AbstractBeforeAfterRule.java:45)
at org.apache.lucene.util.TestRuleThreadAndTestName$1.evaluate(TestRuleThreadAndTestName.java:48)
at org.apache.lucene.util.TestRuleIgnoreAfterMaxFailures$1.evaluate(TestRuleIgnoreAfterMaxFailures.java:64)
at org.apache.lucene.util.TestRuleMarkFailure$1.evaluate(TestRuleMarkFailure.java:47)
at com.carrotsearch.randomizedtesting.rules.StatementAdapter.evaluate(StatementAdapter.java:36)
at com.carrotsearch.randomizedtesting.ThreadLeakControl$StatementRunner.run(ThreadLeakControl.java:368)
at com.carrotsearch.randomizedtesting.ThreadLeakControl.forkTimeoutingTask(ThreadLeakControl.java:817)
at com.carrotsearch.randomizedtesting.ThreadLeakControl$3.evaluate(ThreadLeakControl.java:468)
at com.carrotsearch.randomizedtesting.RandomizedRunner.runSingleTest(RandomizedRunner.java:947)
at com.carrotsearch.randomizedtesting.RandomizedRunner$5.evaluate(RandomizedRunner.java:832)
at com.carrotsearch.randomizedtesting.RandomizedRunner$6.evaluate(RandomizedRunner.java:883)
at com.carrotsearch.randomizedtesting.RandomizedRunner$7.evaluate(RandomizedRunner.java:894)
at com.carrotsearch.randomizedtesting.rules.StatementAdapter.evaluate(StatementAdapter.java:36)
at com.carrotsearch.randomizedtesting.rules.SystemPropertiesRestoreRule$1.evaluate(SystemPropertiesRestoreRule.java:57)
at org.apache.lucene.util.AbstractBeforeAfterRule$1.evaluate(AbstractBeforeAfterRule.java:45)
at com.carrotsearch.randomizedtesting.rules.StatementAdapter.evaluate(StatementAdapter.java:36)
at org.apache.lucene.util.TestRuleStoreClassName$1.evaluate(TestRuleStoreClassName.java:41)
at com.carrotsearch.randomizedtesting.rules.NoShadowingOrOverridesOnMethodsRule$1.evaluate(NoShadowingOrOverridesOnMethodsRule.java:40)
at com.carrotsearch.randomizedtesting.rules.NoShadowingOrOverridesOnMethodsRule$1.evaluate(NoShadowingOrOverridesOnMethodsRule.java:40)
at com.carrotsearch.randomizedtesting.rules.StatementAdapter.evaluate(StatementAdapter.java:36)
at com.carrotsearch.randomizedtesting.rules.StatementAdapter.evaluate(StatementAdapter.java:36)
at org.apache.lucene.util.TestRuleAssertionsRequired$1.evaluate(TestRuleAssertionsRequired.java:53)
at org.apache.lucene.util.TestRuleMarkFailure$1.evaluate(TestRuleMarkFailure.java:47)
at org.apache.lucene.util.TestRuleIgnoreAfterMaxFailures$1.evaluate(TestRuleIgnoreAfterMaxFailures.java:64)
at org.apache.lucene.util.TestRuleIgnoreTestSuites$1.evaluate(TestRuleIgnoreTestSuites.java:54)
at com.carrotsearch.randomizedtesting.rules.StatementAdapter.evaluate(StatementAdapter.java:36)
at com.carrotsearch.randomizedtesting.ThreadLeakControl$StatementRunner.run(ThreadLeakControl.java:368)
at java.base/java.lang.Thread.run(Thread.java:830)
Caused by: java.net.SocketTimeoutException: Read timed out
at java.base/java.net.SocketInputStream.socketRead0(Native Method)
at java.base/java.net.SocketInputStream.socketRead(SocketInputStream.java:115)
at java.base/java.net.SocketInputStream.read(SocketInputStream.java:168)
at java.base/java.net.SocketInputStream.read(SocketInputStream.java:140)
at java.base/java.net.Socket$SocketInputStream.read(Socket.java:972)
at org.apache.http.impl.io.SessionInputBufferImpl.streamRead(SessionInputBufferImpl.java:137)
at org.apache.http.impl.io.SessionInputBufferImpl.fillBuffer(SessionInputBufferImpl.java:153)
at org.apache.http.impl.io.SessionInputBufferImpl.readLine(SessionInputBufferImpl.java:282)
at org.apache.http.impl.conn.DefaultHttpResponseParser.parseHead(DefaultHttpResponseParser.java:138)
at org.apache.http.impl.conn.DefaultHttpResponseParser.parseHead(DefaultHttpResponseParser.java:56)
at org.apache.http.impl.io.AbstractMessageParser.parse(AbstractMessageParser.java:259)
at org.apache.http.impl.DefaultBHttpClientConnection.receiveResponseHeader(DefaultBHttpClientConnection.java:163)
at org.apache.http.impl.conn.CPoolProxy.receiveResponseHeader(CPoolProxy.java:165)
at org.apache.http.protocol.HttpRequestExecutor.doReceiveResponse(HttpRequestExecutor.java:273)
at org.apache.http.protocol.HttpRequestExecutor.execute(HttpRequestExecutor.java:125)
at org.apache.http.impl.execchain.MainClientExec.execute(MainClientExec.java:272)
at org.apache.http.impl.execchain.ProtocolExec.execute(ProtocolExec.java:185)
at org.apache.http.impl.execchain.RetryExec.execute(RetryExec.java:89)
at org.apache.http.impl.execchain.RedirectExec.execute(RedirectExec.java:110)
at org.apache.http.impl.client.InternalHttpClient.doExecute(InternalHttpClient.java:185)
at org.apache.http.impl.client.CloseableHttpClient.execute(CloseableHttpClient.java:83)
at org.apache.http.impl.client.CloseableHttpClient.execute(CloseableHttpClient.java:56)
at org.apache.solr.client.solrj.impl.HttpSolrClient.executeMethod(HttpSolrClient.java:555)
... 42 more
FAILED: org.apache.solr.cloud.LeaderFailoverAfterPartitionTest.test
Error Message:
Timeout occurred while waiting response from server at: http://127.0.0.1:41559
Stack Trace:
org.apache.solr.client.solrj.SolrServerException: Timeout occurred while waiting response from server at: http://127.0.0.1:41559
at __randomizedtesting.SeedInfo.seed([76CC894DFD25A044:FE98B69753D9CDBC]:0)
at org.apache.solr.client.solrj.impl.HttpSolrClient.executeMethod(HttpSolrClient.java:667)
at org.apache.solr.client.solrj.impl.HttpSolrClient.request(HttpSolrClient.java:262)
at org.apache.solr.client.solrj.impl.HttpSolrClient.request(HttpSolrClient.java:245)
at org.apache.solr.client.solrj.impl.LBSolrClient.doRequest(LBSolrClient.java:368)
at org.apache.solr.client.solrj.impl.LBSolrClient.request(LBSolrClient.java:296)
at org.apache.solr.client.solrj.impl.BaseCloudSolrClient.sendRequest(BaseCloudSolrClient.java:1068)
at org.apache.solr.client.solrj.impl.BaseCloudSolrClient.requestWithRetryOnStaleState(BaseCloudSolrClient.java:837)
at org.apache.solr.client.solrj.impl.BaseCloudSolrClient.request(BaseCloudSolrClient.java:769)
at org.apache.solr.client.solrj.SolrRequest.process(SolrRequest.java:211)
at org.apache.solr.client.solrj.SolrRequest.process(SolrRequest.java:228)
at org.apache.solr.cloud.AbstractFullDistribZkTestBase.createServers(AbstractFullDistribZkTestBase.java:338)
at org.apache.solr.BaseDistributedSearchTestCase$ShardsRepeatRule$ShardsFixedStatement.callStatement(BaseDistributedSearchTestCase.java:1080)
at org.apache.solr.BaseDistributedSearchTestCase$ShardsRepeatRule$ShardsStatement.evaluate(BaseDistributedSearchTestCase.java:1054)
at com.carrotsearch.randomizedtesting.rules.SystemPropertiesRestoreRule$1.evaluate(SystemPropertiesRestoreRule.java:57)
at org.apache.lucene.util.TestRuleSetupTeardownChained$1.evaluate(TestRuleSetupTeardownChained.java:49)
at org.apache.lucene.util.AbstractBeforeAfterRule$1.evaluate(AbstractBeforeAfterRule.java:45)
at org.apache.lucene.util.TestRuleThreadAndTestName$1.evaluate(TestRuleThreadAndTestName.java:48)
at org.apache.lucene.util.TestRuleIgnoreAfterMaxFailures$1.evaluate(TestRuleIgnoreAfterMaxFailures.java:64)
at org.apache.lucene.util.TestRuleMarkFailure$1.evaluate(TestRuleMarkFailure.java:47)
at com.carrotsearch.randomizedtesting.rules.StatementAdapter.evaluate(StatementAdapter.java:36)
at com.carrotsearch.randomizedtesting.ThreadLeakControl$StatementRunner.run(ThreadLeakControl.java:368)
at com.carrotsearch.randomizedtesting.ThreadLeakControl.forkTimeoutingTask(ThreadLeakControl.java:817)
at com.carrotsearch.randomizedtesting.ThreadLeakControl$3.evaluate(ThreadLeakControl.java:468)
at com.carrotsearch.randomizedtesting.RandomizedRunner.runSingleTest(RandomizedRunner.java:947)
at com.carrotsearch.randomizedtesting.RandomizedRunner$5.evaluate(RandomizedRunner.java:832)
at com.carrotsearch.randomizedtesting.RandomizedRunner$6.evaluate(RandomizedRunner.java:883)
at com.carrotsearch.randomizedtesting.RandomizedRunner$7.evaluate(RandomizedRunner.java:894)
at com.carrotsearch.randomizedtesting.rules.StatementAdapter.evaluate(StatementAdapter.java:36)
at com.carrotsearch.randomizedtesting.rules.SystemPropertiesRestoreRule$1.evaluate(SystemPropertiesRestoreRule.java:57)
at org.apache.lucene.util.AbstractBeforeAfterRule$1.evaluate(AbstractBeforeAfterRule.java:45)
at com.carrotsearch.randomizedtesting.rules.StatementAdapter.evaluate(StatementAdapter.java:36)
at org.apache.lucene.util.TestRuleStoreClassName$1.evaluate(TestRuleStoreClassName.java:41)
at com.carrotsearch.randomizedtesting.rules.NoShadowingOrOverridesOnMethodsRule$1.evaluate(NoShadowingOrOverridesOnMethodsRule.java:40)
at com.carrotsearch.randomizedtesting.rules.NoShadowingOrOverridesOnMethodsRule$1.evaluate(NoShadowingOrOverridesOnMethodsRule.java:40)
at com.carrotsearch.randomizedtesting.rules.StatementAdapter.evaluate(StatementAdapter.java:36)
at com.carrotsearch.randomizedtesting.rules.StatementAdapter.evaluate(StatementAdapter.java:36)
at org.apache.lucene.util.TestRuleAssertionsRequired$1.evaluate(TestRuleAssertionsRequired.java:53)
at org.apache.lucene.util.TestRuleMarkFailure$1.evaluate(TestRuleMarkFailure.java:47)
at org.apache.lucene.util.TestRuleIgnoreAfterMaxFailures$1.evaluate(TestRuleIgnoreAfterMaxFailures.java:64)
at org.apache.lucene.util.TestRuleIgnoreTestSuites$1.evaluate(TestRuleIgnoreTestSuites.java:54)
at com.carrotsearch.randomizedtesting.rules.StatementAdapter.evaluate(StatementAdapter.java:36)
at com.carrotsearch.randomizedtesting.ThreadLeakControl$StatementRunner.run(ThreadLeakControl.java:368)
at java.base/java.lang.Thread.run(Thread.java:830)
Caused by: java.net.SocketTimeoutException: Read timed out
at java.base/java.net.SocketInputStream.socketRead0(Native Method)
at java.base/java.net.SocketInputStream.socketRead(SocketInputStream.java:115)
at java.base/java.net.SocketInputStream.read(SocketInputStream.java:168)
at java.base/java.net.SocketInputStream.read(SocketInputStream.java:140)
at java.base/java.net.Socket$SocketInputStream.read(Socket.java:972)
at org.apache.http.impl.io.SessionInputBufferImpl.streamRead(SessionInputBufferImpl.java:137)
at org.apache.http.impl.io.SessionInputBufferImpl.fillBuffer(SessionInputBufferImpl.java:153)
at org.apache.http.impl.io.SessionInputBufferImpl.readLine(SessionInputBufferImpl.java:282)
at org.apache.http.impl.conn.DefaultHttpResponseParser.parseHead(DefaultHttpResponseParser.java:138)
at org.apache.http.impl.conn.DefaultHttpResponseParser.parseHead(DefaultHttpResponseParser.java:56)
at org.apache.http.impl.io.AbstractMessageParser.parse(AbstractMessageParser.java:259)
at org.apache.http.impl.DefaultBHttpClientConnection.receiveResponseHeader(DefaultBHttpClientConnection.java:163)
at org.apache.http.impl.conn.CPoolProxy.receiveResponseHeader(CPoolProxy.java:165)
at org.apache.http.protocol.HttpRequestExecutor.doReceiveResponse(HttpRequestExecutor.java:273)
at org.apache.http.protocol.HttpRequestExecutor.execute(HttpRequestExecutor.java:125)
at org.apache.http.impl.execchain.MainClientExec.execute(MainClientExec.java:272)
at org.apache.http.impl.execchain.ProtocolExec.execute(ProtocolExec.java:185)
at org.apache.http.impl.execchain.RetryExec.execute(RetryExec.java:89)
at org.apache.http.impl.execchain.RedirectExec.execute(RedirectExec.java:110)
at org.apache.http.impl.client.InternalHttpClient.doExecute(InternalHttpClient.java:185)
at org.apache.http.impl.client.CloseableHttpClient.execute(CloseableHttpClient.java:83)
at org.apache.http.impl.client.CloseableHttpClient.execute(CloseableHttpClient.java:56)
at org.apache.solr.client.solrj.impl.HttpSolrClient.executeMethod(HttpSolrClient.java:555)
... 42 more
FAILED: org.apache.solr.handler.dataimport.TestContentStreamDataSource.testCommitWithin
Error Message:
expected:<0> but was:<2>
Stack Trace:
java.lang.AssertionError: expected:<0> but was:<2>
at __randomizedtesting.SeedInfo.seed([A206EE3319F95A6D:18D4814B9AD7B478]:0)
at org.junit.Assert.fail(Assert.java:88)
at org.junit.Assert.failNotEquals(Assert.java:834)
at org.junit.Assert.assertEquals(Assert.java:645)
at org.junit.Assert.assertEquals(Assert.java:631)
at org.apache.solr.handler.dataimport.TestContentStreamDataSource.testCommitWithin(TestContentStreamDataSource.java:98)
at java.base/jdk.internal.reflect.NativeMethodAccessorImpl.invoke0(Native Method)
at java.base/jdk.internal.reflect.NativeMethodAccessorImpl.invoke(NativeMethodAccessorImpl.java:62)
at java.base/jdk.internal.reflect.DelegatingMethodAccessorImpl.invoke(DelegatingMethodAccessorImpl.java:43)
at java.base/java.lang.reflect.Method.invoke(Method.java:567)
at com.carrotsearch.randomizedtesting.RandomizedRunner.invoke(RandomizedRunner.java:1750)
at com.carrotsearch.randomizedtesting.RandomizedRunner$8.evaluate(RandomizedRunner.java:938)
at com.carrotsearch.randomizedtesting.RandomizedRunner$9.evaluate(RandomizedRunner.java:974)
at com.carrotsearch.randomizedtesting.RandomizedRunner$10.evaluate(RandomizedRunner.java:988)
at com.carrotsearch.randomizedtesting.rules.SystemPropertiesRestoreRule$1.evaluate(SystemPropertiesRestoreRule.java:57)
at org.apache.lucene.util.TestRuleSetupTeardownChained$1.evaluate(TestRuleSetupTeardownChained.java:49)
at org.apache.lucene.util.AbstractBeforeAfterRule$1.evaluate(AbstractBeforeAfterRule.java:45)
at org.apache.lucene.util.TestRuleThreadAndTestName$1.evaluate(TestRuleThreadAndTestName.java:48)
at org.apache.lucene.util.TestRuleIgnoreAfterMaxFailures$1.evaluate(TestRuleIgnoreAfterMaxFailures.java:64)
at org.apache.lucene.util.TestRuleMarkFailure$1.evaluate(TestRuleMarkFailure.java:47)
at com.carrotsearch.randomizedtesting.rules.StatementAdapter.evaluate(StatementAdapter.java:36)
at com.carrotsearch.randomizedtesting.ThreadLeakControl$StatementRunner.run(ThreadLeakControl.java:368)
at com.carrotsearch.randomizedtesting.ThreadLeakControl.forkTimeoutingTask(ThreadLeakControl.java:817)
at com.carrotsearch.randomizedtesting.ThreadLeakControl$3.evaluate(ThreadLeakControl.java:468)
at com.carrotsearch.randomizedtesting.RandomizedRunner.runSingleTest(RandomizedRunner.java:947)
at com.carrotsearch.randomizedtesting.RandomizedRunner$5.evaluate(RandomizedRunner.java:832)
at com.carrotsearch.randomizedtesting.RandomizedRunner$6.evaluate(RandomizedRunner.java:883)
at com.carrotsearch.randomizedtesting.RandomizedRunner$7.evaluate(RandomizedRunner.java:894)
at com.carrotsearch.randomizedtesting.rules.StatementAdapter.evaluate(StatementAdapter.java:36)
at com.carrotsearch.randomizedtesting.rules.SystemPropertiesRestoreRule$1.evaluate(SystemPropertiesRestoreRule.java:57)
at org.apache.lucene.util.AbstractBeforeAfterRule$1.evaluate(AbstractBeforeAfterRule.java:45)
at com.carrotsearch.randomizedtesting.rules.StatementAdapter.evaluate(StatementAdapter.java:36)
at org.apache.lucene.util.TestRuleStoreClassName$1.evaluate(TestRuleStoreClassName.java:41)
at com.carrotsearch.randomizedtesting.rules.NoShadowingOrOverridesOnMethodsRule$1.evaluate(NoShadowingOrOverridesOnMethodsRule.java:40)
at com.carrotsearch.randomizedtesting.rules.NoShadowingOrOverridesOnMethodsRule$1.evaluate(NoShadowingOrOverridesOnMethodsRule.java:40)
at com.carrotsearch.randomizedtesting.rules.StatementAdapter.evaluate(StatementAdapter.java:36)
at com.carrotsearch.randomizedtesting.rules.StatementAdapter.evaluate(StatementAdapter.java:36)
at org.apache.lucene.util.TestRuleAssertionsRequired$1.evaluate(TestRuleAssertionsRequired.java:53)
at org.apache.lucene.util.TestRuleMarkFailure$1.evaluate(TestRuleMarkFailure.java:47)
at org.apache.lucene.util.TestRuleIgnoreAfterMaxFailures$1.evaluate(TestRuleIgnoreAfterMaxFailures.java:64)
at org.apache.lucene.util.TestRuleIgnoreTestSuites$1.evaluate(TestRuleIgnoreTestSuites.java:54)
at com.carrotsearch.randomizedtesting.rules.StatementAdapter.evaluate(StatementAdapter.java:36)
at com.carrotsearch.randomizedtesting.ThreadLeakControl$StatementRunner.run(ThreadLeakControl.java:368)
at java.base/java.lang.Thread.run(Thread.java:830)
FAILED: org.apache.solr.security.BasicAuthIntegrationTest.testBasicAuth
Error Message:
must have failed
Stack Trace:
java.lang.AssertionError: must have failed
at __randomizedtesting.SeedInfo.seed([76CC894DFD25A044:CAA2FF5F5976233E]:0)
at org.junit.Assert.fail(Assert.java:88)
at org.apache.solr.security.BasicAuthIntegrationTest.testBasicAuth(BasicAuthIntegrationTest.java:204)
at java.base/jdk.internal.reflect.NativeMethodAccessorImpl.invoke0(Native Method)
at java.base/jdk.internal.reflect.NativeMethodAccessorImpl.invoke(NativeMethodAccessorImpl.java:62)
at java.base/jdk.internal.reflect.DelegatingMethodAccessorImpl.invoke(DelegatingMethodAccessorImpl.java:43)
at java.base/java.lang.reflect.Method.invoke(Method.java:567)
at com.carrotsearch.randomizedtesting.RandomizedRunner.invoke(RandomizedRunner.java:1750)
at com.carrotsearch.randomizedtesting.RandomizedRunner$8.evaluate(RandomizedRunner.java:938)
at com.carrotsearch.randomizedtesting.RandomizedRunner$9.evaluate(RandomizedRunner.java:974)
at com.carrotsearch.randomizedtesting.RandomizedRunner$10.evaluate(RandomizedRunner.java:988)
at com.carrotsearch.randomizedtesting.rules.SystemPropertiesRestoreRule$1.evaluate(SystemPropertiesRestoreRule.java:57)
at org.apache.lucene.util.TestRuleSetupTeardownChained$1.evaluate(TestRuleSetupTeardownChained.java:49)
at org.apache.lucene.util.AbstractBeforeAfterRule$1.evaluate(AbstractBeforeAfterRule.java:45)
at org.apache.lucene.util.TestRuleThreadAndTestName$1.evaluate(TestRuleThreadAndTestName.java:48)
at org.apache.lucene.util.TestRuleIgnoreAfterMaxFailures$1.evaluate(TestRuleIgnoreAfterMaxFailures.java:64)
at org.apache.lucene.util.TestRuleMarkFailure$1.evaluate(TestRuleMarkFailure.java:47)
at com.carrotsearch.randomizedtesting.rules.StatementAdapter.evaluate(StatementAdapter.java:36)
at com.carrotsearch.randomizedtesting.ThreadLeakControl$StatementRunner.run(ThreadLeakControl.java:368)
at com.carrotsearch.randomizedtesting.ThreadLeakControl.forkTimeoutingTask(ThreadLeakControl.java:817)
at com.carrotsearch.randomizedtesting.ThreadLeakControl$3.evaluate(ThreadLeakControl.java:468)
at com.carrotsearch.randomizedtesting.RandomizedRunner.runSingleTest(RandomizedRunner.java:947)
at com.carrotsearch.randomizedtesting.RandomizedRunner$5.evaluate(RandomizedRunner.java:832)
at com.carrotsearch.randomizedtesting.RandomizedRunner$6.evaluate(RandomizedRunner.java:883)
at com.carrotsearch.randomizedtesting.RandomizedRunner$7.evaluate(RandomizedRunner.java:894)
at com.carrotsearch.randomizedtesting.rules.StatementAdapter.evaluate(StatementAdapter.java:36)
at com.carrotsearch.randomizedtesting.rules.SystemPropertiesRestoreRule$1.evaluate(SystemPropertiesRestoreRule.java:57)
at org.apache.lucene.util.AbstractBeforeAfterRule$1.evaluate(AbstractBeforeAfterRule.java:45)
at com.carrotsearch.randomizedtesting.rules.StatementAdapter.evaluate(StatementAdapter.java:36)
at org.apache.lucene.util.TestRuleStoreClassName$1.evaluate(TestRuleStoreClassName.java:41)
at com.carrotsearch.randomizedtesting.rules.NoShadowingOrOverridesOnMethodsRule$1.evaluate(NoShadowingOrOverridesOnMethodsRule.java:40)
at com.carrotsearch.randomizedtesting.rules.NoShadowingOrOverridesOnMethodsRule$1.evaluate(NoShadowingOrOverridesOnMethodsRule.java:40)
at com.carrotsearch.randomizedtesting.rules.StatementAdapter.evaluate(StatementAdapter.java:36)
at com.carrotsearch.randomizedtesting.rules.StatementAdapter.evaluate(StatementAdapter.java:36)
at org.apache.lucene.util.TestRuleAssertionsRequired$1.evaluate(TestRuleAssertionsRequired.java:53)
at org.apache.lucene.util.TestRuleMarkFailure$1.evaluate(TestRuleMarkFailure.java:47)
at org.apache.lucene.util.TestRuleIgnoreAfterMaxFailures$1.evaluate(TestRuleIgnoreAfterMaxFailures.java:64)
at org.apache.lucene.util.TestRuleIgnoreTestSuites$1.evaluate(TestRuleIgnoreTestSuites.java:54)
at com.carrotsearch.randomizedtesting.rules.StatementAdapter.evaluate(StatementAdapter.java:36)
at com.carrotsearch.randomizedtesting.ThreadLeakControl$StatementRunner.run(ThreadLeakControl.java:368)
at java.base/java.lang.Thread.run(Thread.java:830)
Build Log:
[...truncated 2028 lines...]
[junit4] JVM J0: stderr was not empty, see: /home/jenkins/workspace/Lucene-Solr-master-Linux/lucene/build/core/test/temp/junit4-J0-20190605_113206_3608982351883493932016.syserr
[junit4] >>> JVM J0 emitted unexpected output (verbatim) ----
[junit4] OpenJDK 64-Bit Server VM warning: Option UseConcMarkSweepGC was deprecated in version 9.0 and will likely be removed in a future release.
[junit4] <<< JVM J0: EOF ----
[...truncated 3 lines...]
[junit4] JVM J1: stderr was not empty, see: /home/jenkins/workspace/Lucene-Solr-master-Linux/lucene/build/core/test/temp/junit4-J1-20190605_113206_3662322676411683998810.syserr
[junit4] >>> JVM J1 emitted unexpected output (verbatim) ----
[junit4] OpenJDK 64-Bit Server VM warning: Option UseConcMarkSweepGC was deprecated in version 9.0 and will likely be removed in a future release.
[junit4] <<< JVM J1: EOF ----
[...truncated 5 lines...]
[junit4] JVM J2: stderr was not empty, see: /home/jenkins/workspace/Lucene-Solr-master-Linux/lucene/build/core/test/temp/junit4-J2-20190605_113206_36317829451751770372720.syserr
[junit4] >>> JVM J2 emitted unexpected output (verbatim) ----
[junit4] OpenJDK 64-Bit Server VM warning: Option UseConcMarkSweepGC was deprecated in version 9.0 and will likely be removed in a future release.
[junit4] <<< JVM J2: EOF ----
[...truncated 302 lines...]
[junit4] JVM J0: stderr was not empty, see: /home/jenkins/workspace/Lucene-Solr-master-Linux/lucene/build/test-framework/test/temp/junit4-J0-20190605_120018_4119988199759813168021.syserr
[junit4] >>> JVM J0 emitted unexpected output (verbatim) ----
[junit4] OpenJDK 64-Bit Server VM warning: Option UseConcMarkSweepGC was deprecated in version 9.0 and will likely be removed in a future release.
[junit4] <<< JVM J0: EOF ----
[...truncated 3 lines...]
[junit4] JVM J1: stderr was not empty, see: /home/jenkins/workspace/Lucene-Solr-master-Linux/lucene/build/test-framework/test/temp/junit4-J1-20190605_120018_4113571878547522992566.syserr
[junit4] >>> JVM J1 emitted unexpected output (verbatim) ----
[junit4] OpenJDK 64-Bit Server VM warning: Option UseConcMarkSweepGC was deprecated in version 9.0 and will likely be removed in a future release.
[junit4] <<< JVM J1: EOF ----
[...truncated 3 lines...]
[junit4] JVM J2: stderr was not empty, see: /home/jenkins/workspace/Lucene-Solr-master-Linux/lucene/build/test-framework/test/temp/junit4-J2-20190605_120018_4124291401675651406321.syserr
[junit4] >>> JVM J2 emitted unexpected output (verbatim) ----
[junit4] OpenJDK 64-Bit Server VM warning: Option UseConcMarkSweepGC was deprecated in version 9.0 and will likely be removed in a future release.
[junit4] <<< JVM J2: EOF ----
[...truncated 1076 lines...]
[junit4] JVM J1: stderr was not empty, see: /home/jenkins/workspace/Lucene-Solr-master-Linux/lucene/build/analysis/common/test/temp/junit4-J1-20190605_120521_6546203582729385065634.syserr
[junit4] >>> JVM J1 emitted unexpected output (verbatim) ----
[junit4] OpenJDK 64-Bit Server VM warning: Option UseConcMarkSweepGC was deprecated in version 9.0 and will likely be removed in a future release.
[junit4] <<< JVM J1: EOF ----
[...truncated 3 lines...]
[junit4] JVM J0: stderr was not empty, see: /home/jenkins/workspace/Lucene-Solr-master-Linux/lucene/build/analysis/common/test/temp/junit4-J0-20190605_120521_65412629266576679186156.syserr
[junit4] >>> JVM J0 emitted unexpected output (verbatim) ----
[junit4] OpenJDK 64-Bit Server VM warning: Option UseConcMarkSweepGC was deprecated in version 9.0 and will likely be removed in a future release.
[junit4] <<< JVM J0: EOF ----
[...truncated 3 lines...]
[junit4] JVM J2: stderr was not empty, see: /home/jenkins/workspace/Lucene-Solr-master-Linux/lucene/build/analysis/common/test/temp/junit4-J2-20190605_120521_65510447904866225510941.syserr
[junit4] >>> JVM J2 emitted unexpected output (verbatim) ----
[junit4] OpenJDK 64-Bit Server VM warning: Option UseConcMarkSweepGC was deprecated in version 9.0 and will likely be removed in a future release.
[junit4] <<< JVM J2: EOF ----
[...truncated 241 lines...]
[junit4] JVM J0: stderr was not empty, see: /home/jenkins/workspace/Lucene-Solr-master-Linux/lucene/build/analysis/icu/test/temp/junit4-J0-20190605_121005_8415178573646096880403.syserr
[junit4] >>> JVM J0 emitted unexpected output (verbatim) ----
[junit4] OpenJDK 64-Bit Server VM warning: Option UseConcMarkSweepGC was deprecated in version 9.0 and will likely be removed in a future release.
[junit4] <<< JVM J0: EOF ----
[...truncated 3 lines...]
[junit4] JVM J1: stderr was not empty, see: /home/jenkins/workspace/Lucene-Solr-master-Linux/lucene/build/analysis/icu/test/temp/junit4-J1-20190605_121005_84116501493402092856097.syserr
[junit4] >>> JVM J1 emitted unexpected output (verbatim) ----
[junit4] OpenJDK 64-Bit Server VM warning: Option UseConcMarkSweepGC was deprecated in version 9.0 and will likely be removed in a future release.
[junit4] <<< JVM J1: EOF ----
[...truncated 3 lines...]
[junit4] JVM J2: stderr was not empty, see: /home/jenkins/workspace/Lucene-Solr-master-Linux/lucene/build/analysis/icu/test/temp/junit4-J2-20190605_121005_84116871844112289131945.syserr
[junit4] >>> JVM J2 emitted unexpected output (verbatim) ----
[junit4] OpenJDK 64-Bit Server VM warning: Option UseConcMarkSweepGC was deprecated in version 9.0 and will likely be removed in a future release.
[junit4] <<< JVM J2: EOF ----
[...truncated 247 lines...]
[junit4] JVM J1: stderr was not empty, see: /home/jenkins/workspace/Lucene-Solr-master-Linux/lucene/build/analysis/kuromoji/test/temp/junit4-J1-20190605_121051_7566475939218218399958.syserr
[junit4] >>> JVM J1 emitted unexpected output (verbatim) ----
[junit4] OpenJDK 64-Bit Server VM warning: Option UseConcMarkSweepGC was deprecated in version 9.0 and will likely be removed in a future release.
[junit4] <<< JVM J1: EOF ----
[...truncated 3 lines...]
[junit4] JVM J2: stderr was not empty, see: /home/jenkins/workspace/Lucene-Solr-master-Linux/lucene/build/analysis/kuromoji/test/temp/junit4-J2-20190605_121051_7564593518193325960480.syserr
[junit4] >>> JVM J2 emitted unexpected output (verbatim) ----
[junit4] OpenJDK 64-Bit Server VM warning: Option UseConcMarkSweepGC was deprecated in version 9.0 and will likely be removed in a future release.
[junit4] <<< JVM J2: EOF ----
[...truncated 5 lines...]
[junit4] JVM J0: stderr was not empty, see: /home/jenkins/workspace/Lucene-Solr-master-Linux/lucene/build/analysis/kuromoji/test/temp/junit4-J0-20190605_121051_7564566046623323044708.syserr
[junit4] >>> JVM J0 emitted unexpected output (verbatim) ----
[junit4] OpenJDK 64-Bit Server VM warning: Option UseConcMarkSweepGC was deprecated in version 9.0 and will likely be removed in a future release.
[junit4] <<< JVM J0: EOF ----
[...truncated 160 lines...]
[junit4] JVM J0: stderr was not empty, see: /home/jenkins/workspace/Lucene-Solr-master-Linux/lucene/build/analysis/morfologik/test/temp/junit4-J0-20190605_121159_8264678124718119102528.syserr
[junit4] JVM J2: stderr was not empty, see: /home/jenkins/workspace/Lucene-Solr-master-Linux/lucene/build/analysis/morfologik/test/temp/junit4-J2-20190605_121159_82812781074967496270864.syserr
[junit4] JVM J1: stderr was not empty, see: /home/jenkins/workspace/Lucene-Solr-master-Linux/lucene/build/analysis/morfologik/test/temp/junit4-J1-20190605_121159_8485021560194948698425.syserr
[junit4] >>> JVM J2 emitted unexpected output (verbatim) ----
[junit4] OpenJDK 64-Bit Server VM warning: Option UseConcMarkSweepGC was deprecated in version 9.0 and will likely be removed in a future release.
[junit4] <<< JVM J2: EOF ----
[...truncated 209 lines...]
[junit4] JVM J2: stderr was not empty, see: /home/jenkins/workspace/Lucene-Solr-master-Linux/lucene/build/analysis/nori/test/temp/junit4-J2-20190605_121222_4198611477642997761906.syserr
[junit4] >>> JVM J2 emitted unexpected output (verbatim) ----
[junit4] OpenJDK 64-Bit Server VM warning: Option UseConcMarkSweepGC was deprecated in version 9.0 and will likely be removed in a future release.
[junit4] <<< JVM J2: EOF ----
[junit4] JVM J0: stderr was not empty, see: /home/jenkins/workspace/Lucene-Solr-master-Linux/lucene/build/analysis/nori/test/temp/junit4-J0-20190605_121222_41714767276866002607742.syserr
[junit4] >>> JVM J0 emitted unexpected output (verbatim) ----
[junit4] OpenJDK 64-Bit Server VM warning: Option UseConcMarkSweepGC was deprecated in version 9.0 and will likely be removed in a future release.
[junit4] <<< JVM J0: EOF ----
[...truncated 6 lines...]
[junit4] JVM J1: stderr was not empty, see: /home/jenkins/workspace/Lucene-Solr-master-Linux/lucene/build/analysis/nori/test/temp/junit4-J1-20190605_121222_41718138349557197635434.syserr
[junit4] >>> JVM J1 emitted unexpected output (verbatim) ----
[junit4] OpenJDK 64-Bit Server VM warning: Option UseConcMarkSweepGC was deprecated in version 9.0 and will likely be removed in a future release.
[junit4] <<< JVM J1: EOF ----
[...truncated 160 lines...]
[junit4] JVM J2: stderr was not empty, see: /home/jenkins/workspace/Lucene-Solr-master-Linux/lucene/build/analysis/opennlp/test/temp/junit4-J2-20190605_121259_1296182036806261657965.syserr
[junit4] >>> JVM J2 emitted unexpected output (verbatim) ----
[junit4] OpenJDK 64-Bit Server VM warning: Option UseConcMarkSweepGC was deprecated in version 9.0 and will likely be removed in a future release.
[junit4] <<< JVM J2: EOF ----
[...truncated 3 lines...]
[junit4] JVM J1: stderr was not empty, see: /home/jenkins/workspace/Lucene-Solr-master-Linux/lucene/build/analysis/opennlp/test/temp/junit4-J1-20190605_121259_12918052663155214036530.syserr
[junit4] >>> JVM J1 emitted unexpected output (verbatim) ----
[junit4] OpenJDK 64-Bit Server VM warning: Option UseConcMarkSweepGC was deprecated in version 9.0 and will likely be removed in a future release.
[junit4] <<< JVM J1: EOF ----
[...truncated 3 lines...]
[junit4] JVM J0: stderr was not empty, see: /home/jenkins/workspace/Lucene-Solr-master-Linux/lucene/build/analysis/opennlp/test/temp/junit4-J0-20190605_121259_1291557427723314339306.syserr
[junit4] >>> JVM J0 emitted unexpected output (verbatim) ----
[junit4] OpenJDK 64-Bit Server VM warning: Option UseConcMarkSweepGC was deprecated in version 9.0 and will likely be removed in a future release.
[junit4] <<< JVM J0: EOF ----
[...truncated 171 lines...]
[junit4] JVM J0: stderr was not empty, see: /home/jenkins/workspace/Lucene-Solr-master-Linux/lucene/build/analysis/phonetic/test/temp/junit4-J0-20190605_121317_12215880646703372113249.syserr
[junit4] >>> JVM J0 emitted unexpected output (verbatim) ----
[junit4] OpenJDK 64-Bit Server VM warning: Option UseConcMarkSweepGC was deprecated in version 9.0 and will likely be removed in a future release.
[junit4] <<< JVM J0: EOF ----
[junit4] JVM J1: stderr was not empty, see: /home/jenkins/workspace/Lucene-Solr-master-Linux/lucene/build/analysis/phonetic/test/temp/junit4-J1-20190605_121317_12216399951372849768242.syserr
[junit4] >>> JVM J1 emitted unexpected output (verbatim) ----
[junit4] OpenJDK 64-Bit Server VM warning: Option UseConcMarkSweepGC was deprecated in version 9.0 and will likely be removed in a future release.
[junit4] <<< JVM J1: EOF ----
[...truncated 3 lines...]
[junit4] JVM J2: stderr was not empty, see: /home/jenkins/workspace/Lucene-Solr-master-Linux/lucene/build/analysis/phonetic/test/temp/junit4-J2-20190605_121317_122549659605132567476.syserr
[junit4] >>> JVM J2 emitted unexpected output (verbatim) ----
[junit4] OpenJDK 64-Bit Server VM warning: Option UseConcMarkSweepGC was deprecated in version 9.0 and will likely be removed in a future release.
[junit4] <<< JVM J2: EOF ----
[...truncated 153 lines...]
[junit4] JVM J0: stderr was not empty, see: /home/jenkins/workspace/Lucene-Solr-master-Linux/lucene/build/analysis/smartcn/test/temp/junit4-J0-20190605_121353_8404675763403001055149.syserr
[junit4] >>> JVM J0 emitted unexpected output (verbatim) ----
[junit4] OpenJDK 64-Bit Server VM warning: Option UseConcMarkSweepGC was deprecated in version 9.0 and will likely be removed in a future release.
[junit4] <<< JVM J0: EOF ----
[...truncated 3 lines...]
[junit4] JVM J1: stderr was not empty, see: /home/jenkins/workspace/Lucene-Solr-master-Linux/lucene/build/analysis/smartcn/test/temp/junit4-J1-20190605_121353_8405930714104447104996.syserr
[junit4] >>> JVM J1 emitted unexpected output (verbatim) ----
[junit4] OpenJDK 64-Bit Server VM warning: Option UseConcMarkSweepGC was deprecated in version 9.0 and will likely be removed in a future release.
[junit4] <<< JVM J1: EOF ----
[...truncated 157 lines...]
[junit4] JVM J2: stderr was not empty, see: /home/jenkins/workspace/Lucene-Solr-master-Linux/lucene/build/analysis/stempel/test/temp/junit4-J2-20190605_121428_8727594257432070513275.syserr
[junit4] >>> JVM J2 emitted unexpected output (verbatim) ----
[junit4] JVM J1: stderr was not empty, see: /home/jenkins/workspace/Lucene-Solr-master-Linux/lucene/build/analysis/stempel/test/temp/junit4-J1-20190605_121428_8728913173874559067196.syserr
[junit4] OpenJDK 64-Bit Server VM warning: Option UseConcMarkSweepGC was deprecated in version 9.0 and will likely be removed in a future release.
[junit4] <<< JVM J2: EOF ----
[...truncated 6 lines...]
[junit4] JVM J0: stderr was not empty, see: /home/jenkins/workspace/Lucene-Solr-master-Linux/lucene/build/analysis/stempel/test/temp/junit4-J0-20190605_121428_87216470295827220270644.syserr
[junit4] >>> JVM J0 emitted unexpected output (verbatim) ----
[junit4] OpenJDK 64-Bit Server VM warning: Option UseConcMarkSweepGC was deprecated in version 9.0 and will likely be removed in a future release.
[junit4] <<< JVM J0: EOF ----
[...truncated 178 lines...]
[junit4] JVM J0: stderr was not empty, see: /home/jenkins/workspace/Lucene-Solr-master-Linux/lucene/build/backward-codecs/test/temp/junit4-J0-20190605_121446_7035705824812402372131.syserr
[junit4] >>> JVM J0 emitted unexpected output (verbatim) ----
[junit4] OpenJDK 64-Bit Server VM warning: Option UseConcMarkSweepGC was deprecated in version 9.0 and will likely be removed in a future release.
[junit4] <<< JVM J0: EOF ----
[...truncated 9 lines...]
[junit4] JVM J2: stderr was not empty, see: /home/jenkins/workspace/Lucene-Solr-master-Linux/lucene/build/backward-codecs/test/temp/junit4-J2-20190605_121446_7048035004924556219658.syserr
[junit4] >>> JVM J2 emitted unexpected output (verbatim) ----
[junit4] OpenJDK 64-Bit Server VM warning: Option UseConcMarkSweepGC was deprecated in version 9.0 and will likely be removed in a future release.
[junit4] <<< JVM J2: EOF ----
[...truncated 9 lines...]
[junit4] JVM J1: stderr was not empty, see: /home/jenkins/workspace/Lucene-Solr-master-Linux/lucene/build/backward-codecs/test/temp/junit4-J1-20190605_121446_7049935370144638744806.syserr
[junit4] >>> JVM J1 emitted unexpected output (verbatim) ----
[junit4] OpenJDK 64-Bit Server VM warning: Option UseConcMarkSweepGC was deprecated in version 9.0 and will likely be removed in a future release.
[junit4] <<< JVM J1: EOF ----
[...truncated 1434 lines...]
[junit4] JVM J2: stderr was not empty, see: /home/jenkins/workspace/Lucene-Solr-master-Linux/lucene/build/benchmark/test/temp/junit4-J2-20190605_122058_4627204415324020164843.syserr
[junit4] >>> JVM J2 emitted unexpected output (verbatim) ----
[junit4] OpenJDK 64-Bit Server VM warning: Option UseConcMarkSweepGC was deprecated in version 9.0 and will likely be removed in a future release.
[junit4] <<< JVM J2: EOF ----
[...truncated 3 lines...]
[junit4] JVM J1: stderr was not empty, see: /home/jenkins/workspace/Lucene-Solr-master-Linux/lucene/build/benchmark/test/temp/junit4-J1-20190605_122058_4623523586107329584501.syserr
[junit4] >>> JVM J1 emitted unexpected output (verbatim) ----
[junit4] OpenJDK 64-Bit Server VM warning: Option UseConcMarkSweepGC was deprecated in version 9.0 and will likely be removed in a future release.
[junit4] <<< JVM J1: EOF ----
[...truncated 6 lines...]
[junit4] JVM J0: stderr was not empty, see: /home/jenkins/workspace/Lucene-Solr-master-Linux/lucene/build/benchmark/test/temp/junit4-J0-20190605_122058_462143667054703459927.syserr
[junit4] >>> JVM J0 emitted unexpected output (verbatim) ----
[junit4] OpenJDK 64-Bit Server VM warning: Option UseConcMarkSweepGC was deprecated in version 9.0 and will likely be removed in a future release.
[junit4] <<< JVM J0: EOF ----
[...truncated 235 lines...]
[junit4] JVM J0: stderr was not empty, see: /home/jenkins/workspace/Lucene-Solr-master-Linux/lucene/build/classification/test/temp/junit4-J0-20190605_122141_8342150753217809033358.syserr
[junit4] >>> JVM J0 emitted unexpected output (verbatim) ----
[junit4] OpenJDK 64-Bit Server VM warning: Option UseConcMarkSweepGC was deprecated in version 9.0 and will likely be removed in a future release.
[junit4] <<< JVM J0: EOF ----
[...truncated 3 lines...]
[junit4] JVM J1: stderr was not empty, see: /home/jenkins/workspace/Lucene-Solr-master-Linux/lucene/build/classification/test/temp/junit4-J1-20190605_122141_8354439719541605170359.syserr
[junit4] >>> JVM J1 emitted unexpected output (verbatim) ----
[junit4] OpenJDK 64-Bit Server VM warning: Option UseConcMarkSweepGC was deprecated in version 9.0 and will likely be removed in a future release.
[junit4] <<< JVM J1: EOF ----
[...truncated 3 lines...]
[junit4] JVM J2: stderr was not empty, see: /home/jenkins/workspace/Lucene-Solr-master-Linux/lucene/build/classification/test/temp/junit4-J2-20190605_122141_83514399696252099211592.syserr
[junit4] >>> JVM J2 emitted unexpected output (verbatim) ----
[junit4] OpenJDK 64-Bit Server VM warning: Option UseConcMarkSweepGC was deprecated in version 9.0 and will likely be removed in a future release.
[junit4] <<< JVM J2: EOF ----
[...truncated 260 lines...]
[junit4] JVM J2: stderr was not empty, see: /home/jenkins/workspace/Lucene-Solr-master-Linux/lucene/build/codecs/test/temp/junit4-J2-20190605_122239_73714367527297634700594.syserr
[junit4] >>> JVM J2 emitted unexpected output (verbatim) ----
[junit4] OpenJDK 64-Bit Server VM warning: Option UseConcMarkSweepGC was deprecated in version 9.0 and will likely be removed in a future release.
[junit4] <<< JVM J2: EOF ----
[...truncated 4 lines...]
[junit4] JVM J1: stderr was not empty, see: /home/jenkins/workspace/Lucene-Solr-master-Linux/lucene/build/codecs/test/temp/junit4-J1-20190605_122239_73713231236694669515656.syserr
[junit4] >>> JVM J1 emitted unexpected output (verbatim) ----
[junit4] OpenJDK 64-Bit Server VM warning: Option UseConcMarkSweepGC was deprecated in version 9.0 and will likely be removed in a future release.
[junit4] <<< JVM J1: EOF ----
[...truncated 3 lines...]
[junit4] JVM J0: stderr was not empty, see: /home/jenkins/workspace/Lucene-Solr-master-Linux/lucene/build/codecs/test/temp/junit4-J0-20190605_122239_7371395440669671827808.syserr
[junit4] >>> JVM J0 emitted unexpected output (verbatim) ----
[junit4] OpenJDK 64-Bit Server VM warning: Option UseConcMarkSweepGC was deprecated in version 9.0 and will likely be removed in a future release.
[junit4] <<< JVM J0: EOF ----
[...truncated 206 lines...]
[junit4] JVM J0: stderr was not empty, see: /home/jenkins/workspace/Lucene-Solr-master-Linux/lucene/build/demo/test/temp/junit4-J0-20190605_123001_9475417280797303157412.syserr
[junit4] >>> JVM J0 emitted unexpected output (verbatim) ----
[junit4] OpenJDK 64-Bit Server VM warning: Option UseConcMarkSweepGC was deprecated in version 9.0 and will likely be removed in a future release.
[junit4] <<< JVM J0: EOF ----
[...truncated 6 lines...]
[junit4] JVM J1: stderr was not empty, see: /home/jenkins/workspace/Lucene-Solr-master-Linux/lucene/build/demo/test/temp/junit4-J1-20190605_123001_94716830757943975062681.syserr
[junit4] >>> JVM J1 emitted unexpected output (verbatim) ----
[junit4] OpenJDK 64-Bit Server VM warning: Option UseConcMarkSweepGC was deprecated in version 9.0 and will likely be removed in a future release.
[junit4] <<< JVM J1: EOF ----
[junit4] JVM J2: stderr was not empty, see: /home/jenkins/workspace/Lucene-Solr-master-Linux/lucene/build/demo/test/temp/junit4-J2-20190605_123001_9476328940203558622722.syserr
[junit4] >>> JVM J2 emitted unexpected output (verbatim) ----
[junit4] OpenJDK 64-Bit Server VM warning: Option UseConcMarkSweepGC was deprecated in version 9.0 and will likely be removed in a future release.
[junit4] <<< JVM J2: EOF ----
[...truncated 170 lines...]
[junit4] JVM J1: stderr was not empty, see: /home/jenkins/workspace/Lucene-Solr-master-Linux/lucene/build/expressions/test/temp/junit4-J1-20190605_123023_920652405612957333180.syserr
[junit4] >>> JVM J1 emitted unexpected output (verbatim) ----
[junit4] OpenJDK 64-Bit Server VM warning: Option UseConcMarkSweepGC was deprecated in version 9.0 and will likely be removed in a future release.
[junit4] <<< JVM J1: EOF ----
[...truncated 3 lines...]
[junit4] JVM J0: stderr was not empty, see: /home/jenkins/workspace/Lucene-Solr-master-Linux/lucene/build/expressions/test/temp/junit4-J0-20190605_123023_919309030069906552086.syserr
[junit4] >>> JVM J0 emitted unexpected output (verbatim) ----
[junit4] OpenJDK 64-Bit Server VM warning: Option UseConcMarkSweepGC was deprecated in version 9.0 and will likely be removed in a future release.
[junit4] <<< JVM J0: EOF ----
[...truncated 3 lines...]
[junit4] JVM J2: stderr was not empty, see: /home/jenkins/workspace/Lucene-Solr-master-Linux/lucene/build/expressions/test/temp/junit4-J2-20190605_123023_9196729403678285156185.syserr
[junit4] >>> JVM J2 emitted unexpected output (verbatim) ----
[junit4] OpenJDK 64-Bit Server VM warning: Option UseConcMarkSweepGC was deprecated in version 9.0 and will likely be removed in a future release.
[junit4] <<< JVM J2: EOF ----
[...truncated 218 lines...]
[junit4] JVM J2: stderr was not empty, see: /home/jenkins/workspace/Lucene-Solr-master-Linux/lucene/build/facet/test/temp/junit4-J2-20190605_123059_343379956616236528962.syserr
[junit4] >>> JVM J2 emitted unexpected output (verbatim) ----
[junit4] OpenJDK 64-Bit Server VM warning: Option UseConcMarkSweepGC was deprecated in version 9.0 and will likely be removed in a future release.
[junit4] <<< JVM J2: EOF ----
[...truncated 3 lines...]
[junit4] JVM J1: stderr was not empty, see: /home/jenkins/workspace/Lucene-Solr-master-Linux/lucene/build/facet/test/temp/junit4-J1-20190605_123059_3437760158485698287568.syserr
[junit4] >>> JVM J1 emitted unexpected output (verbatim) ----
[junit4] OpenJDK 64-Bit Server VM warning: Option UseConcMarkSweepGC was deprecated in version 9.0 and will likely be removed in a future release.
[junit4] <<< JVM J1: EOF ----
[...truncated 11 lines...]
[junit4] JVM J0: stderr was not empty, see: /home/jenkins/workspace/Lucene-Solr-master-Linux/lucene/build/facet/test/temp/junit4-J0-20190605_123059_3434887861783684680719.syserr
[junit4] >>> JVM J0 emitted unexpected output (verbatim) ----
[junit4] OpenJDK 64-Bit Server VM warning: Option UseConcMarkSweepGC was deprecated in version 9.0 and will likely be removed in a future release.
[junit4] <<< JVM J0: EOF ----
[...truncated 179 lines...]
[junit4] JVM J0: stderr was not empty, see: /home/jenkins/workspace/Lucene-Solr-master-Linux/lucene/build/grouping/test/temp/junit4-J0-20190605_123244_60912131011213440738045.syserr
[junit4] >>> JVM J0 emitted unexpected output (verbatim) ----
[junit4] OpenJDK 64-Bit Server VM warning: Option UseConcMarkSweepGC was deprecated in version 9.0 and will likely be removed in a future release.
[junit4] <<< JVM J0: EOF ----
[...truncated 3 lines...]
[junit4] JVM J1: stderr was not empty, see: /home/jenkins/workspace/Lucene-Solr-master-Linux/lucene/build/grouping/test/temp/junit4-J1-20190605_123244_60915743202548978435932.syserr
[junit4] >>> JVM J1 emitted unexpected output (verbatim) ----
[junit4] OpenJDK 64-Bit Server VM warning: Option UseConcMarkSweepGC was deprecated in version 9.0 and will likely be removed in a future release.
[junit4] <<< JVM J1: EOF ----
[...truncated 3 lines...]
[junit4] JVM J2: stderr was not empty, see: /home/jenkins/workspace/Lucene-Solr-master-Linux/lucene/build/grouping/test/temp/junit4-J2-20190605_123244_6099137897150255953598.syserr
[junit4] >>> JVM J2 emitted unexpected output (verbatim) ----
[junit4] OpenJDK 64-Bit Server VM warning: Option UseConcMarkSweepGC was deprecated in version 9.0 and will likely be removed in a future release.
[junit4] <<< JVM J2: EOF ----
[...truncated 234 lines...]
[junit4] JVM J0: stderr was not empty, see: /home/jenkins/workspace/Lucene-Solr-master-Linux/lucene/build/highlighter/test/temp/junit4-J0-20190605_123320_4521625379462220661602.syserr
[junit4] >>> JVM J0 emitted unexpected output (verbatim) ----
[junit4] Suite: org.apache.lucene.search.vectorhighlight.WeightedFragListBuilderTest
[junit4] Completed [25/29] on J1 in 0.27s, 2 tests
[junit4]
[junit4] OpenJDK 64-Bit Server VM warning: Option UseConcMarkSweepGC was deprecated in version 9.0 and will likely be removed in a future release.
[junit4] <<< JVM J0: EOF ----
[junit4] JVM J1: stderr was not empty, see: /home/jenkins/workspace/Lucene-Solr-master-Linux/lucene/build/highlighter/test/temp/junit4-J1-20190605_123320_4523642078552573204792.syserr
[junit4] >>> JVM J1 emitted unexpected output (verbatim) ----
[junit4] OpenJDK 64-Bit Server VM warning: Option UseConcMarkSweepGC was deprecated in version 9.0 and will likely be removed in a future release.
[junit4] <<< JVM J1: EOF ----
[...truncated 12 lines...]
[junit4] JVM J2: stderr was not empty, see: /home/jenkins/workspace/Lucene-Solr-master-Linux/lucene/build/highlighter/test/temp/junit4-J2-20190605_123320_45210289743360698624257.syserr
[junit4] >>> JVM J2 emitted unexpected output (verbatim) ----
[junit4] OpenJDK 64-Bit Server VM warning: Option UseConcMarkSweepGC was deprecated in version 9.0 and will likely be removed in a future release.
[junit4] <<< JVM J2: EOF ----
[...truncated 166 lines...]
[junit4] JVM J2: stderr was not empty, see: /home/jenkins/workspace/Lucene-Solr-master-Linux/lucene/build/join/test/temp/junit4-J2-20190605_123443_9539355525125570559356.syserr
[junit4] >>> JVM J2 emitted unexpected output (verbatim) ----
[junit4] OpenJDK 64-Bit Server VM warning: Option UseConcMarkSweepGC was deprecated in version 9.0 and will likely be removed in a future release.
[junit4] <<< JVM J2: EOF ----
[...truncated 3 lines...]
[junit4] JVM J1: stderr was not empty, see: /home/jenkins/workspace/Lucene-Solr-master-Linux/lucene/build/join/test/temp/junit4-J1-20190605_123443_9532941307193849833508.syserr
[junit4] >>> JVM J1 emitted unexpected output (verbatim) ----
[junit4] OpenJDK 64-Bit Server VM warning: Option UseConcMarkSweepGC was deprecated in version 9.0 and will likely be removed in a future release.
[junit4] <<< JVM J1: EOF ----
[...truncated 3 lines...]
[junit4] JVM J0: stderr was not empty, see: /home/jenkins/workspace/Lucene-Solr-master-Linux/lucene/build/join/test/temp/junit4-J0-20190605_123443_95314471281261054006550.syserr
[junit4] >>> JVM J0 emitted unexpected output (verbatim) ----
[junit4] OpenJDK 64-Bit Server VM warning: Option UseConcMarkSweepGC was deprecated in version 9.0 and will likely be removed in a future release.
[junit4] <<< JVM J0: EOF ----
[...truncated 268 lines...]
[junit4] JVM J0: stderr was not empty, see: /home/jenkins/workspace/Lucene-Solr-master-Linux/lucene/build/luke/test/temp/junit4-J0-20190605_123558_89611319899865298395980.syserr
[junit4] >>> JVM J0 emitted unexpected output (verbatim) ----
[junit4] OpenJDK 64-Bit Server VM warning: Option UseConcMarkSweepGC was deprecated in version 9.0 and will likely be removed in a future release.
[junit4] <<< JVM J0: EOF ----
[...truncated 3 lines...]
[junit4] JVM J1: stderr was not empty, see: /home/jenkins/workspace/Lucene-Solr-master-Linux/lucene/build/luke/test/temp/junit4-J1-20190605_123558_896782130253564871743.syserr
[junit4] >>> JVM J1 emitted unexpected output (verbatim) ----
[junit4] OpenJDK 64-Bit Server VM warning: Option UseConcMarkSweepGC was deprecated in version 9.0 and will likely be removed in a future release.
[junit4] <<< JVM J1: EOF ----
[...truncated 3 lines...]
[junit4] JVM J2: stderr was not empty, see: /home/jenkins/workspace/Lucene-Solr-master-Linux/lucene/build/luke/test/temp/junit4-J2-20190605_123558_8969868133687748063744.syserr
[junit4] >>> JVM J2 emitted unexpected output (verbatim) ----
[junit4] OpenJDK 64-Bit Server VM warning: Option UseConcMarkSweepGC was deprecated in version 9.0 and will likely be removed in a future release.
[junit4] <<< JVM J2: EOF ----
[...truncated 149 lines...]
[junit4] JVM J0: stderr was not empty, see: /home/jenkins/workspace/Lucene-Solr-master-Linux/lucene/build/memory/test/temp/junit4-J0-20190605_123627_2139774063774765331928.syserr
[junit4] >>> JVM J0 emitted unexpected output (verbatim) ----
[junit4] OpenJDK 64-Bit Server VM warning: Option UseConcMarkSweepGC was deprecated in version 9.0 and will likely be removed in a future release.
[junit4] <<< JVM J0: EOF ----
[...truncated 3 lines...]
[junit4] JVM J1: stderr was not empty, see: /home/jenkins/workspace/Lucene-Solr-master-Linux/lucene/build/memory/test/temp/junit4-J1-20190605_123627_2133880929420543083705.syserr
[junit4] >>> JVM J1 emitted unexpected output (verbatim) ----
[junit4] OpenJDK 64-Bit Server VM warning: Option UseConcMarkSweepGC was deprecated in version 9.0 and will likely be removed in a future release.
[junit4] <<< JVM J1: EOF ----
[...truncated 182 lines...]
[junit4] JVM J0: stderr was not empty, see: /home/jenkins/workspace/Lucene-Solr-master-Linux/lucene/build/misc/test/temp/junit4-J0-20190605_123707_283843699111083588554.syserr
[junit4] >>> JVM J0 emitted unexpected output (verbatim) ----
[junit4] OpenJDK 64-Bit Server VM warning: Option UseConcMarkSweepGC was deprecated in version 9.0 and will likely be removed in a future release.
[junit4] <<< JVM J0: EOF ----
[...truncated 3 lines...]
[junit4] JVM J2: stderr was not empty, see: /home/jenkins/workspace/Lucene-Solr-master-Linux/lucene/build/misc/test/temp/junit4-J2-20190605_123707_28314282957830551037831.syserr
[junit4] >>> JVM J2 emitted unexpected output (verbatim) ----
[junit4] OpenJDK 64-Bit Server VM warning: Option UseConcMarkSweepGC was deprecated in version 9.0 and will likely be removed in a future release.
[junit4] <<< JVM J2: EOF ----
[...truncated 3 lines...]
[junit4] JVM J1: stderr was not empty, see: /home/jenkins/workspace/Lucene-Solr-master-Linux/lucene/build/misc/test/temp/junit4-J1-20190605_123707_2835714595111827525764.syserr
[junit4] >>> JVM J1 emitted unexpected output (verbatim) ----
[junit4] OpenJDK 64-Bit Server VM warning: Option UseConcMarkSweepGC was deprecated in version 9.0 and will likely be removed in a future release.
[junit4] <<< JVM J1: EOF ----
[...truncated 298 lines...]
[junit4] JVM J2: stderr was not empty, see: /home/jenkins/workspace/Lucene-Solr-master-Linux/lucene/build/queries/test/temp/junit4-J2-20190605_123819_20713032472175700382650.syserr
[junit4] >>> JVM J2 emitted unexpected output (verbatim) ----
[junit4] OpenJDK 64-Bit Server VM warning: Option UseConcMarkSweepGC was deprecated in version 9.0 and will likely be removed in a future release.
[junit4] <<< JVM J2: EOF ----
[...truncated 6 lines...]
[junit4] JVM J1: stderr was not empty, see: /home/jenkins/workspace/Lucene-Solr-master-Linux/lucene/build/queries/test/temp/junit4-J1-20190605_123819_2085447562981342615559.syserr
[junit4] >>> JVM J1 emitted unexpected output (verbatim) ----
[junit4] OpenJDK 64-Bit Server VM warning: Option UseConcMarkSweepGC was deprecated in version 9.0 and will likely be removed in a future release.
[junit4] <<< JVM J1: EOF ----
[junit4] JVM J0: stderr was not empty, see: /home/jenkins/workspace/Lucene-Solr-master-Linux/lucene/build/queries/test/temp/junit4-J0-20190605_123819_2075084045462619154957.syserr
[junit4] >>> JVM J0 emitted unexpected output (verbatim) ----
[junit4] OpenJDK 64-Bit Server VM warning: Option UseConcMarkSweepGC was deprecated in version 9.0 and will likely be removed in a future release.
[junit4] <<< JVM J0: EOF ----
[...truncated 223 lines...]
[junit4] JVM J1: stderr was not empty, see: /home/jenkins/workspace/Lucene-Solr-master-Linux/lucene/build/queryparser/test/temp/junit4-J1-20190605_123902_71915632013994727972389.syserr
[junit4] >>> JVM J1 emitted unexpected output (verbatim) ----
[junit4] OpenJDK 64-Bit Server VM warning: Option UseConcMarkSweepGC was deprecated in version 9.0 and will likely be removed in a future release.
[junit4] <<< JVM J1: EOF ----
[...truncated 6 lines...]
[junit4] JVM J0: stderr was not empty, see: /home/jenkins/workspace/Lucene-Solr-master-Linux/lucene/build/queryparser/test/temp/junit4-J0-20190605_123902_7199766172359471250861.syserr
[junit4] JVM J2: stderr was not empty, see: /home/jenkins/workspace/Lucene-Solr-master-Linux/lucene/build/queryparser/test/temp/junit4-J2-20190605_123902_7194322359953115820083.syserr
[junit4] >>> JVM J0 emitted unexpected output (verbatim) ----
[junit4] OpenJDK 64-Bit Server VM warning: Option UseConcMarkSweepGC was deprecated in version 9.0 and will likely be removed in a future release.
[junit4] <<< JVM J0: EOF ----
[...truncated 187 lines...]
[junit4] JVM J2: stderr was not empty, see: /home/jenkins/workspace/Lucene-Solr-master-Linux/lucene/build/replicator/test/temp/junit4-J2-20190605_123939_8404143759443062090653.syserr
[junit4] >>> JVM J2 emitted unexpected output (verbatim) ----
[junit4] OpenJDK 64-Bit Server VM warning: Option UseConcMarkSweepGC was deprecated in version 9.0 and will likely be removed in a future release.
[junit4] <<< JVM J2: EOF ----
[...truncated 26 lines...]
[junit4] JVM J1: stderr was not empty, see: /home/jenkins/workspace/Lucene-Solr-master-Linux/lucene/build/replicator/test/temp/junit4-J1-20190605_123939_84018230834281635752543.syserr
[junit4] >>> JVM J1 emitted unexpected output (verbatim) ----
[junit4] OpenJDK 64-Bit Server VM warning: Option UseConcMarkSweepGC was deprecated in version 9.0 and will likely be removed in a future release.
[junit4] <<< JVM J1: EOF ----
[...truncated 3 lines...]
[junit4] JVM J0: stderr was not empty, see: /home/jenkins/workspace/Lucene-Solr-master-Linux/lucene/build/replicator/test/temp/junit4-J0-20190605_123939_84013117505111359077697.syserr
[junit4] >>> JVM J0 emitted unexpected output (verbatim) ----
[junit4] OpenJDK 64-Bit Server VM warning: Option UseConcMarkSweepGC was deprecated in version 9.0 and will likely be removed in a future release.
[junit4] <<< JVM J0: EOF ----
[...truncated 243 lines...]
[junit4] JVM J1: stderr was not empty, see: /home/jenkins/workspace/Lucene-Solr-master-Linux/lucene/build/sandbox/test/temp/junit4-J1-20190605_124021_0962046159706534790938.syserr
[junit4] >>> JVM J1 emitted unexpected output (verbatim) ----
[junit4] OpenJDK 64-Bit Server VM warning: Option UseConcMarkSweepGC was deprecated in version 9.0 and will likely be removed in a future release.
[junit4] <<< JVM J1: EOF ----
[...truncated 5 lines...]
[junit4] JVM J0: stderr was not empty, see: /home/jenkins/workspace/Lucene-Solr-master-Linux/lucene/build/sandbox/test/temp/junit4-J0-20190605_124021_09617486026258808502515.syserr
[junit4] >>> JVM J0 emitted unexpected output (verbatim) ----
[junit4] OpenJDK 64-Bit Server VM warning: Option UseConcMarkSweepGC was deprecated in version 9.0 and will likely be removed in a future release.
[junit4] <<< JVM J0: EOF ----
[...truncated 5 lines...]
[junit4] JVM J2: stderr was not empty, see: /home/jenkins/workspace/Lucene-Solr-master-Linux/lucene/build/sandbox/test/temp/junit4-J2-20190605_124021_09611083862895382170862.syserr
[junit4] >>> JVM J2 emitted unexpected output (verbatim) ----
[junit4] OpenJDK 64-Bit Server VM warning: Option UseConcMarkSweepGC was deprecated in version 9.0 and will likely be removed in a future release.
[junit4] <<< JVM J2: EOF ----
[...truncated 291 lines...]
[junit4] JVM J1: stderr was not empty, see: /home/jenkins/workspace/Lucene-Solr-master-Linux/lucene/build/spatial-extras/test/temp/junit4-J1-20190605_124335_8459547709781863630427.syserr
[junit4] >>> JVM J1 emitted unexpected output (verbatim) ----
[junit4] OpenJDK 64-Bit Server VM warning: Option UseConcMarkSweepGC was deprecated in version 9.0 and will likely be removed in a future release.
[junit4] <<< JVM J1: EOF ----
[...truncated 3 lines...]
[junit4] JVM J0: stderr was not empty, see: /home/jenkins/workspace/Lucene-Solr-master-Linux/lucene/build/spatial-extras/test/temp/junit4-J0-20190605_124335_8452315143775915188829.syserr
[junit4] >>> JVM J0 emitted unexpected output (verbatim) ----
[junit4] OpenJDK 64-Bit Server VM warning: Option UseConcMarkSweepGC was deprecated in version 9.0 and will likely be removed in a future release.
[junit4] <<< JVM J0: EOF ----
[...truncated 9 lines...]
[junit4] JVM J2: stderr was not empty, see: /home/jenkins/workspace/Lucene-Solr-master-Linux/lucene/build/spatial-extras/test/temp/junit4-J2-20190605_124335_84511761829623278049506.syserr
[junit4] >>> JVM J2 emitted unexpected output (verbatim) ----
[junit4] OpenJDK 64-Bit Server VM warning: Option UseConcMarkSweepGC was deprecated in version 9.0 and will likely be removed in a future release.
[junit4] <<< JVM J2: EOF ----
[...truncated 148 lines...]
[junit4] JVM J0: stderr was not empty, see: /home/jenkins/workspace/Lucene-Solr-master-Linux/lucene/build/spatial/test/temp/junit4-J0-20190605_124453_01515453122894748944532.syserr
[junit4] >>> JVM J0 emitted unexpected output (verbatim) ----
[junit4] OpenJDK 64-Bit Server VM warning: Option UseConcMarkSweepGC was deprecated in version 9.0 and will likely be removed in a future release.
[junit4] <<< JVM J0: EOF ----
[...truncated 181 lines...]
[junit4] JVM J0: stderr was not empty, see: /home/jenkins/workspace/Lucene-Solr-master-Linux/lucene/build/spatial3d/test/temp/junit4-J0-20190605_124505_8961160667825077733178.syserr
[junit4] >>> JVM J0 emitted unexpected output (verbatim) ----
[junit4] OpenJDK 64-Bit Server VM warning: Option UseConcMarkSweepGC was deprecated in version 9.0 and will likely be removed in a future release.
[junit4] <<< JVM J0: EOF ----
[...truncated 3 lines...]
[junit4] JVM J2: stderr was not empty, see: /home/jenkins/workspace/Lucene-Solr-master-Linux/lucene/build/spatial3d/test/temp/junit4-J2-20190605_124505_89612093623829645736115.syserr
[junit4] >>> JVM J2 emitted unexpected output (verbatim) ----
[junit4] OpenJDK 64-Bit Server VM warning: Option UseConcMarkSweepGC was deprecated in version 9.0 and will likely be removed in a future release.
[junit4] <<< JVM J2: EOF ----
[...truncated 6 lines...]
[junit4] JVM J1: stderr was not empty, see: /home/jenkins/workspace/Lucene-Solr-master-Linux/lucene/build/spatial3d/test/temp/junit4-J1-20190605_124505_89612160442113474162721.syserr
[junit4] >>> JVM J1 emitted unexpected output (verbatim) ----
[junit4] OpenJDK 64-Bit Server VM warning: Option UseConcMarkSweepGC was deprecated in version 9.0 and will likely be removed in a future release.
[junit4] <<< JVM J1: EOF ----
[...truncated 239 lines...]
[junit4] JVM J1: stderr was not empty, see: /home/jenkins/workspace/Lucene-Solr-master-Linux/lucene/build/suggest/test/temp/junit4-J1-20190605_124743_31616839257987178385513.syserr
[junit4] >>> JVM J1 emitted unexpected output (verbatim) ----
[junit4] OpenJDK 64-Bit Server VM warning: Option UseConcMarkSweepGC was deprecated in version 9.0 and will likely be removed in a future release.
[junit4] <<< JVM J1: EOF ----
[...truncated 3 lines...]
[junit4] JVM J2: stderr was not empty, see: /home/jenkins/workspace/Lucene-Solr-master-Linux/lucene/build/suggest/test/temp/junit4-J2-20190605_124743_3167057585115774939585.syserr
[junit4] >>> JVM J2 emitted unexpected output (verbatim) ----
[junit4] OpenJDK 64-Bit Server VM warning: Option UseConcMarkSweepGC was deprecated in version 9.0 and will likely be removed in a future release.
[junit4] <<< JVM J2: EOF ----
[...truncated 15 lines...]
[junit4] JVM J0: stderr was not empty, see: /home/jenkins/workspace/Lucene-Solr-master-Linux/lucene/build/suggest/test/temp/junit4-J0-20190605_124743_3165571763590212639603.syserr
[junit4] >>> JVM J0 emitted unexpected output (verbatim) ----
[junit4] OpenJDK 64-Bit Server VM warning: Option UseConcMarkSweepGC was deprecated in version 9.0 and will likely be removed in a future release.
[junit4] <<< JVM J0: EOF ----
[...truncated 1628 lines...]
[junit4] Suite: org.apache.solr.cloud.LeaderFailoverAfterPartitionTest
[junit4] 2> 11835 INFO (SUITE-LeaderFailoverAfterPartitionTest-seed#[76CC894DFD25A044]-worker) [ ] o.a.s.SolrTestCaseJ4 SecureRandom sanity checks: test.solr.allowed.securerandom=null & java.security.egd=file:/dev/./urandom
[junit4] 2> Creating dataDir: /home/jenkins/workspace/Lucene-Solr-master-Linux/solr/build/solr-core/test/J0/temp/solr.cloud.LeaderFailoverAfterPartitionTest_76CC894DFD25A044-001/init-core-data-001
[junit4] 2> 12558 INFO (SUITE-LeaderFailoverAfterPartitionTest-seed#[76CC894DFD25A044]-worker) [ ] o.a.s.SolrTestCaseJ4 Using PointFields (NUMERIC_POINTS_SYSPROP=true) w/NUMERIC_DOCVALUES_SYSPROP=false
[junit4] 2> 12780 INFO (SUITE-LeaderFailoverAfterPartitionTest-seed#[76CC894DFD25A044]-worker) [ ] o.e.j.u.log Logging initialized @13025ms to org.eclipse.jetty.util.log.Slf4jLog
[junit4] 2> 12827 INFO (SUITE-LeaderFailoverAfterPartitionTest-seed#[76CC894DFD25A044]-worker) [ ] o.a.s.SolrTestCaseJ4 Randomized ssl (false) and clientAuth (false) via: @org.apache.solr.SolrTestCaseJ4$SuppressSSL(bugUrl="https://issues.apache.org/jira/browse/SOLR-5776")
[junit4] 2> 12894 INFO (SUITE-LeaderFailoverAfterPartitionTest-seed#[76CC894DFD25A044]-worker) [ ] o.a.s.BaseDistributedSearchTestCase Setting hostContext system property: /
[junit4] 2> 13116 INFO (TEST-LeaderFailoverAfterPartitionTest.test-seed#[76CC894DFD25A044]) [ ] o.a.s.c.ZkTestServer STARTING ZK TEST SERVER
[junit4] 2> 13135 INFO (ZkTestServer Run Thread) [ ] o.a.s.c.ZkTestServer client port:0.0.0.0/0.0.0.0:0
[junit4] 2> 13137 INFO (ZkTestServer Run Thread) [ ] o.a.s.c.ZkTestServer Starting server
[junit4] 2> 13539 INFO (TEST-LeaderFailoverAfterPartitionTest.test-seed#[76CC894DFD25A044]) [ ] o.a.s.c.ZkTestServer start zk server on port:44339
[junit4] 2> 13583 INFO (TEST-LeaderFailoverAfterPartitionTest.test-seed#[76CC894DFD25A044]) [ ] o.a.s.c.ZkTestServer parse host and port list: 127.0.0.1:44339
[junit4] 2> 13588 INFO (TEST-LeaderFailoverAfterPartitionTest.test-seed#[76CC894DFD25A044]) [ ] o.a.s.c.ZkTestServer connecting to 127.0.0.1 44339
[junit4] 2> 14212 INFO (TEST-LeaderFailoverAfterPartitionTest.test-seed#[76CC894DFD25A044]) [ ] o.a.s.c.c.ConnectionManager Waiting for client to connect to ZooKeeper
[junit4] 2> 14378 INFO (zkConnectionManagerCallback-3-thread-1) [ ] o.a.s.c.c.ConnectionManager zkClient has connected
[junit4] 2> 14383 INFO (TEST-LeaderFailoverAfterPartitionTest.test-seed#[76CC894DFD25A044]) [ ] o.a.s.c.c.ConnectionManager Client is connected to ZooKeeper
[junit4] 2> 14559 INFO (TEST-LeaderFailoverAfterPartitionTest.test-seed#[76CC894DFD25A044]) [ ] o.a.s.c.c.ConnectionManager Waiting for client to connect to ZooKeeper
[junit4] 2> 14610 INFO (zkConnectionManagerCallback-5-thread-1) [ ] o.a.s.c.c.ConnectionManager zkClient has connected
[junit4] 2> 14624 INFO (TEST-LeaderFailoverAfterPartitionTest.test-seed#[76CC894DFD25A044]) [ ] o.a.s.c.c.ConnectionManager Client is connected to ZooKeeper
[junit4] 2> 14793 INFO (TEST-LeaderFailoverAfterPartitionTest.test-seed#[76CC894DFD25A044]) [ ] o.a.s.c.ZkTestServer put /home/jenkins/workspace/Lucene-Solr-master-Linux/solr/core/src/test-files/solr/collection1/conf/solrconfig-tlog.xml to /configs/conf1/solrconfig.xml
[junit4] 2> 14856 INFO (TEST-LeaderFailoverAfterPartitionTest.test-seed#[76CC894DFD25A044]) [ ] o.a.s.c.ZkTestServer put /home/jenkins/workspace/Lucene-Solr-master-Linux/solr/core/src/test-files/solr/collection1/conf/schema.xml to /configs/conf1/schema.xml
[junit4] 2> 14872 INFO (TEST-LeaderFailoverAfterPartitionTest.test-seed#[76CC894DFD25A044]) [ ] o.a.s.c.ZkTestServer put /home/jenkins/workspace/Lucene-Solr-master-Linux/solr/core/src/test-files/solr/collection1/conf/solrconfig.snippet.randomindexconfig.xml to /configs/conf1/solrconfig.snippet.randomindexconfig.xml
[junit4] 2> 14878 INFO (TEST-LeaderFailoverAfterPartitionTest.test-seed#[76CC894DFD25A044]) [ ] o.a.s.c.ZkTestServer put /home/jenkins/workspace/Lucene-Solr-master-Linux/solr/core/src/test-files/solr/collection1/conf/stopwords.txt to /configs/conf1/stopwords.txt
[junit4] 2> 14884 INFO (TEST-LeaderFailoverAfterPartitionTest.test-seed#[76CC894DFD25A044]) [ ] o.a.s.c.ZkTestServer put /home/jenkins/workspace/Lucene-Solr-master-Linux/solr/core/src/test-files/solr/collection1/conf/protwords.txt to /configs/conf1/protwords.txt
[junit4] 2> 14889 INFO (TEST-LeaderFailoverAfterPartitionTest.test-seed#[76CC894DFD25A044]) [ ] o.a.s.c.ZkTestServer put /home/jenkins/workspace/Lucene-Solr-master-Linux/solr/core/src/test-files/solr/collection1/conf/currency.xml to /configs/conf1/currency.xml
[junit4] 2> 14894 INFO (TEST-LeaderFailoverAfterPartitionTest.test-seed#[76CC894DFD25A044]) [ ] o.a.s.c.ZkTestServer put /home/jenkins/workspace/Lucene-Solr-master-Linux/solr/core/src/test-files/solr/collection1/conf/enumsConfig.xml to /configs/conf1/enumsConfig.xml
[junit4] 2> 14904 INFO (TEST-LeaderFailoverAfterPartitionTest.test-seed#[76CC894DFD25A044]) [ ] o.a.s.c.ZkTestServer put /home/jenkins/workspace/Lucene-Solr-master-Linux/solr/core/src/test-files/solr/collection1/conf/open-exchange-rates.json to /configs/conf1/open-exchange-rates.json
[junit4] 2> 14911 INFO (TEST-LeaderFailoverAfterPartitionTest.test-seed#[76CC894DFD25A044]) [ ] o.a.s.c.ZkTestServer put /home/jenkins/workspace/Lucene-Solr-master-Linux/solr/core/src/test-files/solr/collection1/conf/mapping-ISOLatin1Accent.txt to /configs/conf1/mapping-ISOLatin1Accent.txt
[junit4] 2> 14917 INFO (TEST-LeaderFailoverAfterPartitionTest.test-seed#[76CC894DFD25A044]) [ ] o.a.s.c.ZkTestServer put /home/jenkins/workspace/Lucene-Solr-master-Linux/solr/core/src/test-files/solr/collection1/conf/old_synonyms.txt to /configs/conf1/old_synonyms.txt
[junit4] 2> 14923 INFO (TEST-LeaderFailoverAfterPartitionTest.test-seed#[76CC894DFD25A044]) [ ] o.a.s.c.ZkTestServer put /home/jenkins/workspace/Lucene-Solr-master-Linux/solr/core/src/test-files/solr/collection1/conf/synonyms.txt to /configs/conf1/synonyms.txt
[junit4] 2> 14928 INFO (TEST-LeaderFailoverAfterPartitionTest.test-seed#[76CC894DFD25A044]) [ ] o.a.s.c.AbstractFullDistribZkTestBase Will use NRT replicas unless explicitly asked otherwise
[junit4] 2> 16178 WARN (TEST-LeaderFailoverAfterPartitionTest.test-seed#[76CC894DFD25A044]) [ ] o.e.j.s.AbstractConnector Ignoring deprecated socket close linger time
[junit4] 2> 16746 INFO (TEST-LeaderFailoverAfterPartitionTest.test-seed#[76CC894DFD25A044]) [ ] o.a.s.c.s.e.JettySolrRunner Start Jetty (original configured port=0)
[junit4] 2> 16746 INFO (TEST-LeaderFailoverAfterPartitionTest.test-seed#[76CC894DFD25A044]) [ ] o.a.s.c.s.e.JettySolrRunner Trying to start Jetty on port 0 try number 1 ...
[junit4] 2> 16765 INFO (TEST-LeaderFailoverAfterPartitionTest.test-seed#[76CC894DFD25A044]) [ ] o.e.j.s.Server jetty-9.4.14.v20181114; built: 2018-11-14T21:20:31.478Z; git: c4550056e785fb5665914545889f21dc136ad9e6; jvm 13-testing+0-builds.shipilev.net-openjdk-jdk-b845-20190430-jdk-1318
[junit4] 2> 16850 INFO (TEST-LeaderFailoverAfterPartitionTest.test-seed#[76CC894DFD25A044]) [ ] o.e.j.s.session DefaultSessionIdManager workerName=node0
[junit4] 2> 16850 INFO (TEST-LeaderFailoverAfterPartitionTest.test-seed#[76CC894DFD25A044]) [ ] o.e.j.s.session No SessionScavenger set, using defaults
[junit4] 2> 16869 INFO (TEST-LeaderFailoverAfterPartitionTest.test-seed#[76CC894DFD25A044]) [ ] o.e.j.s.session node0 Scavenging every 600000ms
[junit4] 2> 16934 INFO (TEST-LeaderFailoverAfterPartitionTest.test-seed#[76CC894DFD25A044]) [ ] o.e.j.s.h.ContextHandler Started o.e.j.s.ServletContextHandler@9f42b6{/,null,AVAILABLE}
[junit4] 2> 16969 INFO (TEST-LeaderFailoverAfterPartitionTest.test-seed#[76CC894DFD25A044]) [ ] o.e.j.s.AbstractConnector Started ServerConnector@2a737f4f{HTTP/1.1,[http/1.1, h2c]}{127.0.0.1:41583}
[junit4] 2> 16969 INFO (TEST-LeaderFailoverAfterPartitionTest.test-seed#[76CC894DFD25A044]) [ ] o.e.j.s.Server Started @17258ms
[junit4] 2> 16969 INFO (TEST-LeaderFailoverAfterPartitionTest.test-seed#[76CC894DFD25A044]) [ ] o.a.s.c.s.e.JettySolrRunner Jetty properties: {hostContext=/, solr.data.dir=/home/jenkins/workspace/Lucene-Solr-master-Linux/solr/build/solr-core/test/J0/temp/solr.cloud.LeaderFailoverAfterPartitionTest_76CC894DFD25A044-001/tempDir-001/control/data, hostPort=41559, coreRootDirectory=/home/jenkins/workspace/Lucene-Solr-master-Linux/solr/build/solr-core/test/J0/temp/solr.cloud.LeaderFailoverAfterPartitionTest_76CC894DFD25A044-001/control-001/cores}
[junit4] 2> 17247 ERROR (TEST-LeaderFailoverAfterPartitionTest.test-seed#[76CC894DFD25A044]) [ ] o.a.s.u.StartupLoggingUtils Missing Java Option solr.log.dir. Logging may be missing or incomplete.
[junit4] 2> 17247 INFO (TEST-LeaderFailoverAfterPartitionTest.test-seed#[76CC894DFD25A044]) [ ] o.a.s.s.SolrDispatchFilter Using logger factory org.apache.logging.slf4j.Log4jLoggerFactory
[junit4] 2> 17250 INFO (TEST-LeaderFailoverAfterPartitionTest.test-seed#[76CC894DFD25A044]) [ ] o.a.s.s.SolrDispatchFilter ___ _ Welcome to Apache Solr? version 9.0.0
[junit4] 2> 17262 INFO (TEST-LeaderFailoverAfterPartitionTest.test-seed#[76CC894DFD25A044]) [ ] o.a.s.s.SolrDispatchFilter / __| ___| |_ _ Starting in cloud mode on port null
[junit4] 2> 17262 INFO (TEST-LeaderFailoverAfterPartitionTest.test-seed#[76CC894DFD25A044]) [ ] o.a.s.s.SolrDispatchFilter \__ \/ _ \ | '_| Install dir: null
[junit4] 2> 17266 INFO (TEST-LeaderFailoverAfterPartitionTest.test-seed#[76CC894DFD25A044]) [ ] o.a.s.s.SolrDispatchFilter |___/\___/_|_| Start time: 2019-06-05T12:51:59.510591Z
[junit4] 2> 17486 INFO (TEST-LeaderFailoverAfterPartitionTest.test-seed#[76CC894DFD25A044]) [ ] o.a.s.c.SolrResourceLoader solr home defaulted to 'solr/' (could not find system property or JNDI)
[junit4] 2> 17548 INFO (TEST-LeaderFailoverAfterPartitionTest.test-seed#[76CC894DFD25A044]) [ ] o.a.s.c.c.ConnectionManager Waiting for client to connect to ZooKeeper
[junit4] 2> 17571 INFO (zkConnectionManagerCallback-7-thread-1) [ ] o.a.s.c.c.ConnectionManager zkClient has connected
[junit4] 2> 17571 INFO (TEST-LeaderFailoverAfterPartitionTest.test-seed#[76CC894DFD25A044]) [ ] o.a.s.c.c.ConnectionManager Client is connected to ZooKeeper
[junit4] 2> 17710 INFO (TEST-LeaderFailoverAfterPartitionTest.test-seed#[76CC894DFD25A044]) [ ] o.a.s.s.SolrDispatchFilter Loading solr.xml from SolrHome (not found in ZooKeeper)
[junit4] 2> 17717 INFO (TEST-LeaderFailoverAfterPartitionTest.test-seed#[76CC894DFD25A044]) [ ] o.a.s.c.SolrXmlConfig Loading container configuration from /home/jenkins/workspace/Lucene-Solr-master-Linux/solr/build/solr-core/test/J0/temp/solr.cloud.LeaderFailoverAfterPartitionTest_76CC894DFD25A044-001/control-001/solr.xml
[junit4] 2> 18549 INFO (TEST-LeaderFailoverAfterPartitionTest.test-seed#[76CC894DFD25A044]) [ ] o.a.s.c.SolrXmlConfig Configuration parameter autoReplicaFailoverWorkLoopDelay is ignored
[junit4] 2> 18549 INFO (TEST-LeaderFailoverAfterPartitionTest.test-seed#[76CC894DFD25A044]) [ ] o.a.s.c.SolrXmlConfig Configuration parameter autoReplicaFailoverBadNodeExpiration is ignored
[junit4] 2> 18654 INFO (TEST-LeaderFailoverAfterPartitionTest.test-seed#[76CC894DFD25A044]) [ ] o.a.s.c.SolrXmlConfig MBean server found: com.sun.jmx.mbeanserver.JmxMBeanServer@7a4b8fa4, but no JMX reporters were configured - adding default JMX reporter.
[junit4] 2> 21190 INFO (TEST-LeaderFailoverAfterPartitionTest.test-seed#[76CC894DFD25A044]) [ ] o.a.s.h.c.HttpShardHandlerFactory Host whitelist initialized: WhitelistHostChecker [whitelistHosts=null, whitelistHostCheckingEnabled=false]
[junit4] 2> 22508 WARN (TEST-LeaderFailoverAfterPartitionTest.test-seed#[76CC894DFD25A044]) [ ] o.e.j.u.s.S.config No Client EndPointIdentificationAlgorithm configured for SslContextFactory@4f9318ff[provider=null,keyStore=null,trustStore=null]
[junit4] 2> 23150 WARN (TEST-LeaderFailoverAfterPartitionTest.test-seed#[76CC894DFD25A044]) [ ] o.e.j.u.s.S.config No Client EndPointIdentificationAlgorithm configured for SslContextFactory@5bd79648[provider=null,keyStore=null,trustStore=null]
[junit4] 2> 23214 INFO (TEST-LeaderFailoverAfterPartitionTest.test-seed#[76CC894DFD25A044]) [ ] o.a.s.c.ZkContainer Zookeeper client=127.0.0.1:44339/solr
[junit4] 2> 23292 INFO (TEST-LeaderFailoverAfterPartitionTest.test-seed#[76CC894DFD25A044]) [ ] o.a.s.c.c.ConnectionManager Waiting for client to connect to ZooKeeper
[junit4] 2> 23316 INFO (zkConnectionManagerCallback-14-thread-1) [ ] o.a.s.c.c.ConnectionManager zkClient has connected
[junit4] 2> 23316 INFO (TEST-LeaderFailoverAfterPartitionTest.test-seed#[76CC894DFD25A044]) [ ] o.a.s.c.c.ConnectionManager Client is connected to ZooKeeper
[junit4] 2> 23503 INFO (TEST-LeaderFailoverAfterPartitionTest.test-seed#[76CC894DFD25A044]) [n:127.0.0.1:41559_ ] o.a.s.c.c.ConnectionManager Waiting for client to connect to ZooKeeper
[junit4] 2> 23523 INFO (zkConnectionManagerCallback-16-thread-1) [ ] o.a.s.c.c.ConnectionManager zkClient has connected
[junit4] 2> 23523 INFO (TEST-LeaderFailoverAfterPartitionTest.test-seed#[76CC894DFD25A044]) [n:127.0.0.1:41559_ ] o.a.s.c.c.ConnectionManager Client is connected to ZooKeeper
[junit4] 2> 24266 INFO (TEST-LeaderFailoverAfterPartitionTest.test-seed#[76CC894DFD25A044]) [n:127.0.0.1:41559_ ] o.a.s.c.OverseerElectionContext I am going to be the leader 127.0.0.1:41559_
[junit4] 2> 24272 INFO (TEST-LeaderFailoverAfterPartitionTest.test-seed#[76CC894DFD25A044]) [n:127.0.0.1:41559_ ] o.a.s.c.Overseer Overseer (id=72374424630788100-127.0.0.1:41559_-n_0000000000) starting
[junit4] 2> 24508 INFO (TEST-LeaderFailoverAfterPartitionTest.test-seed#[76CC894DFD25A044]) [n:127.0.0.1:41559_ ] o.a.s.c.c.ConnectionManager Waiting for client to connect to ZooKeeper
[junit4] 2> 24531 INFO (zkConnectionManagerCallback-23-thread-1) [ ] o.a.s.c.c.ConnectionManager zkClient has connected
[junit4] 2> 24531 INFO (TEST-LeaderFailoverAfterPartitionTest.test-seed#[76CC894DFD25A044]) [n:127.0.0.1:41559_ ] o.a.s.c.c.ConnectionManager Client is connected to ZooKeeper
[junit4] 2> 24546 INFO (TEST-LeaderFailoverAfterPartitionTest.test-seed#[76CC894DFD25A044]) [n:127.0.0.1:41559_ ] o.a.s.c.s.i.ZkClientClusterStateProvider Cluster at 127.0.0.1:44339/solr ready
[junit4] 2> 24914 INFO (TEST-LeaderFailoverAfterPartitionTest.test-seed#[76CC894DFD25A044]) [n:127.0.0.1:41559_ ] o.a.s.c.ZkController Register node as live in ZooKeeper:/live_nodes/127.0.0.1:41559_
[junit4] 2> 24940 INFO (OverseerStateUpdate-72374424630788100-127.0.0.1:41559_-n_0000000000) [n:127.0.0.1:41559_ ] o.a.s.c.Overseer Starting to work on the main queue : 127.0.0.1:41559_
[junit4] 2> 24943 INFO (OverseerStateUpdate-72374424630788100-127.0.0.1:41559_-n_0000000000) [n:127.0.0.1:41559_ ] o.a.s.c.c.ZkStateReader Updated live nodes from ZooKeeper... (0) -> (1)
[junit4] 2> 24945 INFO (zkCallback-22-thread-1) [ ] o.a.s.c.c.ZkStateReader Updated live nodes from ZooKeeper... (0) -> (1)
[junit4] 2> 26463 INFO (TEST-LeaderFailoverAfterPartitionTest.test-seed#[76CC894DFD25A044]) [n:127.0.0.1:41559_ ] o.a.s.h.a.MetricsHistoryHandler No .system collection, keeping metrics history in memory.
[junit4] 2> 27106 INFO (TEST-LeaderFailoverAfterPartitionTest.test-seed#[76CC894DFD25A044]) [n:127.0.0.1:41559_ ] o.a.s.m.r.SolrJmxReporter JMX monitoring for 'solr.node' (registry 'solr.node') enabled at server: com.sun.jmx.mbeanserver.JmxMBeanServer@7a4b8fa4
[junit4] 2> 27112 INFO (TEST-LeaderFailoverAfterPartitionTest.test-seed#[76CC894DFD25A044]) [n:127.0.0.1:41559_ ] o.a.s.m.r.SolrJmxReporter JMX monitoring for 'solr.jvm' (registry 'solr.jvm') enabled at server: com.sun.jmx.mbeanserver.JmxMBeanServer@7a4b8fa4
[junit4] 2> 27113 INFO (TEST-LeaderFailoverAfterPartitionTest.test-seed#[76CC894DFD25A044]) [n:127.0.0.1:41559_ ] o.a.s.m.r.SolrJmxReporter JMX monitoring for 'solr.jetty' (registry 'solr.jetty') enabled at server: com.sun.jmx.mbeanserver.JmxMBeanServer@7a4b8fa4
[junit4] 2> 27424 INFO (TEST-LeaderFailoverAfterPartitionTest.test-seed#[76CC894DFD25A044]) [n:127.0.0.1:41559_ ] o.a.s.c.CorePropertiesLocator Found 0 core definitions underneath /home/jenkins/workspace/Lucene-Solr-master-Linux/solr/build/solr-core/test/J0/temp/solr.cloud.LeaderFailoverAfterPartitionTest_76CC894DFD25A044-001/control-001/cores
[junit4] 2> 27840 INFO (TEST-LeaderFailoverAfterPartitionTest.test-seed#[76CC894DFD25A044]) [ ] o.a.s.c.c.ConnectionManager Waiting for client to connect to ZooKeeper
[junit4] 2> 27858 INFO (zkConnectionManagerCallback-29-thread-1) [ ] o.a.s.c.c.ConnectionManager zkClient has connected
[junit4] 2> 27858 INFO (TEST-LeaderFailoverAfterPartitionTest.test-seed#[76CC894DFD25A044]) [ ] o.a.s.c.c.ConnectionManager Client is connected to ZooKeeper
[junit4] 2> 27865 INFO (TEST-LeaderFailoverAfterPartitionTest.test-seed#[76CC894DFD25A044]) [ ] o.a.s.c.c.ZkStateReader Updated live nodes from ZooKeeper... (0) -> (1)
[junit4] 2> 27868 INFO (TEST-LeaderFailoverAfterPartitionTest.test-seed#[76CC894DFD25A044]) [ ] o.a.s.c.s.i.ZkClientClusterStateProvider Cluster at 127.0.0.1:44339/solr ready
[junit4] 2> 28314 INFO (SocketProxy-Acceptor-41559) [ ] o.a.s.c.s.c.SocketProxy accepted Socket[addr=/127.0.0.1,port=42044,localport=41559], receiveBufferSize:531000
[junit4] 2> 28456 INFO (SocketProxy-Acceptor-41559) [ ] o.a.s.c.s.c.SocketProxy proxy connection Socket[addr=/127.0.0.1,port=41583,localport=53258], receiveBufferSize=530904
[junit4] 2> 29653 INFO (qtp357921286-54) [n:127.0.0.1:41559_ ] o.a.s.h.a.CollectionsHandler Invoked Collection Action :create with params collection.configName=conf1&name=control_collection&nrtReplicas=1&action=CREATE&numShards=1&createNodeSet=127.0.0.1:41559_&wt=javabin&version=2 and sendToOCPQueue=true
[junit4] 2> 29718 INFO (OverseerThreadFactory-10-thread-1-processing-n:127.0.0.1:41559_) [n:127.0.0.1:41559_ ] o.a.s.c.a.c.CreateCollectionCmd Create collection control_collection
[junit4] 2> 30027 INFO (SocketProxy-Acceptor-41559) [ ] o.a.s.c.s.c.SocketProxy accepted Socket[addr=/127.0.0.1,port=42062,localport=41559], receiveBufferSize:531000
[junit4] 2> 30031 INFO (SocketProxy-Acceptor-41559) [ ] o.a.s.c.s.c.SocketProxy proxy connection Socket[addr=/127.0.0.1,port=41583,localport=53276], receiveBufferSize=530904
[junit4] 2> 30051 INFO (qtp357921286-53) [n:127.0.0.1:41559_ x:control_collection_shard1_replica_n1 ] o.a.s.h.a.CoreAdminOperation core create command qt=/admin/cores&collection.configName=conf1&newCollection=true&name=control_collection_shard1_replica_n1&action=CREATE&numShards=1&collection=control_collection&shard=shard1&wt=javabin&version=2&replicaType=NRT
[junit4] 2> 30056 INFO (qtp357921286-53) [n:127.0.0.1:41559_ x:control_collection_shard1_replica_n1 ] o.a.s.c.TransientSolrCoreCacheDefault Allocating transient cache for 4 transient cores
[junit4] 2> 31197 INFO (qtp357921286-53) [n:127.0.0.1:41559_ c:control_collection s:shard1 x:control_collection_shard1_replica_n1 ] o.a.s.c.SolrConfig Using Lucene MatchVersion: 9.0.0
[junit4] 2> 31622 INFO (qtp357921286-53) [n:127.0.0.1:41559_ c:control_collection s:shard1 x:control_collection_shard1_replica_n1 ] o.a.s.s.IndexSchema [control_collection_shard1_replica_n1] Schema name=test
[junit4] 2> 33122 WARN (qtp357921286-53) [n:127.0.0.1:41559_ c:control_collection s:shard1 x:control_collection_shard1_replica_n1 ] o.a.s.c.SolrResourceLoader Solr loaded a deprecated plugin/analysis class [solr.WordDelimiterFilterFactory]. Please consult documentation how to replace it accordingly.
[junit4] 2> 33335 WARN (qtp357921286-53) [n:127.0.0.1:41559_ c:control_collection s:shard1 x:control_collection_shard1_replica_n1 ] o.a.s.c.SolrResourceLoader Solr loaded a deprecated plugin/analysis class [solr.GeoHashField]. Please consult documentation how to replace it accordingly.
[junit4] 2> 33349 WARN (qtp357921286-53) [n:127.0.0.1:41559_ c:control_collection s:shard1 x:control_collection_shard1_replica_n1 ] o.a.s.c.SolrResourceLoader Solr loaded a deprecated plugin/analysis class [solr.LatLonType]. Please consult documentation how to replace it accordingly.
[junit4] 2> 33384 WARN (qtp357921286-53) [n:127.0.0.1:41559_ c:control_collection s:shard1 x:control_collection_shard1_replica_n1 ] o.a.s.c.SolrResourceLoader Solr loaded a deprecated plugin/analysis class [solr.CurrencyField]. Please consult documentation how to replace it accordingly.
[junit4] 2> 33881 INFO (qtp357921286-53) [n:127.0.0.1:41559_ c:control_collection s:shard1 x:control_collection_shard1_replica_n1 ] o.a.s.s.IndexSchema Loaded schema test/1.0 with uniqueid field id
[junit4] 2> 34515 INFO (qtp357921286-53) [n:127.0.0.1:41559_ c:control_collection s:shard1 x:control_collection_shard1_replica_n1 ] o.a.s.c.CoreContainer Creating SolrCore 'control_collection_shard1_replica_n1' using configuration from collection control_collection, trusted=true
[junit4] 2> 34601 INFO (qtp357921286-53) [n:127.0.0.1:41559_ c:control_collection s:shard1 x:control_collection_shard1_replica_n1 ] o.a.s.m.r.SolrJmxReporter JMX monitoring for 'solr.core.control_collection.shard1.replica_n1' (registry 'solr.core.control_collection.shard1.replica_n1') enabled at server: com.sun.jmx.mbeanserver.JmxMBeanServer@7a4b8fa4
[junit4] 2> 34683 INFO (qtp357921286-53) [n:127.0.0.1:41559_ c:control_collection s:shard1 x:control_collection_shard1_replica_n1 ] o.a.s.c.SolrCore [[control_collection_shard1_replica_n1] ] Opening new SolrCore at [/home/jenkins/workspace/Lucene-Solr-master-Linux/solr/build/solr-core/test/J0/temp/solr.cloud.LeaderFailoverAfterPartitionTest_76CC894DFD25A044-001/control-001/cores/control_collection_shard1_replica_n1], dataDir=[/home/jenkins/workspace/Lucene-Solr-master-Linux/solr/build/solr-core/test/J0/temp/solr.cloud.LeaderFailoverAfterPartitionTest_76CC894DFD25A044-001/control-001/cores/control_collection_shard1_replica_n1/data/]
[junit4] 2> 34990 INFO (qtp357921286-53) [n:127.0.0.1:41559_ c:control_collection s:shard1 x:control_collection_shard1_replica_n1 ] o.a.s.u.RandomMergePolicy RandomMergePolicy wrapping class org.apache.lucene.index.TieredMergePolicy: [TieredMergePolicy: maxMergeAtOnce=40, maxMergeAtOnceExplicit=34, maxMergedSegmentMB=69.1875, floorSegmentMB=0.384765625, forceMergeDeletesPctAllowed=21.07882213057581, segmentsPerTier=42.0, maxCFSSegmentSizeMB=8.796093022207999E12, noCFSRatio=0.7775010495768379, deletesPctAllowed=24.500981871082324
[junit4] 2> 36538 WARN (qtp357921286-53) [n:127.0.0.1:41559_ c:control_collection s:shard1 x:control_collection_shard1_replica_n1 ] o.a.s.c.RequestHandlers INVALID paramSet a in requestHandler {type = requestHandler,name = /dump,class = DumpRequestHandler,attributes = {initParams=a, name=/dump, class=DumpRequestHandler},args = {defaults={a=A,b=B}}}
[junit4] 2> 38480 INFO (qtp357921286-53) [n:127.0.0.1:41559_ c:control_collection s:shard1 x:control_collection_shard1_replica_n1 ] o.a.s.u.UpdateHandler Using UpdateLog implementation: org.apache.solr.update.UpdateLog
[junit4] 2> 38480 INFO (qtp357921286-53) [n:127.0.0.1:41559_ c:control_collection s:shard1 x:control_collection_shard1_replica_n1 ] o.a.s.u.UpdateLog Initializing UpdateLog: dataDir= defaultSyncLevel=FLUSH numRecordsToKeep=100 maxNumLogsToKeep=10 numVersionBuckets=65536
[junit4] 2> 38587 INFO (qtp357921286-53) [n:127.0.0.1:41559_ c:control_collection s:shard1 x:control_collection_shard1_replica_n1 ] o.a.s.u.CommitTracker Hard AutoCommit: disabled
[junit4] 2> 38587 INFO (qtp357921286-53) [n:127.0.0.1:41559_ c:control_collection s:shard1 x:control_collection_shard1_replica_n1 ] o.a.s.u.CommitTracker Soft AutoCommit: disabled
[junit4] 2> 38656 INFO (qtp357921286-53) [n:127.0.0.1:41559_ c:control_collection s:shard1 x:control_collection_shard1_replica_n1 ] o.a.s.u.RandomMergePolicy RandomMergePolicy wrapping class org.apache.lucene.index.TieredMergePolicy: [TieredMergePolicy: maxMergeAtOnce=10, maxMergeAtOnceExplicit=15, maxMergedSegmentMB=8.59765625, floorSegmentMB=0.6376953125, forceMergeDeletesPctAllowed=16.65961239778607, segmentsPerTier=28.0, maxCFSSegmentSizeMB=8.796093022207999E12, noCFSRatio=0.35810033363219673, deletesPctAllowed=39.834556645678234
[junit4] 2> 38773 INFO (closeThreadPool-32-thread-2) [ ] o.a.s.c.CoreContainer Shutting down CoreContainer instance=683967248
[junit4] 2> 38774 INFO (closeThreadPool-32-thread-2) [ ] o.a.s.c.ZkController Remove node as live in ZooKeeper:/live_nodes/127.0.0.1:41559_
[junit4] 2> 38792 INFO (closeThreadPool-32-thread-2) [ ] o.a.s.c.ZkController Publish this node as DOWN...
[junit4] 2> 38798 INFO (qtp357921286-53) [n:127.0.0.1:41559_ c:control_collection s:shard1 x:control_collection_shard1_replica_n1 ] o.a.s.s.SolrIndexSearcher Opening [Searcher@68ccc5b9[control_collection_shard1_replica_n1] main]
[junit4] 2> 38792 INFO (closeThreadPool-32-thread-2) [ ] o.a.s.c.ZkController Publish node=127.0.0.1:41559_ as DOWN
[junit4] 2> 38939 INFO (closeThreadPool-32-thread-2) [ ] o.a.s.m.SolrMetricManager Closing metric reporters for registry=solr.node, tag=null
[junit4] 2> 38949 INFO (closeThreadPool-32-thread-2) [ ] o.a.s.m.r.SolrJmxReporter Closing reporter [org.apache.solr.metrics.reporters.SolrJmxReporter@1757eee7: rootName = null, domain = solr.node, service url = null, agent id = null] for registry solr.node / com.codahale.metrics.MetricRegistry@35a4906d
[ju
[...truncated too long message...]
ve limit:
[junit4] 2>
[junit4] 2> 3 /solr/clusterstate.json
[junit4] 2> 3 /solr/clusterprops.json
[junit4] 2>
[junit4] 2> Maximum concurrent children watches above limit:
[junit4] 2>
[junit4] 2> 7 /solr/overseer/queue
[junit4] 2> 6 /solr/live_nodes
[junit4] 2> 3 /solr/collections
[junit4] 2> 3 /solr/overseer/collection-queue-work
[junit4] 2>
[junit4] 2> 49578 INFO (TEST-LeaderFailoverAfterPartitionTest.test-seed#[76CC894DFD25A044]) [ ] o.a.s.c.ZkTestServer parse host and port list: 127.0.0.1:41989
[junit4] 2> 49578 INFO (TEST-LeaderFailoverAfterPartitionTest.test-seed#[76CC894DFD25A044]) [ ] o.a.s.c.ZkTestServer connecting to 127.0.0.1 41989
[junit4] 2> NOTE: reproduce with: ant test -Dtestcase=LeaderFailoverAfterPartitionTest -Dtests.method=test -Dtests.seed=76CC894DFD25A044 -Dtests.multiplier=3 -Dtests.slow=true -Dtests.badapples=true -Dtests.locale=sv -Dtests.timezone=SystemV/CST6CDT -Dtests.asserts=true -Dtests.file.encoding=ISO-8859-1
[junit4] ERROR 39.9s J0 | LeaderFailoverAfterPartitionTest.test <<<
[junit4] > Throwable #1: org.apache.solr.client.solrj.SolrServerException: Timeout occurred while waiting response from server at: http://127.0.0.1:38305
[junit4] > at __randomizedtesting.SeedInfo.seed([76CC894DFD25A044:FE98B69753D9CDBC]:0)
[junit4] > at org.apache.solr.client.solrj.impl.HttpSolrClient.executeMethod(HttpSolrClient.java:667)
[junit4] > at org.apache.solr.client.solrj.impl.HttpSolrClient.request(HttpSolrClient.java:262)
[junit4] > at org.apache.solr.client.solrj.impl.HttpSolrClient.request(HttpSolrClient.java:245)
[junit4] > at org.apache.solr.client.solrj.impl.LBSolrClient.doRequest(LBSolrClient.java:368)
[junit4] > at org.apache.solr.client.solrj.impl.LBSolrClient.request(LBSolrClient.java:296)
[junit4] > at org.apache.solr.client.solrj.impl.BaseCloudSolrClient.sendRequest(BaseCloudSolrClient.java:1068)
[junit4] > at org.apache.solr.client.solrj.impl.BaseCloudSolrClient.requestWithRetryOnStaleState(BaseCloudSolrClient.java:837)
[junit4] > at org.apache.solr.client.solrj.impl.BaseCloudSolrClient.request(BaseCloudSolrClient.java:769)
[junit4] > at org.apache.solr.client.solrj.SolrRequest.process(SolrRequest.java:211)
[junit4] > at org.apache.solr.client.solrj.SolrRequest.process(SolrRequest.java:228)
[junit4] > at org.apache.solr.cloud.AbstractFullDistribZkTestBase.createServers(AbstractFullDistribZkTestBase.java:338)
[junit4] > at org.apache.solr.BaseDistributedSearchTestCase$ShardsRepeatRule$ShardsFixedStatement.callStatement(BaseDistributedSearchTestCase.java:1080)
[junit4] > at org.apache.solr.BaseDistributedSearchTestCase$ShardsRepeatRule$ShardsStatement.evaluate(BaseDistributedSearchTestCase.java:1054)
[junit4] > at java.base/java.lang.Thread.run(Thread.java:830)
[junit4] > Caused by: java.net.SocketTimeoutException: Read timed out
[junit4] > at java.base/java.net.SocketInputStream.socketRead0(Native Method)
[junit4] > at java.base/java.net.SocketInputStream.socketRead(SocketInputStream.java:115)
[junit4] > at java.base/java.net.SocketInputStream.read(SocketInputStream.java:168)
[junit4] > at java.base/java.net.SocketInputStream.read(SocketInputStream.java:140)
[junit4] > at java.base/java.net.Socket$SocketInputStream.read(Socket.java:972)
[junit4] > at org.apache.http.impl.io.SessionInputBufferImpl.streamRead(SessionInputBufferImpl.java:137)
[junit4] > at org.apache.http.impl.io.SessionInputBufferImpl.fillBuffer(SessionInputBufferImpl.java:153)
[junit4] > at org.apache.http.impl.io.SessionInputBufferImpl.readLine(SessionInputBufferImpl.java:282)
[junit4] > at org.apache.http.impl.conn.DefaultHttpResponseParser.parseHead(DefaultHttpResponseParser.java:138)
[junit4] > at org.apache.http.impl.conn.DefaultHttpResponseParser.parseHead(DefaultHttpResponseParser.java:56)
[junit4] > at org.apache.http.impl.io.AbstractMessageParser.parse(AbstractMessageParser.java:259)
[junit4] > at org.apache.http.impl.DefaultBHttpClientConnection.receiveResponseHeader(DefaultBHttpClientConnection.java:163)
[junit4] > at org.apache.http.impl.conn.CPoolProxy.receiveResponseHeader(CPoolProxy.java:165)
[junit4] > at org.apache.http.protocol.HttpRequestExecutor.doReceiveResponse(HttpRequestExecutor.java:273)
[junit4] > at org.apache.http.protocol.HttpRequestExecutor.execute(HttpRequestExecutor.java:125)
[junit4] > at org.apache.http.impl.execchain.MainClientExec.execute(MainClientExec.java:272)
[junit4] > at org.apache.http.impl.execchain.ProtocolExec.execute(ProtocolExec.java:185)
[junit4] > at org.apache.http.impl.execchain.RetryExec.execute(RetryExec.java:89)
[junit4] > at org.apache.http.impl.execchain.RedirectExec.execute(RedirectExec.java:110)
[junit4] > at org.apache.http.impl.client.InternalHttpClient.doExecute(InternalHttpClient.java:185)
[junit4] > at org.apache.http.impl.client.CloseableHttpClient.execute(CloseableHttpClient.java:83)
[junit4] > at org.apache.http.impl.client.CloseableHttpClient.execute(CloseableHttpClient.java:56)
[junit4] > at org.apache.solr.client.solrj.impl.HttpSolrClient.executeMethod(HttpSolrClient.java:555)
[junit4] > ... 42 more
[junit4] 2> NOTE: leaving temporary files on disk at: /home/jenkins/workspace/Lucene-Solr-master-Linux/solr/build/solr-core/test/J0/temp/solr.cloud.LeaderFailoverAfterPartitionTest_76CC894DFD25A044-001
[junit4] 2> Jun 05, 2019 2:46:34 PM com.carrotsearch.randomizedtesting.ThreadLeakControl checkThreadLeaks
[junit4] 2> WARNING: Will linger awaiting termination of 1 leaked thread(s).
[junit4] 2> NOTE: test params are: codec=Asserting(Lucene80), sim=Asserting(org.apache.lucene.search.similarities.AssertingSimilarity@432e3181), locale=sv, timezone=SystemV/CST6CDT
[junit4] 2> NOTE: Linux 4.18.0-17-generic amd64/Aleksey Shipilev 13-testing (64-bit)/cpus=8,threads=2,free=449699392,total=518979584
[junit4] 2> NOTE: All tests run in this JVM: [LeaderFailoverAfterPartitionTest]
[junit4] Completed [3/10 (2!)] on J0 in 47.75s, 1 test, 1 error <<< FAILURES!
[...truncated 21 lines...]
[junit4] JVM J0: stderr was not empty, see: /home/jenkins/workspace/Lucene-Solr-master-Linux/solr/build/solr-core/test/temp/junit4-J0-20190605_144543_33912525886103300545104.syserr
[junit4] >>> JVM J0 emitted unexpected output (verbatim) ----
[junit4] OpenJDK 64-Bit Server VM warning: Option UseConcMarkSweepGC was deprecated in version 9.0 and will likely be removed in a future release.
[junit4] <<< JVM J0: EOF ----
[...truncated 4 lines...]
[junit4] JVM J1: stderr was not empty, see: /home/jenkins/workspace/Lucene-Solr-master-Linux/solr/build/solr-core/test/temp/junit4-J1-20190605_144543_33916201194638798725155.syserr
[junit4] >>> JVM J1 emitted unexpected output (verbatim) ----
[junit4] OpenJDK 64-Bit Server VM warning: Option UseConcMarkSweepGC was deprecated in version 9.0 and will likely be removed in a future release.
[junit4] <<< JVM J1: EOF ----
[...truncated 4 lines...]
[junit4] JVM J2: stderr was not empty, see: /home/jenkins/workspace/Lucene-Solr-master-Linux/solr/build/solr-core/test/temp/junit4-J2-20190605_144543_33914090932279215177995.syserr
[junit4] >>> JVM J2 emitted unexpected output (verbatim) ----
[junit4] OpenJDK 64-Bit Server VM warning: Option UseConcMarkSweepGC was deprecated in version 9.0 and will likely be removed in a future release.
[junit4] <<< JVM J2: EOF ----
[...truncated 11 lines...]
BUILD FAILED
/home/jenkins/workspace/Lucene-Solr-master-Linux/lucene/common-build.xml:1492: The following error occurred while executing this line:
/home/jenkins/workspace/Lucene-Solr-master-Linux/lucene/common-build.xml:1019: There were test failures: 10 suites, 10 tests, 2 errors [seed: 76CC894DFD25A044]
Total time: 2 minutes 4 seconds
[repro] Setting last failure code to 256
[repro] Failures:
[repro] 0/5 failed: org.apache.solr.handler.dataimport.TestContentStreamDataSource
[repro] 0/5 failed: org.apache.solr.security.BasicAuthIntegrationTest
[repro] 2/5 failed: org.apache.solr.cloud.LeaderFailoverAfterPartitionTest
[repro] Exiting with code 256
+ mv lucene/build lucene/build.repro
+ mv solr/build solr/build.repro
+ mv lucene/build.orig lucene/build
+ mv solr/build.orig solr/build
Archiving artifacts
Setting ANT_1_8_2_HOME=/home/jenkins/tools/hudson.tasks.Ant_AntInstallation/ANT_1.8.2
[WARNINGS] Parsing warnings in console log with parser Java Compiler (javac)
Setting ANT_1_8_2_HOME=/home/jenkins/tools/hudson.tasks.Ant_AntInstallation/ANT_1.8.2
No credentials specified
Setting ANT_1_8_2_HOME=/home/jenkins/tools/hudson.tasks.Ant_AntInstallation/ANT_1.8.2
<Git Blamer> Using GitBlamer to create author and commit information for all warnings.
<Git Blamer> GIT_COMMIT=73b15d89844d567cdbc6df1f7e3087bf49564274, workspace=/home/jenkins/workspace/Lucene-Solr-master-Linux
[WARNINGS] Computing warning deltas based on reference build #24187
Recording test results
Setting ANT_1_8_2_HOME=/home/jenkins/tools/hudson.tasks.Ant_AntInstallation/ANT_1.8.2
Build step 'Publish JUnit test result report' changed build result to UNSTABLE
Email was triggered for: Unstable (Test Failures)
Sending email for trigger: Unstable (Test Failures)
Setting ANT_1_8_2_HOME=/home/jenkins/tools/hudson.tasks.Ant_AntInstallation/ANT_1.8.2
Setting ANT_1_8_2_HOME=/home/jenkins/tools/hudson.tasks.Ant_AntInstallation/ANT_1.8.2
Setting ANT_1_8_2_HOME=/home/jenkins/tools/hudson.tasks.Ant_AntInstallation/ANT_1.8.2
Setting ANT_1_8_2_HOME=/home/jenkins/tools/hudson.tasks.Ant_AntInstallation/ANT_1.8.2
Setting ANT_1_8_2_HOME=/home/jenkins/tools/hudson.tasks.Ant_AntInstallation/ANT_1.8.2
Setting ANT_1_8_2_HOME=/home/jenkins/tools/hudson.tasks.Ant_AntInstallation/ANT_1.8.2