You are viewing a plain text version of this content. The canonical link for it is here.
Posted to dev@zookeeper.apache.org by Apache Jenkins Server <je...@builds.apache.org> on 2017/03/15 12:19:05 UTC
ZooKeeper_branch35_jdk8 - Build # 454 - Failure
See https://builds.apache.org/job/ZooKeeper_branch35_jdk8/454/
###################################################################################
########################## LAST 60 LINES OF THE CONSOLE ###########################
[...truncated 64.59 MB...]
[junit] 2017-03-15 12:18:32,386 [myid:127.0.0.1:11225] - WARN [main-SendThread(127.0.0.1:11225):ClientCnxn$SendThread@1235] - Session 0x10417a947270001 for server 127.0.0.1/127.0.0.1:11225, unexpected error, closing socket connection and attempting reconnect
[junit] java.net.ConnectException: Connection refused
[junit] at sun.nio.ch.SocketChannelImpl.checkConnect(Native Method)
[junit] at sun.nio.ch.SocketChannelImpl.finishConnect(SocketChannelImpl.java:717)
[junit] at org.apache.zookeeper.ClientCnxnSocketNIO.doTransport(ClientCnxnSocketNIO.java:357)
[junit] at org.apache.zookeeper.ClientCnxn$SendThread.run(ClientCnxn.java:1214)
[junit] 2017-03-15 12:18:32,692 [myid:127.0.0.1:11222] - INFO [main-SendThread(127.0.0.1:11222):ClientCnxn$SendThread@1113] - Opening socket connection to server 127.0.0.1/127.0.0.1:11222. Will not attempt to authenticate using SASL (unknown error)
[junit] 2017-03-15 12:18:32,693 [myid:127.0.0.1:11222] - WARN [main-SendThread(127.0.0.1:11222):ClientCnxn$SendThread@1235] - Session 0x417a9447a0000 for server 127.0.0.1/127.0.0.1:11222, unexpected error, closing socket connection and attempting reconnect
[junit] java.net.ConnectException: Connection refused
[junit] at sun.nio.ch.SocketChannelImpl.checkConnect(Native Method)
[junit] at sun.nio.ch.SocketChannelImpl.finishConnect(SocketChannelImpl.java:717)
[junit] at org.apache.zookeeper.ClientCnxnSocketNIO.doTransport(ClientCnxnSocketNIO.java:357)
[junit] at org.apache.zookeeper.ClientCnxn$SendThread.run(ClientCnxn.java:1214)
[junit] 2017-03-15 12:18:32,886 [myid:127.0.0.1:11222] - INFO [main-SendThread(127.0.0.1:11222):ClientCnxn$SendThread@1113] - Opening socket connection to server 127.0.0.1/127.0.0.1:11222. Will not attempt to authenticate using SASL (unknown error)
[junit] 2017-03-15 12:18:32,887 [myid:127.0.0.1:11222] - WARN [main-SendThread(127.0.0.1:11222):ClientCnxn$SendThread@1235] - Session 0x417a9447a0001 for server 127.0.0.1/127.0.0.1:11222, unexpected error, closing socket connection and attempting reconnect
[junit] java.net.ConnectException: Connection refused
[junit] at sun.nio.ch.SocketChannelImpl.checkConnect(Native Method)
[junit] at sun.nio.ch.SocketChannelImpl.finishConnect(SocketChannelImpl.java:717)
[junit] at org.apache.zookeeper.ClientCnxnSocketNIO.doTransport(ClientCnxnSocketNIO.java:357)
[junit] at org.apache.zookeeper.ClientCnxn$SendThread.run(ClientCnxn.java:1214)
[junit] 2017-03-15 12:18:33,402 [myid:127.0.0.1:11234] - INFO [main-SendThread(127.0.0.1:11234):ClientCnxn$SendThread@1113] - Opening socket connection to server 127.0.0.1/127.0.0.1:11234. Will not attempt to authenticate using SASL (unknown error)
[junit] 2017-03-15 12:18:33,403 [myid:4] - INFO [NIOServerCxnFactory.AcceptThread:localhost/127.0.0.1:11234:NIOServerCnxnFactory$AcceptThread@296] - Accepted socket connection from /127.0.0.1:57312
[junit] 2017-03-15 12:18:33,403 [myid:127.0.0.1:11234] - INFO [main-SendThread(127.0.0.1:11234):ClientCnxn$SendThread@948] - Socket connection established, initiating session, client: /127.0.0.1:57312, server: 127.0.0.1/127.0.0.1:11234
[junit] 2017-03-15 12:18:33,700 [myid:127.0.0.1:11225] - INFO [main-SendThread(127.0.0.1:11225):ClientCnxn$SendThread@1113] - Opening socket connection to server 127.0.0.1/127.0.0.1:11225. Will not attempt to authenticate using SASL (unknown error)
[junit] 2017-03-15 12:18:33,701 [myid:127.0.0.1:11225] - WARN [main-SendThread(127.0.0.1:11225):ClientCnxn$SendThread@1235] - Session 0x10417a947270000 for server 127.0.0.1/127.0.0.1:11225, unexpected error, closing socket connection and attempting reconnect
[junit] java.net.ConnectException: Connection refused
[junit] at sun.nio.ch.SocketChannelImpl.checkConnect(Native Method)
[junit] at sun.nio.ch.SocketChannelImpl.finishConnect(SocketChannelImpl.java:717)
[junit] at org.apache.zookeeper.ClientCnxnSocketNIO.doTransport(ClientCnxnSocketNIO.java:357)
[junit] at org.apache.zookeeper.ClientCnxn$SendThread.run(ClientCnxn.java:1214)
[junit] 2017-03-15 12:18:34,007 [myid:127.0.0.1:11225] - INFO [main-SendThread(127.0.0.1:11225):ClientCnxn$SendThread@1113] - Opening socket connection to server 127.0.0.1/127.0.0.1:11225. Will not attempt to authenticate using SASL (unknown error)
[junit] 2017-03-15 12:18:34,007 [myid:127.0.0.1:11225] - WARN [main-SendThread(127.0.0.1:11225):ClientCnxn$SendThread@1235] - Session 0x10417a947270001 for server 127.0.0.1/127.0.0.1:11225, unexpected error, closing socket connection and attempting reconnect
[junit] java.net.ConnectException: Connection refused
[junit] at sun.nio.ch.SocketChannelImpl.checkConnect(Native Method)
[junit] at sun.nio.ch.SocketChannelImpl.finishConnect(SocketChannelImpl.java:717)
[junit] at org.apache.zookeeper.ClientCnxnSocketNIO.doTransport(ClientCnxnSocketNIO.java:357)
[junit] at org.apache.zookeeper.ClientCnxn$SendThread.run(ClientCnxn.java:1214)
[junit] 2017-03-15 12:18:34,552 [myid:127.0.0.1:11222] - INFO [main-SendThread(127.0.0.1:11222):ClientCnxn$SendThread@1113] - Opening socket connection to server 127.0.0.1/127.0.0.1:11222. Will not attempt to authenticate using SASL (unknown error)
[junit] 2017-03-15 12:18:34,553 [myid:127.0.0.1:11222] - WARN [main-SendThread(127.0.0.1:11222):ClientCnxn$SendThread@1235] - Session 0x417a9447a0000 for server 127.0.0.1/127.0.0.1:11222, unexpected error, closing socket connection and attempting reconnect
[junit] java.net.ConnectException: Connection refused
[junit] at sun.nio.ch.SocketChannelImpl.checkConnect(Native Method)
[junit] at sun.nio.ch.SocketChannelImpl.finishConnect(SocketChannelImpl.java:717)
[junit] at org.apache.zookeeper.ClientCnxnSocketNIO.doTransport(ClientCnxnSocketNIO.java:357)
[junit] at org.apache.zookeeper.ClientCnxn$SendThread.run(ClientCnxn.java:1214)
[junit] Running org.apache.zookeeper.server.quorum.StandaloneDisabledTest in thread 1
[junit] Tests run: 1, Failures: 0, Errors: 1, Skipped: 0, Time elapsed: 0 sec, Thread: 1, Class: org.apache.zookeeper.server.quorum.StandaloneDisabledTest
[junit] Test org.apache.zookeeper.server.quorum.StandaloneDisabledTest FAILED (timeout)
fail.build.on.test.failure:
BUILD FAILED
/home/jenkins/jenkins-slave/workspace/ZooKeeper_branch35_jdk8/build.xml:1212: The following error occurred while executing this line:
/home/jenkins/jenkins-slave/workspace/ZooKeeper_branch35_jdk8/build.xml:1216: Tests failed!
Total time: 16 minutes 21 seconds
Build step 'Invoke Ant' marked build as failure
Recording test results
Email was triggered for: Failure - Any
Sending email for trigger: Failure - Any
###################################################################################
############################## FAILED TESTS (if any) ##############################
2 tests failed.
FAILED: org.apache.zookeeper.server.quorum.StandaloneDisabledTest.startSingleServerTest
Error Message:
Timeout occurred. Please note the time in the report does not reflect the time until the timeout.
Stack Trace:
junit.framework.AssertionFailedError: Timeout occurred. Please note the time in the report does not reflect the time until the timeout.
at java.lang.Thread.run(Thread.java:745)
FAILED: org.apache.zookeeper.test.ReconfigTest.testPortChange
Error Message:
null
Stack Trace:
junit.framework.AssertionFailedError
at org.apache.zookeeper.test.ReconfigTest.testPortChange(ReconfigTest.java:681)
at org.apache.zookeeper.JUnit4ZKTestRunner$LoggedInvokeMethod.evaluate(JUnit4ZKTestRunner.java:79)
ZooKeeper_branch35_jdk8 - Build # 455 - Still Failing
Posted by Apache Jenkins Server <je...@builds.apache.org>.
See https://builds.apache.org/job/ZooKeeper_branch35_jdk8/455/
###################################################################################
########################## LAST 60 LINES OF THE CONSOLE ###########################
[...truncated 8.20 KB...]
Fetching changes from the remote Git repository
> git config remote.origin.url git://git.apache.org/zookeeper.git # timeout=10
Cleaning workspace
> git rev-parse --verify HEAD # timeout=10
Resetting working tree
> git reset --hard # timeout=10
> git clean -fdx # timeout=10
Fetching upstream changes from git://git.apache.org/zookeeper.git
> git --version # timeout=10
> git fetch --tags --progress git://git.apache.org/zookeeper.git +refs/heads/*:refs/remotes/origin/*
ERROR: Error fetching remote repo 'origin'
hudson.plugins.git.GitException: Failed to fetch from git://git.apache.org/zookeeper.git
at hudson.plugins.git.GitSCM.fetchFrom(GitSCM.java:806)
at hudson.plugins.git.GitSCM.retrieveChanges(GitSCM.java:1070)
at hudson.plugins.git.GitSCM.checkout(GitSCM.java:1101)
at hudson.scm.SCM.checkout(SCM.java:495)
at hudson.model.AbstractProject.checkout(AbstractProject.java:1278)
at hudson.model.AbstractBuild$AbstractBuildExecution.defaultCheckout(AbstractBuild.java:604)
at jenkins.scm.SCMCheckoutStrategy.checkout(SCMCheckoutStrategy.java:86)
at hudson.model.AbstractBuild$AbstractBuildExecution.run(AbstractBuild.java:529)
at hudson.model.Run.execute(Run.java:1728)
at hudson.model.FreeStyleBuild.run(FreeStyleBuild.java:43)
at hudson.model.ResourceController.execute(ResourceController.java:98)
at hudson.model.Executor.run(Executor.java:404)
Caused by: hudson.plugins.git.GitException: Command "git fetch --tags --progress git://git.apache.org/zookeeper.git +refs/heads/*:refs/remotes/origin/*" returned status code 128:
stdout:
stderr: fatal: read error: Connection reset by peer
at org.jenkinsci.plugins.gitclient.CliGitAPIImpl.launchCommandIn(CliGitAPIImpl.java:1793)
at org.jenkinsci.plugins.gitclient.CliGitAPIImpl.launchCommandWithCredentials(CliGitAPIImpl.java:1519)
at org.jenkinsci.plugins.gitclient.CliGitAPIImpl.access$300(CliGitAPIImpl.java:64)
at org.jenkinsci.plugins.gitclient.CliGitAPIImpl$1.execute(CliGitAPIImpl.java:315)
at org.jenkinsci.plugins.gitclient.RemoteGitImpl$CommandInvocationHandler$1.call(RemoteGitImpl.java:153)
at org.jenkinsci.plugins.gitclient.RemoteGitImpl$CommandInvocationHandler$1.call(RemoteGitImpl.java:146)
at hudson.remoting.UserRequest.perform(UserRequest.java:153)
at hudson.remoting.UserRequest.perform(UserRequest.java:50)
at hudson.remoting.Request$2.run(Request.java:336)
at hudson.remoting.InterceptingExecutorService$1.call(InterceptingExecutorService.java:68)
at java.util.concurrent.FutureTask.run(FutureTask.java:262)
at java.util.concurrent.ThreadPoolExecutor.runWorker(ThreadPoolExecutor.java:1145)
at java.util.concurrent.ThreadPoolExecutor$Worker.run(ThreadPoolExecutor.java:615)
at java.lang.Thread.run(Thread.java:745)
at ......remote call to ubuntu-eu3(Native Method)
at hudson.remoting.Channel.attachCallSiteStackTrace(Channel.java:1537)
at hudson.remoting.UserResponse.retrieve(UserRequest.java:253)
at hudson.remoting.Channel.call(Channel.java:822)
at org.jenkinsci.plugins.gitclient.RemoteGitImpl$CommandInvocationHandler.execute(RemoteGitImpl.java:146)
at sun.reflect.GeneratedMethodAccessor756.invoke(Unknown Source)
at sun.reflect.DelegatingMethodAccessorImpl.invoke(DelegatingMethodAccessorImpl.java:43)
at java.lang.reflect.Method.invoke(Method.java:498)
at org.jenkinsci.plugins.gitclient.RemoteGitImpl$CommandInvocationHandler.invoke(RemoteGitImpl.java:132)
at com.sun.proxy.$Proxy81.execute(Unknown Source)
at hudson.plugins.git.GitSCM.fetchFrom(GitSCM.java:804)
... 11 more
ERROR: null
Recording test results
ERROR: Step ‘Publish JUnit test result report’ failed: No test report files were found. Configuration error?
Email was triggered for: Failure - Any
Sending email for trigger: Failure - Any
###################################################################################
############################## FAILED TESTS (if any) ##############################
No tests ran.