You are viewing a plain text version of this content. The canonical link for it is here.
Posted to notifications@maven.apache.org by Apache Jenkins Server <je...@builds.apache.org> on 2011/08/22 23:11:31 UTC
Build failed in Jenkins: core-integration-testing-maven-3-jdk-1.7
#17
See <https://builds.apache.org/job/core-integration-testing-maven-3-jdk-1.7/17/changes>
Changes:
[hboutemy] added javadoc
------------------------------------------
[...truncated 516 lines...]
[java] [INFO]
[java] [INFO] --- maven-remote-resources-plugin:1.1:process (default) @ maven-core ---
[java] [INFO]
[java] [INFO] --- buildnumber-maven-plugin:1.0-beta-4:create (default) @ maven-core ---
[java] [INFO] Change the default 'svn' provider implementation to 'javasvn'.
[java] [INFO] Checking for local modifications: skipped.
[java] [INFO] Updating project files from SCM: skipped.
[java] [INFO] Storing buildNumber: 1160436 at timestamp: 1314047451974
[java] [INFO] Storing buildScmBranch: trunk
[java] [INFO]
[java] [INFO] --- maven-resources-plugin:2.4.2:resources (default-resources) @ maven-core ---
[java] [INFO] Using 'UTF-8' encoding to copy filtered resources.
[java] [INFO] Copying 16 resources
[java] [INFO] Copying 3 resources
[java] [INFO]
[java] [INFO] --- maven-compiler-plugin:2.3.2:compile (default-compile) @ maven-core ---
[java] [INFO] Compiling 298 source files to <https://builds.apache.org/job/core-integration-testing-maven-3-jdk-1.7/ws/maven-3-trunk/maven-core/target/classes>
[java] [INFO]
[java] [INFO] --- animal-sniffer-maven-plugin:1.6:check (check-java-1.5-compat) @ maven-core ---
[java] [INFO] Checking unresolved references to org.codehaus.mojo.signature:java15:1.0
[java] [INFO]
[java] [INFO] --- plexus-component-metadata:1.5.5:generate-metadata (default) @ maven-core ---
[java] [INFO] Discovered 59 component descriptors(s)
[java] [INFO]
[java] [INFO] --- maven-resources-plugin:2.4.2:testResources (default-testResources) @ maven-core ---
[java] [INFO] Using 'UTF-8' encoding to copy filtered resources.
[java] [INFO] Copying 212 resources
[java] [INFO] Copying 3 resources
[java] [INFO]
[java] [INFO] --- maven-compiler-plugin:2.3.2:testCompile (default-testCompile) @ maven-core ---
[java] [INFO] Compiling 71 source files to <https://builds.apache.org/job/core-integration-testing-maven-3-jdk-1.7/ws/maven-3-trunk/maven-core/target/test-classes>
[java] [INFO]
[java] [INFO] --- plexus-component-metadata:1.5.5:generate-test-metadata (default) @ maven-core ---
[java] [INFO] Discovered 4 component descriptors(s)
[java] [INFO]
[java] [INFO] --- maven-surefire-plugin:2.8.1:test (default-test) @ maven-core ---
[java] [INFO] Tests are skipped.
[java] [INFO]
[java] [INFO] --- maven-jar-plugin:2.3.1:jar (default-jar) @ maven-core ---
[java] [INFO] Building jar: <https://builds.apache.org/job/core-integration-testing-maven-3-jdk-1.7/ws/maven-3-trunk/maven-core/target/maven-core-3.0.4-SNAPSHOT.jar>
[java] [INFO]
[java] [INFO] --- maven-install-plugin:2.3.1:install (default-install) @ maven-core ---
[java] [INFO] Installing <https://builds.apache.org/job/core-integration-testing-maven-3-jdk-1.7/ws/maven-3-trunk/maven-core/target/maven-core-3.0.4-SNAPSHOT.jar> to /home/jenkins/.m2/repository/org/apache/maven/maven-core/3.0.4-SNAPSHOT/maven-core-3.0.4-SNAPSHOT.jar
[java] [INFO] Installing <https://builds.apache.org/job/core-integration-testing-maven-3-jdk-1.7/ws/maven-3-trunk/maven-core/pom.xml> to /home/jenkins/.m2/repository/org/apache/maven/maven-core/3.0.4-SNAPSHOT/maven-core-3.0.4-SNAPSHOT.pom
[java] [INFO]
[java] [INFO] ------------------------------------------------------------------------
[java] [INFO] Building Maven Compat 3.0.4-SNAPSHOT
[java] [INFO] ------------------------------------------------------------------------
[java] [INFO]
[java] [INFO] --- maven-clean-plugin:2.4.1:clean (default-clean) @ maven-compat ---
[java] [INFO]
[java] [INFO] --- modello-maven-plugin:1.4.1:java (standard) @ maven-compat ---
[java] [INFO] outputDirectory: <https://builds.apache.org/job/core-integration-testing-maven-3-jdk-1.7/ws/maven-3-trunk/maven-compat/target/generated-sources/modello>
[java] [INFO] Working on model: src/main/mdo/profiles.mdo
[java] [INFO] Generating current version: 1.0.0
[java] [INFO] Working on model: src/main/mdo/paramdoc.mdo
[java] [INFO] Generating current version: 1.0.0
[java] [INFO]
[java] [INFO] --- modello-maven-plugin:1.4.1:xpp3-reader (standard) @ maven-compat ---
[java] [INFO] outputDirectory: <https://builds.apache.org/job/core-integration-testing-maven-3-jdk-1.7/ws/maven-3-trunk/maven-compat/target/generated-sources/modello>
[java] [INFO] Working on model: src/main/mdo/profiles.mdo
[java] [INFO] Generating current version: 1.0.0
[java] [INFO] Working on model: src/main/mdo/paramdoc.mdo
[java] [INFO] Generating current version: 1.0.0
[java] [INFO]
[java] [INFO] --- modello-maven-plugin:1.4.1:xpp3-writer (standard) @ maven-compat ---
[java] [INFO] outputDirectory: <https://builds.apache.org/job/core-integration-testing-maven-3-jdk-1.7/ws/maven-3-trunk/maven-compat/target/generated-sources/modello>
[java] [INFO] Working on model: src/main/mdo/profiles.mdo
[java] [INFO] Generating current version: 1.0.0
[java] [INFO] Working on model: src/main/mdo/paramdoc.mdo
[java] [INFO] Generating current version: 1.0.0
[java] [INFO]
[java] [INFO] --- maven-remote-resources-plugin:1.1:process (default) @ maven-compat ---
[java] [INFO]
[java] [INFO] --- maven-resources-plugin:2.4.2:resources (default-resources) @ maven-compat ---
[java] [INFO] Using 'UTF-8' encoding to copy filtered resources.
[java] [INFO] Copying 4 resources
[java] [INFO] Copying 3 resources
[java] [INFO]
[java] [INFO] --- maven-compiler-plugin:2.3.2:compile (default-compile) @ maven-compat ---
[java] [INFO] Compiling 146 source files to <https://builds.apache.org/job/core-integration-testing-maven-3-jdk-1.7/ws/maven-3-trunk/maven-compat/target/classes>
[java] [INFO]
[java] [INFO] --- animal-sniffer-maven-plugin:1.6:check (check-java-1.5-compat) @ maven-compat ---
[java] [INFO] Checking unresolved references to org.codehaus.mojo.signature:java15:1.0
[java] [INFO]
[java] [INFO] --- plexus-component-metadata:1.5.5:generate-metadata (default) @ maven-compat ---
[java] [INFO] Discovered 34 component descriptors(s)
[java] [INFO]
[java] [INFO] --- maven-resources-plugin:2.4.2:testResources (default-testResources) @ maven-compat ---
[java] [INFO] Using 'UTF-8' encoding to copy filtered resources.
[java] [INFO] Copying 156 resources
[java] [INFO] Copying 3 resources
[java] [INFO]
[java] [INFO] --- maven-compiler-plugin:2.3.2:testCompile (default-testCompile) @ maven-compat ---
[java] [INFO] Compiling 71 source files to <https://builds.apache.org/job/core-integration-testing-maven-3-jdk-1.7/ws/maven-3-trunk/maven-compat/target/test-classes>
[java] [INFO]
[java] [INFO] --- plexus-component-metadata:1.5.5:generate-test-metadata (default) @ maven-compat ---
[java] [INFO] Discovered 12 component descriptors(s)
[java] [INFO]
[java] [INFO] --- maven-surefire-plugin:2.8.1:test (default-test) @ maven-compat ---
[java] [INFO] Tests are skipped.
[java] [INFO]
[java] [INFO] --- maven-jar-plugin:2.3.1:jar (default-jar) @ maven-compat ---
[java] [INFO] Building jar: <https://builds.apache.org/job/core-integration-testing-maven-3-jdk-1.7/ws/maven-3-trunk/maven-compat/target/maven-compat-3.0.4-SNAPSHOT.jar>
[java] [INFO]
[java] [INFO] --- maven-install-plugin:2.3.1:install (default-install) @ maven-compat ---
[java] [INFO] Installing <https://builds.apache.org/job/core-integration-testing-maven-3-jdk-1.7/ws/maven-3-trunk/maven-compat/target/maven-compat-3.0.4-SNAPSHOT.jar> to /home/jenkins/.m2/repository/org/apache/maven/maven-compat/3.0.4-SNAPSHOT/maven-compat-3.0.4-SNAPSHOT.jar
[java] [INFO] Installing <https://builds.apache.org/job/core-integration-testing-maven-3-jdk-1.7/ws/maven-3-trunk/maven-compat/pom.xml> to /home/jenkins/.m2/repository/org/apache/maven/maven-compat/3.0.4-SNAPSHOT/maven-compat-3.0.4-SNAPSHOT.pom
[java] [INFO]
[java] [INFO] ------------------------------------------------------------------------
[java] [INFO] Building Maven Embedder 3.0.4-SNAPSHOT
[java] [INFO] ------------------------------------------------------------------------
[java] [INFO]
[java] [INFO] --- maven-clean-plugin:2.4.1:clean (default-clean) @ maven-embedder ---
[java] [INFO]
[java] [INFO] --- maven-remote-resources-plugin:1.1:process (default) @ maven-embedder ---
[java] [INFO]
[java] [INFO] --- maven-resources-plugin:2.4.2:resources (default-resources) @ maven-embedder ---
[java] [INFO] Using 'UTF-8' encoding to copy filtered resources.
[java] [INFO] Copying 1 resource
[java] [INFO] Copying 3 resources
[java] [INFO]
[java] [INFO] --- maven-compiler-plugin:2.3.2:compile (default-compile) @ maven-embedder ---
[java] [INFO] Compiling 11 source files to <https://builds.apache.org/job/core-integration-testing-maven-3-jdk-1.7/ws/maven-3-trunk/maven-embedder/target/classes>
[java] [INFO]
[java] [INFO] --- animal-sniffer-maven-plugin:1.6:check (check-java-1.5-compat) @ maven-embedder ---
[java] [INFO] Checking unresolved references to org.codehaus.mojo.signature:java15:1.0
[java] [INFO]
[java] [INFO] --- plexus-component-metadata:1.5.5:generate-metadata (default) @ maven-embedder ---
[java] [INFO]
[java] [INFO] --- maven-resources-plugin:2.4.2:testResources (default-testResources) @ maven-embedder ---
[java] [INFO] Using 'UTF-8' encoding to copy filtered resources.
[java] [INFO] Copying 7 resources
[java] [INFO] Copying 3 resources
[java] [INFO]
[java] [INFO] --- maven-compiler-plugin:2.3.2:testCompile (default-testCompile) @ maven-embedder ---
[java] [INFO] Nothing to compile - all classes are up to date
[java] [INFO]
[java] [INFO] --- plexus-component-metadata:1.5.5:generate-test-metadata (default) @ maven-embedder ---
[java] [INFO]
[java] [INFO] --- maven-surefire-plugin:2.8.1:test (default-test) @ maven-embedder ---
[java] [INFO] Tests are skipped.
[java] [INFO]
[java] [INFO] --- maven-jar-plugin:2.3.1:jar (default-jar) @ maven-embedder ---
[java] [INFO] Building jar: <https://builds.apache.org/job/core-integration-testing-maven-3-jdk-1.7/ws/maven-3-trunk/maven-embedder/target/maven-embedder-3.0.4-SNAPSHOT.jar>
[java] [INFO]
[java] [INFO] --- maven-install-plugin:2.3.1:install (default-install) @ maven-embedder ---
[java] [INFO] Installing <https://builds.apache.org/job/core-integration-testing-maven-3-jdk-1.7/ws/maven-3-trunk/maven-embedder/target/maven-embedder-3.0.4-SNAPSHOT.jar> to /home/jenkins/.m2/repository/org/apache/maven/maven-embedder/3.0.4-SNAPSHOT/maven-embedder-3.0.4-SNAPSHOT.jar
[java] [INFO] Installing <https://builds.apache.org/job/core-integration-testing-maven-3-jdk-1.7/ws/maven-3-trunk/maven-embedder/pom.xml> to /home/jenkins/.m2/repository/org/apache/maven/maven-embedder/3.0.4-SNAPSHOT/maven-embedder-3.0.4-SNAPSHOT.pom
[java] [INFO]
[java] [INFO] ------------------------------------------------------------------------
[java] [INFO] Building Maven Distribution 3.0.4-SNAPSHOT
[java] [INFO] ------------------------------------------------------------------------
[java] [INFO]
[java] [INFO] --- maven-clean-plugin:2.4.1:clean (default-clean) @ apache-maven ---
[java] [INFO]
[java] [INFO] --- maven-remote-resources-plugin:1.1:process (default) @ apache-maven ---
[java] [INFO]
[java] [INFO] --- animal-sniffer-maven-plugin:1.6:check (check-java-1.5-compat) @ apache-maven ---
[java] [INFO] Checking unresolved references to org.codehaus.mojo.signature:java15:1.0
[java] [INFO]
[java] [INFO] --- maven-compiler-plugin:2.3.2:testCompile (test-compile) @ apache-maven ---
[java] [INFO] Compiling 1 source file to <https://builds.apache.org/job/core-integration-testing-maven-3-jdk-1.7/ws/maven-3-trunk/apache-maven/target/test-classes>
[java] [INFO]
[java] [INFO] --- maven-surefire-plugin:2.8.1:test (test) @ apache-maven ---
[java] [INFO] Tests are skipped.
[java] [INFO]
[java] [INFO] --- maven-assembly-plugin:2.2-beta-5:single (create-distro) @ apache-maven ---
[java] [INFO] Reading assembly descriptor: src/main/assembly/bin.xml
[java] [WARNING] The following patterns were never triggered in this artifact exclusion filter:
[java] o 'junit:junit'
[java] o 'log4j:log4j'
[java] o 'commons-logging:commons-logging-api'
[java]
[java] [INFO] Building zip: <https://builds.apache.org/job/core-integration-testing-maven-3-jdk-1.7/ws/maven-3-trunk/apache-maven/target/apache-maven-3.0.4-SNAPSHOT-bin.zip>
[java] [WARNING] The following patterns were never triggered in this artifact exclusion filter:
[java] o 'junit:junit'
[java] o 'log4j:log4j'
[java] o 'commons-logging:commons-logging-api'
[java]
[java] [INFO] Building tar : <https://builds.apache.org/job/core-integration-testing-maven-3-jdk-1.7/ws/maven-3-trunk/apache-maven/target/apache-maven-3.0.4-SNAPSHOT-bin.tar.gz>
[java] [INFO]
[java] [INFO] --- maven-install-plugin:2.3.1:install (default-install) @ apache-maven ---
[java] [INFO] Installing <https://builds.apache.org/job/core-integration-testing-maven-3-jdk-1.7/ws/maven-3-trunk/apache-maven/pom.xml> to /home/jenkins/.m2/repository/org/apache/maven/apache-maven/3.0.4-SNAPSHOT/apache-maven-3.0.4-SNAPSHOT.pom
[java] [INFO] Installing <https://builds.apache.org/job/core-integration-testing-maven-3-jdk-1.7/ws/maven-3-trunk/apache-maven/target/apache-maven-3.0.4-SNAPSHOT-bin.zip> to /home/jenkins/.m2/repository/org/apache/maven/apache-maven/3.0.4-SNAPSHOT/apache-maven-3.0.4-SNAPSHOT-bin.zip
[java] [INFO] Installing <https://builds.apache.org/job/core-integration-testing-maven-3-jdk-1.7/ws/maven-3-trunk/apache-maven/target/apache-maven-3.0.4-SNAPSHOT-bin.tar.gz> to /home/jenkins/.m2/repository/org/apache/maven/apache-maven/3.0.4-SNAPSHOT/apache-maven-3.0.4-SNAPSHOT-bin.tar.gz
[java] [INFO] ------------------------------------------------------------------------
[java] [INFO] Reactor Summary:
[java] [INFO]
[java] [INFO] Apache Maven ...................................... SUCCESS [2.085s]
[java] [INFO] Maven Model ....................................... SUCCESS [5.009s]
[java] [INFO] Maven Settings .................................... SUCCESS [1.743s]
[java] [INFO] Maven Settings Builder ............................ SUCCESS [2.259s]
[java] [INFO] Maven Repository Metadata Model ................... SUCCESS [1.173s]
[java] [INFO] Maven Artifact .................................... SUCCESS [2.812s]
[java] [INFO] Maven Plugin API .................................. SUCCESS [2.602s]
[java] [INFO] Maven Model Builder ............................... SUCCESS [3.898s]
[java] [INFO] Maven Aether Provider ............................. SUCCESS [2.354s]
[java] [INFO] Maven Core ........................................ SUCCESS [15.718s]
[java] [INFO] Maven Compat ...................................... SUCCESS [11.123s]
[java] [INFO] Maven Embedder .................................... SUCCESS [2.443s]
[java] [INFO] Maven Distribution ................................ SUCCESS [5.682s]
[java] [INFO] ------------------------------------------------------------------------
[java] [INFO] BUILD SUCCESS
[java] [INFO] ------------------------------------------------------------------------
[java] [INFO] Total time: 59.451s
[java] [INFO] Finished at: Mon Aug 22 21:11:26 UTC 2011
[java] [INFO] Final Memory: 84M/405M
[java] [INFO] ------------------------------------------------------------------------
maven-assembly:
[echo]
[echo] The new Maven distribution was created as part of the MAVEN-COMPILE step, above.
[echo] This goal just validates the presence of that distribution.
extract-assembly:
[echo] Extracting assembly to <https://builds.apache.org/job/core-integration-testing-maven-3-jdk-1.7/ws/apache-maven-3.0-SNAPSHOT> ...
[mkdir] Created dir: <https://builds.apache.org/job/core-integration-testing-maven-3-jdk-1.7/ws/apache-maven-3.0-SNAPSHOT>
[unzip] Expanding: <https://builds.apache.org/job/core-integration-testing-maven-3-jdk-1.7/ws/maven-3-trunk/apache-maven/target/apache-maven-3.0.4-SNAPSHOT-bin.zip> into <https://builds.apache.org/job/core-integration-testing-maven-3-jdk-1.7/ws/apache-maven-3.0-SNAPSHOT>
all:
BUILD SUCCESSFUL
Total time: 1 minute 46 seconds
[core-integration-testing-maven-3-jdk-1.7] $ /bin/bash -xe /tmp/hudson5736030690553262725.sh
+ rm -rf <https://builds.apache.org/job/core-integration-testing-maven-3-jdk-1.7/ws/core-integration-testing-maven-3-trunk/.repository>
[maven-3-trunk] $ /home/jenkins/jenkins-slave/tools/Maven_3.0.3/bin/mvn -f <https://builds.apache.org/job/core-integration-testing-maven-3-jdk-1.7/ws/core-integration-testing-trunk/pom.xml> -Dmaven.home=<https://builds.apache.org/job/core-integration-testing-maven-3-jdk-1.7/ws/apache-maven-3.0-SNAPSHOT> -Dmaven.repo.local=<https://builds.apache.org/job/core-integration-testing-maven-3-jdk-1.7/ws/local-maven-repo-its> -Dmaven.repo.local=<https://builds.apache.org/job/core-integration-testing-maven-3-jdk-1.7/ws/.repository> clean install -Prun-its -B -U -V
Apache Maven 3.0.3 (r1075438; 2011-02-28 17:31:09+0000)
Maven home: /home/jenkins/jenkins-slave/tools/Maven_3.0.3
Java version: 1.7.0, vendor: Oracle Corporation
Java home: /home/jenkins/tools/java/jdk1.7.0-32/jre
Default locale: en_US, platform encoding: ANSI_X3.4-1968
OS name: "linux", version: "2.6.32-33-server", arch: "i386", family: "unix"
[INFO] Scanning for projects...
Downloading: http://repository.apache.org/snapshots/org/apache/maven/maven-parent/21-SNAPSHOT/maven-metadata.xml
Downloading: http://repository.apache.org/snapshots/org/apache/maven/maven-parent/21-SNAPSHOT/maven-parent-21-SNAPSHOT.pom
[ERROR] The build could not read 1 project -> [Help 1]
[ERROR]
[ERROR] The project org.apache.maven.its:core-its:2.1-SNAPSHOT (<https://builds.apache.org/job/core-integration-testing-maven-3-jdk-1.7/ws/core-integration-testing-trunk/pom.xml)> has 1 error
[ERROR] Non-resolvable parent POM: Could not find artifact org.apache.maven:maven-parent:pom:21-SNAPSHOT in Nexus (http://repository.apache.org/snapshots) and 'parent.relativePath' points at wrong local POM @ line 25, column 11 -> [Help 2]
[ERROR]
[ERROR] To see the full stack trace of the errors, re-run Maven with the -e switch.
[ERROR] Re-run Maven using the -X switch to enable full debug logging.
[ERROR]
[ERROR] For more information about the errors and possible solutions, please read the following articles:
[ERROR] [Help 1] http://cwiki.apache.org/confluence/display/MAVEN/ProjectBuildingException
[ERROR] [Help 2] http://cwiki.apache.org/confluence/display/MAVEN/UnresolvableModelException
Build step 'Invoke top-level Maven targets' marked build as failure
Recording test results
Jenkins build is back to normal :
core-integration-testing-maven-3-jdk-1.7 #19
Posted by Apache Jenkins Server <je...@builds.apache.org>.
See <https://builds.apache.org/job/core-integration-testing-maven-3-jdk-1.7/19/changes>
Build failed in Jenkins: core-integration-testing-maven-3-jdk-1.7
#18
Posted by Apache Jenkins Server <je...@builds.apache.org>.
See <https://builds.apache.org/job/core-integration-testing-maven-3-jdk-1.7/18/changes>
Changes:
[hboutemy] [MNG-5151] use proper CNAME (continued from r1155270)
[hboutemy] code formatting
------------------------------------------
[...truncated 521 lines...]
[java] [INFO] Change the default 'svn' provider implementation to 'javasvn'.
[java] [INFO] Checking for local modifications: skipped.
[java] [INFO] Updating project files from SCM: skipped.
[java] [INFO] Storing buildNumber: 1160999 at timestamp: 1314173200423
[java] [INFO] Storing buildScmBranch: trunk
[java] [INFO]
[java] [INFO] --- maven-resources-plugin:2.4.2:resources (default-resources) @ maven-core ---
[java] [INFO] Using 'UTF-8' encoding to copy filtered resources.
[java] [INFO] Copying 16 resources
[java] [INFO] Copying 3 resources
[java] [INFO]
[java] [INFO] --- maven-compiler-plugin:2.3.2:compile (default-compile) @ maven-core ---
[java] [INFO] Compiling 298 source files to <https://builds.apache.org/job/core-integration-testing-maven-3-jdk-1.7/ws/maven-3-trunk/maven-core/target/classes>
[java] [INFO]
[java] [INFO] --- animal-sniffer-maven-plugin:1.6:check (check-java-1.5-compat) @ maven-core ---
[java] [INFO] Checking unresolved references to org.codehaus.mojo.signature:java15:1.0
[java] [INFO]
[java] [INFO] --- plexus-component-metadata:1.5.5:generate-metadata (default) @ maven-core ---
[java] [INFO] Discovered 59 component descriptors(s)
[java] [INFO]
[java] [INFO] --- maven-resources-plugin:2.4.2:testResources (default-testResources) @ maven-core ---
[java] [INFO] Using 'UTF-8' encoding to copy filtered resources.
[java] [INFO] Copying 212 resources
[java] [INFO] Copying 3 resources
[java] [INFO]
[java] [INFO] --- maven-compiler-plugin:2.3.2:testCompile (default-testCompile) @ maven-core ---
[java] [INFO] Compiling 71 source files to <https://builds.apache.org/job/core-integration-testing-maven-3-jdk-1.7/ws/maven-3-trunk/maven-core/target/test-classes>
[java] [INFO]
[java] [INFO] --- plexus-component-metadata:1.5.5:generate-test-metadata (default) @ maven-core ---
[java] [INFO] Discovered 4 component descriptors(s)
[java] [INFO]
[java] [INFO] --- maven-surefire-plugin:2.8.1:test (default-test) @ maven-core ---
[java] [INFO] Tests are skipped.
[java] [INFO]
[java] [INFO] --- maven-jar-plugin:2.3.1:jar (default-jar) @ maven-core ---
[java] [INFO] Building jar: <https://builds.apache.org/job/core-integration-testing-maven-3-jdk-1.7/ws/maven-3-trunk/maven-core/target/maven-core-3.0.4-SNAPSHOT.jar>
[java] [INFO]
[java] [INFO] --- maven-install-plugin:2.3.1:install (default-install) @ maven-core ---
[java] [INFO] Installing <https://builds.apache.org/job/core-integration-testing-maven-3-jdk-1.7/ws/maven-3-trunk/maven-core/target/maven-core-3.0.4-SNAPSHOT.jar> to /home/jenkins/.m2/repository/org/apache/maven/maven-core/3.0.4-SNAPSHOT/maven-core-3.0.4-SNAPSHOT.jar
[java] [INFO] Installing <https://builds.apache.org/job/core-integration-testing-maven-3-jdk-1.7/ws/maven-3-trunk/maven-core/pom.xml> to /home/jenkins/.m2/repository/org/apache/maven/maven-core/3.0.4-SNAPSHOT/maven-core-3.0.4-SNAPSHOT.pom
[java] [INFO]
[java] [INFO] ------------------------------------------------------------------------
[java] [INFO] Building Maven Compat 3.0.4-SNAPSHOT
[java] [INFO] ------------------------------------------------------------------------
[java] [INFO]
[java] [INFO] --- maven-clean-plugin:2.4.1:clean (default-clean) @ maven-compat ---
[java] [INFO] Deleting <https://builds.apache.org/job/core-integration-testing-maven-3-jdk-1.7/ws/maven-3-trunk/maven-compat/target>
[java] [INFO]
[java] [INFO] --- modello-maven-plugin:1.4.1:java (standard) @ maven-compat ---
[java] [INFO] outputDirectory: <https://builds.apache.org/job/core-integration-testing-maven-3-jdk-1.7/ws/maven-3-trunk/maven-compat/target/generated-sources/modello>
[java] [INFO] Working on model: src/main/mdo/profiles.mdo
[java] [INFO] Generating current version: 1.0.0
[java] [INFO] Working on model: src/main/mdo/paramdoc.mdo
[java] [INFO] Generating current version: 1.0.0
[java] [INFO]
[java] [INFO] --- modello-maven-plugin:1.4.1:xpp3-reader (standard) @ maven-compat ---
[java] [INFO] outputDirectory: <https://builds.apache.org/job/core-integration-testing-maven-3-jdk-1.7/ws/maven-3-trunk/maven-compat/target/generated-sources/modello>
[java] [INFO] Working on model: src/main/mdo/profiles.mdo
[java] [INFO] Generating current version: 1.0.0
[java] [INFO] Working on model: src/main/mdo/paramdoc.mdo
[java] [INFO] Generating current version: 1.0.0
[java] [INFO]
[java] [INFO] --- modello-maven-plugin:1.4.1:xpp3-writer (standard) @ maven-compat ---
[java] [INFO] outputDirectory: <https://builds.apache.org/job/core-integration-testing-maven-3-jdk-1.7/ws/maven-3-trunk/maven-compat/target/generated-sources/modello>
[java] [INFO] Working on model: src/main/mdo/profiles.mdo
[java] [INFO] Generating current version: 1.0.0
[java] [INFO] Working on model: src/main/mdo/paramdoc.mdo
[java] [INFO] Generating current version: 1.0.0
[java] [INFO]
[java] [INFO] --- maven-remote-resources-plugin:1.1:process (default) @ maven-compat ---
[java] [INFO]
[java] [INFO] --- maven-resources-plugin:2.4.2:resources (default-resources) @ maven-compat ---
[java] [INFO] Using 'UTF-8' encoding to copy filtered resources.
[java] [INFO] Copying 4 resources
[java] [INFO] Copying 3 resources
[java] [INFO]
[java] [INFO] --- maven-compiler-plugin:2.3.2:compile (default-compile) @ maven-compat ---
[java] [INFO] Compiling 146 source files to <https://builds.apache.org/job/core-integration-testing-maven-3-jdk-1.7/ws/maven-3-trunk/maven-compat/target/classes>
[java] [INFO]
[java] [INFO] --- animal-sniffer-maven-plugin:1.6:check (check-java-1.5-compat) @ maven-compat ---
[java] [INFO] Checking unresolved references to org.codehaus.mojo.signature:java15:1.0
[java] [INFO]
[java] [INFO] --- plexus-component-metadata:1.5.5:generate-metadata (default) @ maven-compat ---
[java] [INFO] Discovered 34 component descriptors(s)
[java] [INFO]
[java] [INFO] --- maven-resources-plugin:2.4.2:testResources (default-testResources) @ maven-compat ---
[java] [INFO] Using 'UTF-8' encoding to copy filtered resources.
[java] [INFO] Copying 156 resources
[java] [INFO] Copying 3 resources
[java] [INFO]
[java] [INFO] --- maven-compiler-plugin:2.3.2:testCompile (default-testCompile) @ maven-compat ---
[java] [INFO] Compiling 71 source files to <https://builds.apache.org/job/core-integration-testing-maven-3-jdk-1.7/ws/maven-3-trunk/maven-compat/target/test-classes>
[java] [INFO]
[java] [INFO] --- plexus-component-metadata:1.5.5:generate-test-metadata (default) @ maven-compat ---
[java] [INFO] Discovered 12 component descriptors(s)
[java] [INFO]
[java] [INFO] --- maven-surefire-plugin:2.8.1:test (default-test) @ maven-compat ---
[java] [INFO] Tests are skipped.
[java] [INFO]
[java] [INFO] --- maven-jar-plugin:2.3.1:jar (default-jar) @ maven-compat ---
[java] [INFO] Building jar: <https://builds.apache.org/job/core-integration-testing-maven-3-jdk-1.7/ws/maven-3-trunk/maven-compat/target/maven-compat-3.0.4-SNAPSHOT.jar>
[java] [INFO]
[java] [INFO] --- maven-install-plugin:2.3.1:install (default-install) @ maven-compat ---
[java] [INFO] Installing <https://builds.apache.org/job/core-integration-testing-maven-3-jdk-1.7/ws/maven-3-trunk/maven-compat/target/maven-compat-3.0.4-SNAPSHOT.jar> to /home/jenkins/.m2/repository/org/apache/maven/maven-compat/3.0.4-SNAPSHOT/maven-compat-3.0.4-SNAPSHOT.jar
[java] [INFO] Installing <https://builds.apache.org/job/core-integration-testing-maven-3-jdk-1.7/ws/maven-3-trunk/maven-compat/pom.xml> to /home/jenkins/.m2/repository/org/apache/maven/maven-compat/3.0.4-SNAPSHOT/maven-compat-3.0.4-SNAPSHOT.pom
[java] [INFO]
[java] [INFO] ------------------------------------------------------------------------
[java] [INFO] Building Maven Embedder 3.0.4-SNAPSHOT
[java] [INFO] ------------------------------------------------------------------------
[java] [INFO]
[java] [INFO] --- maven-clean-plugin:2.4.1:clean (default-clean) @ maven-embedder ---
[java] [INFO] Deleting <https://builds.apache.org/job/core-integration-testing-maven-3-jdk-1.7/ws/maven-3-trunk/maven-embedder/target>
[java] [INFO]
[java] [INFO] --- maven-remote-resources-plugin:1.1:process (default) @ maven-embedder ---
[java] [INFO]
[java] [INFO] --- maven-resources-plugin:2.4.2:resources (default-resources) @ maven-embedder ---
[java] [INFO] Using 'UTF-8' encoding to copy filtered resources.
[java] [INFO] Copying 1 resource
[java] [INFO] Copying 3 resources
[java] [INFO]
[java] [INFO] --- maven-compiler-plugin:2.3.2:compile (default-compile) @ maven-embedder ---
[java] [INFO] Compiling 11 source files to <https://builds.apache.org/job/core-integration-testing-maven-3-jdk-1.7/ws/maven-3-trunk/maven-embedder/target/classes>
[java] [INFO]
[java] [INFO] --- animal-sniffer-maven-plugin:1.6:check (check-java-1.5-compat) @ maven-embedder ---
[java] [INFO] Checking unresolved references to org.codehaus.mojo.signature:java15:1.0
[java] [INFO]
[java] [INFO] --- plexus-component-metadata:1.5.5:generate-metadata (default) @ maven-embedder ---
[java] [INFO]
[java] [INFO] --- maven-resources-plugin:2.4.2:testResources (default-testResources) @ maven-embedder ---
[java] [INFO] Using 'UTF-8' encoding to copy filtered resources.
[java] [INFO] Copying 7 resources
[java] [INFO] Copying 3 resources
[java] [INFO]
[java] [INFO] --- maven-compiler-plugin:2.3.2:testCompile (default-testCompile) @ maven-embedder ---
[java] [INFO] Nothing to compile - all classes are up to date
[java] [INFO]
[java] [INFO] --- plexus-component-metadata:1.5.5:generate-test-metadata (default) @ maven-embedder ---
[java] [INFO]
[java] [INFO] --- maven-surefire-plugin:2.8.1:test (default-test) @ maven-embedder ---
[java] [INFO] Tests are skipped.
[java] [INFO]
[java] [INFO] --- maven-jar-plugin:2.3.1:jar (default-jar) @ maven-embedder ---
[java] [INFO] Building jar: <https://builds.apache.org/job/core-integration-testing-maven-3-jdk-1.7/ws/maven-3-trunk/maven-embedder/target/maven-embedder-3.0.4-SNAPSHOT.jar>
[java] [INFO]
[java] [INFO] --- maven-install-plugin:2.3.1:install (default-install) @ maven-embedder ---
[java] [INFO] Installing <https://builds.apache.org/job/core-integration-testing-maven-3-jdk-1.7/ws/maven-3-trunk/maven-embedder/target/maven-embedder-3.0.4-SNAPSHOT.jar> to /home/jenkins/.m2/repository/org/apache/maven/maven-embedder/3.0.4-SNAPSHOT/maven-embedder-3.0.4-SNAPSHOT.jar
[java] [INFO] Installing <https://builds.apache.org/job/core-integration-testing-maven-3-jdk-1.7/ws/maven-3-trunk/maven-embedder/pom.xml> to /home/jenkins/.m2/repository/org/apache/maven/maven-embedder/3.0.4-SNAPSHOT/maven-embedder-3.0.4-SNAPSHOT.pom
[java] [INFO]
[java] [INFO] ------------------------------------------------------------------------
[java] [INFO] Building Maven Distribution 3.0.4-SNAPSHOT
[java] [INFO] ------------------------------------------------------------------------
[java] [INFO]
[java] [INFO] --- maven-clean-plugin:2.4.1:clean (default-clean) @ apache-maven ---
[java] [INFO] Deleting <https://builds.apache.org/job/core-integration-testing-maven-3-jdk-1.7/ws/maven-3-trunk/apache-maven/target>
[java] [INFO]
[java] [INFO] --- maven-remote-resources-plugin:1.1:process (default) @ apache-maven ---
[java] [INFO]
[java] [INFO] --- animal-sniffer-maven-plugin:1.6:check (check-java-1.5-compat) @ apache-maven ---
[java] [INFO] Checking unresolved references to org.codehaus.mojo.signature:java15:1.0
[java] [INFO]
[java] [INFO] --- maven-compiler-plugin:2.3.2:testCompile (test-compile) @ apache-maven ---
[java] [INFO] Compiling 1 source file to <https://builds.apache.org/job/core-integration-testing-maven-3-jdk-1.7/ws/maven-3-trunk/apache-maven/target/test-classes>
[java] [INFO]
[java] [INFO] --- maven-surefire-plugin:2.8.1:test (test) @ apache-maven ---
[java] [INFO] Tests are skipped.
[java] [INFO]
[java] [INFO] --- maven-assembly-plugin:2.2-beta-5:single (create-distro) @ apache-maven ---
[java] [INFO] Reading assembly descriptor: src/main/assembly/bin.xml
[java] [WARNING] The following patterns were never triggered in this artifact exclusion filter:
[java] o 'junit:junit'
[java] o 'log4j:log4j'
[java] o 'commons-logging:commons-logging-api'
[java]
[java] [INFO] Building zip: <https://builds.apache.org/job/core-integration-testing-maven-3-jdk-1.7/ws/maven-3-trunk/apache-maven/target/apache-maven-3.0.4-SNAPSHOT-bin.zip>
[java] [WARNING] The following patterns were never triggered in this artifact exclusion filter:
[java] o 'junit:junit'
[java] o 'log4j:log4j'
[java] o 'commons-logging:commons-logging-api'
[java]
[java] [INFO] Building tar : <https://builds.apache.org/job/core-integration-testing-maven-3-jdk-1.7/ws/maven-3-trunk/apache-maven/target/apache-maven-3.0.4-SNAPSHOT-bin.tar.gz>
[java] [INFO]
[java] [INFO] --- maven-install-plugin:2.3.1:install (default-install) @ apache-maven ---
[java] [INFO] Installing <https://builds.apache.org/job/core-integration-testing-maven-3-jdk-1.7/ws/maven-3-trunk/apache-maven/pom.xml> to /home/jenkins/.m2/repository/org/apache/maven/apache-maven/3.0.4-SNAPSHOT/apache-maven-3.0.4-SNAPSHOT.pom
[java] [INFO] Installing <https://builds.apache.org/job/core-integration-testing-maven-3-jdk-1.7/ws/maven-3-trunk/apache-maven/target/apache-maven-3.0.4-SNAPSHOT-bin.zip> to /home/jenkins/.m2/repository/org/apache/maven/apache-maven/3.0.4-SNAPSHOT/apache-maven-3.0.4-SNAPSHOT-bin.zip
[java] [INFO] Installing <https://builds.apache.org/job/core-integration-testing-maven-3-jdk-1.7/ws/maven-3-trunk/apache-maven/target/apache-maven-3.0.4-SNAPSHOT-bin.tar.gz> to /home/jenkins/.m2/repository/org/apache/maven/apache-maven/3.0.4-SNAPSHOT/apache-maven-3.0.4-SNAPSHOT-bin.tar.gz
[java] [INFO] ------------------------------------------------------------------------
[java] [INFO] Reactor Summary:
[java] [INFO]
[java] [INFO] Apache Maven ...................................... SUCCESS [2.533s]
[java] [INFO] Maven Model ....................................... SUCCESS [5.298s]
[java] [INFO] Maven Settings .................................... SUCCESS [1.692s]
[java] [INFO] Maven Settings Builder ............................ SUCCESS [2.253s]
[java] [INFO] Maven Repository Metadata Model ................... SUCCESS [1.149s]
[java] [INFO] Maven Artifact .................................... SUCCESS [2.747s]
[java] [INFO] Maven Plugin API .................................. SUCCESS [2.790s]
[java] [INFO] Maven Model Builder ............................... SUCCESS [3.907s]
[java] [INFO] Maven Aether Provider ............................. SUCCESS [2.331s]
[java] [INFO] Maven Core ........................................ SUCCESS [16.059s]
[java] [INFO] Maven Compat ...................................... SUCCESS [11.027s]
[java] [INFO] Maven Embedder .................................... SUCCESS [2.514s]
[java] [INFO] Maven Distribution ................................ SUCCESS [5.807s]
[java] [INFO] ------------------------------------------------------------------------
[java] [INFO] BUILD SUCCESS
[java] [INFO] ------------------------------------------------------------------------
[java] [INFO] Total time: 1:00.682s
[java] [INFO] Finished at: Wed Aug 24 08:07:14 UTC 2011
[java] [INFO] Final Memory: 84M/407M
[java] [INFO] ------------------------------------------------------------------------
maven-assembly:
[echo]
[echo] The new Maven distribution was created as part of the MAVEN-COMPILE step, above.
[echo] This goal just validates the presence of that distribution.
extract-assembly:
[echo] Extracting assembly to <https://builds.apache.org/job/core-integration-testing-maven-3-jdk-1.7/ws/apache-maven-3.0-SNAPSHOT> ...
[delete] Deleting directory <https://builds.apache.org/job/core-integration-testing-maven-3-jdk-1.7/ws/apache-maven-3.0-SNAPSHOT>
[mkdir] Created dir: <https://builds.apache.org/job/core-integration-testing-maven-3-jdk-1.7/ws/apache-maven-3.0-SNAPSHOT>
[unzip] Expanding: <https://builds.apache.org/job/core-integration-testing-maven-3-jdk-1.7/ws/maven-3-trunk/apache-maven/target/apache-maven-3.0.4-SNAPSHOT-bin.zip> into <https://builds.apache.org/job/core-integration-testing-maven-3-jdk-1.7/ws/apache-maven-3.0-SNAPSHOT>
all:
BUILD SUCCESSFUL
Total time: 1 minute 50 seconds
[core-integration-testing-maven-3-jdk-1.7] $ /bin/bash -xe /tmp/hudson6395478344461073816.sh
+ rm -rf <https://builds.apache.org/job/core-integration-testing-maven-3-jdk-1.7/ws/core-integration-testing-maven-3-trunk/.repository>
[maven-3-trunk] $ /home/jenkins/jenkins-slave/tools/Maven_3.0.3/bin/mvn -f <https://builds.apache.org/job/core-integration-testing-maven-3-jdk-1.7/ws/core-integration-testing-trunk/pom.xml> -Dmaven.home=<https://builds.apache.org/job/core-integration-testing-maven-3-jdk-1.7/ws/apache-maven-3.0-SNAPSHOT> -Dmaven.repo.local=<https://builds.apache.org/job/core-integration-testing-maven-3-jdk-1.7/ws/local-maven-repo-its> -Dmaven.repo.local=<https://builds.apache.org/job/core-integration-testing-maven-3-jdk-1.7/ws/.repository> clean install -Prun-its -B -U -V
Apache Maven 3.0.3 (r1075438; 2011-02-28 17:31:09+0000)
Maven home: /home/jenkins/jenkins-slave/tools/Maven_3.0.3
Java version: 1.7.0, vendor: Oracle Corporation
Java home: /home/jenkins/tools/java/jdk1.7.0-32/jre
Default locale: en_US, platform encoding: ANSI_X3.4-1968
OS name: "linux", version: "2.6.32-33-server", arch: "i386", family: "unix"
[INFO] Scanning for projects...
Downloading: http://repository.apache.org/snapshots/org/apache/maven/maven-parent/21-SNAPSHOT/maven-metadata.xml
Downloading: http://repository.apache.org/snapshots/org/apache/maven/maven-parent/21-SNAPSHOT/maven-parent-21-SNAPSHOT.pom
[ERROR] The build could not read 1 project -> [Help 1]
[ERROR]
[ERROR] The project org.apache.maven.its:core-its:2.1-SNAPSHOT (<https://builds.apache.org/job/core-integration-testing-maven-3-jdk-1.7/ws/core-integration-testing-trunk/pom.xml)> has 1 error
[ERROR] Non-resolvable parent POM: Could not find artifact org.apache.maven:maven-parent:pom:21-SNAPSHOT in Nexus (http://repository.apache.org/snapshots) and 'parent.relativePath' points at wrong local POM @ line 25, column 11 -> [Help 2]
[ERROR]
[ERROR] To see the full stack trace of the errors, re-run Maven with the -e switch.
[ERROR] Re-run Maven using the -X switch to enable full debug logging.
[ERROR]
[ERROR] For more information about the errors and possible solutions, please read the following articles:
[ERROR] [Help 1] http://cwiki.apache.org/confluence/display/MAVEN/ProjectBuildingException
[ERROR] [Help 2] http://cwiki.apache.org/confluence/display/MAVEN/UnresolvableModelException
Build step 'Invoke top-level Maven targets' marked build as failure
Recording test results