You are viewing a plain text version of this content. The canonical link for it is here.
Posted to dev@zookeeper.apache.org by Apache Jenkins Server <je...@builds.apache.org> on 2015/02/20 05:36:02 UTC
Failed: ZOOKEEPER-1952 PreCommit Build #2522
Jira: https://issues.apache.org/jira/browse/ZOOKEEPER-1952
Build: https://builds.apache.org/job/PreCommit-ZOOKEEPER-Build/2522/
###################################################################################
########################## LAST 60 LINES OF THE CONSOLE ###########################
[...truncated 349177 lines...]
[exec]
[exec] -1 tests included. The patch doesn't appear to include any new or modified tests.
[exec] Please justify why no new tests are needed for this patch.
[exec] Also please list what manual steps were performed to verify this patch.
[exec]
[exec] +1 javadoc. The javadoc tool did not generate any warning messages.
[exec]
[exec] +1 javac. The applied patch does not increase the total number of javac compiler warnings.
[exec]
[exec] +1 findbugs. The patch does not introduce any new Findbugs (version 2.0.3) warnings.
[exec]
[exec] +1 release audit. The applied patch does not increase the total number of release audit warnings.
[exec]
[exec] -1 core tests. The patch failed core unit tests.
[exec]
[exec] +1 contrib tests. The patch passed contrib unit tests.
[exec]
[exec] Test results: https://builds.apache.org/job/PreCommit-ZOOKEEPER-Build/2522//testReport/
[exec] Findbugs warnings: https://builds.apache.org/job/PreCommit-ZOOKEEPER-Build/2522//artifact/trunk/build/test/findbugs/newPatchFindbugsWarnings.html
[exec] Console output: https://builds.apache.org/job/PreCommit-ZOOKEEPER-Build/2522//console
[exec]
[exec] This message is automatically generated.
[exec]
[exec]
[exec] ======================================================================
[exec] ======================================================================
[exec] Adding comment to Jira.
[exec] ======================================================================
[exec] ======================================================================
[exec]
[exec]
[exec] Comment added.
[exec] c6dab4ee93f749a6fdf5ad6294c7dc4d18cc5ee6 logged out
[exec]
[exec]
[exec] ======================================================================
[exec] ======================================================================
[exec] Finished build.
[exec] ======================================================================
[exec] ======================================================================
[exec]
[exec]
BUILD FAILED
/home/jenkins/jenkins-slave/workspace/PreCommit-ZOOKEEPER-Build/trunk/build.xml:1714: exec returned: 2
Total time: 45 minutes 13 seconds
Build step 'Execute shell' marked build as failure
Archiving artifacts
Sending artifact delta relative to PreCommit-ZOOKEEPER-Build #2489
Archived 7 artifacts
Archive block size is 32768
Received 3 blocks and 459293 bytes
Compression is 17.6%
Took 2.1 sec
Recording test results
Description set: ZOOKEEPER-1952
Email was triggered for: Failure
Sending email for trigger: Failure
###################################################################################
############################## FAILED TESTS (if any) ##############################
1 tests failed.
FAILED: org.apache.zookeeper.test.AsyncHammerTest.testHammer
Error Message:
null
Stack Trace:
junit.framework.AssertionFailedError
at org.apache.zookeeper.test.AsyncHammerTest.testHammer(AsyncHammerTest.java:186)
at org.apache.zookeeper.JUnit4ZKTestRunner$LoggedInvokeMethod.evaluate(JUnit4ZKTestRunner.java:52)
Failed: ZOOKEEPER-2124 PreCommit Build #2524
Posted by Apache Jenkins Server <je...@builds.apache.org>.
Jira: https://issues.apache.org/jira/browse/ZOOKEEPER-2124
Build: https://builds.apache.org/job/PreCommit-ZOOKEEPER-Build/2524/
###################################################################################
########################## LAST 60 LINES OF THE CONSOLE ###########################
[...truncated 350444 lines...]
[exec]
[exec] -1 tests included. The patch doesn't appear to include any new or modified tests.
[exec] Please justify why no new tests are needed for this patch.
[exec] Also please list what manual steps were performed to verify this patch.
[exec]
[exec] +1 javadoc. The javadoc tool did not generate any warning messages.
[exec]
[exec] +1 javac. The applied patch does not increase the total number of javac compiler warnings.
[exec]
[exec] +1 findbugs. The patch does not introduce any new Findbugs (version 2.0.3) warnings.
[exec]
[exec] +1 release audit. The applied patch does not increase the total number of release audit warnings.
[exec]
[exec] -1 core tests. The patch failed core unit tests.
[exec]
[exec] +1 contrib tests. The patch passed contrib unit tests.
[exec]
[exec] Test results: https://builds.apache.org/job/PreCommit-ZOOKEEPER-Build/2524//testReport/
[exec] Findbugs warnings: https://builds.apache.org/job/PreCommit-ZOOKEEPER-Build/2524//artifact/trunk/build/test/findbugs/newPatchFindbugsWarnings.html
[exec] Console output: https://builds.apache.org/job/PreCommit-ZOOKEEPER-Build/2524//console
[exec]
[exec] This message is automatically generated.
[exec]
[exec]
[exec] ======================================================================
[exec] ======================================================================
[exec] Adding comment to Jira.
[exec] ======================================================================
[exec] ======================================================================
[exec]
[exec]
[exec] Comment added.
[exec] 8bea7a646725ef7e50c18ebafa700ad19ee77b44 logged out
[exec]
[exec]
[exec] ======================================================================
[exec] ======================================================================
[exec] Finished build.
[exec] ======================================================================
[exec] ======================================================================
[exec]
[exec]
BUILD FAILED
/home/jenkins/jenkins-slave/workspace/PreCommit-ZOOKEEPER-Build/trunk/build.xml:1714: exec returned: 2
Total time: 45 minutes 40 seconds
Build step 'Execute shell' marked build as failure
Archiving artifacts
Sending artifact delta relative to PreCommit-ZOOKEEPER-Build #2489
Archived 7 artifacts
Archive block size is 32768
Received 3 blocks and 459291 bytes
Compression is 17.6%
Took 1.6 sec
Recording test results
Description set: ZOOKEEPER-2124
Email was triggered for: Failure
Sending email for trigger: Failure
###################################################################################
############################## FAILED TESTS (if any) ##############################
1 tests failed.
FAILED: org.apache.zookeeper.test.ReconfigTest.testPortChange
Error Message:
expected:<test[1]> but was:<test[0]>
Stack Trace:
junit.framework.AssertionFailedError: expected:<test[1]> but was:<test[0]>
at org.apache.zookeeper.test.ReconfigTest.testNormalOperation(ReconfigTest.java:151)
at org.apache.zookeeper.test.ReconfigTest.testPortChange(ReconfigTest.java:600)
at org.apache.zookeeper.JUnit4ZKTestRunner$LoggedInvokeMethod.evaluate(JUnit4ZKTestRunner.java:52)
Failed: ZOOKEEPER-2124 PreCommit Build #2523
Posted by Apache Jenkins Server <je...@builds.apache.org>.
Jira: https://issues.apache.org/jira/browse/ZOOKEEPER-2124
Build: https://builds.apache.org/job/PreCommit-ZOOKEEPER-Build/2523/
###################################################################################
########################## LAST 60 LINES OF THE CONSOLE ###########################
[...truncated 350916 lines...]
[exec]
[exec] -1 tests included. The patch doesn't appear to include any new or modified tests.
[exec] Please justify why no new tests are needed for this patch.
[exec] Also please list what manual steps were performed to verify this patch.
[exec]
[exec] +1 javadoc. The javadoc tool did not generate any warning messages.
[exec]
[exec] +1 javac. The applied patch does not increase the total number of javac compiler warnings.
[exec]
[exec] +1 findbugs. The patch does not introduce any new Findbugs (version 2.0.3) warnings.
[exec]
[exec] +1 release audit. The applied patch does not increase the total number of release audit warnings.
[exec]
[exec] -1 core tests. The patch failed core unit tests.
[exec]
[exec] +1 contrib tests. The patch passed contrib unit tests.
[exec]
[exec] Test results: https://builds.apache.org/job/PreCommit-ZOOKEEPER-Build/2523//testReport/
[exec] Findbugs warnings: https://builds.apache.org/job/PreCommit-ZOOKEEPER-Build/2523//artifact/trunk/build/test/findbugs/newPatchFindbugsWarnings.html
[exec] Console output: https://builds.apache.org/job/PreCommit-ZOOKEEPER-Build/2523//console
[exec]
[exec] This message is automatically generated.
[exec]
[exec]
[exec] ======================================================================
[exec] ======================================================================
[exec] Adding comment to Jira.
[exec] ======================================================================
[exec] ======================================================================
[exec]
[exec]
[exec] Comment added.
[exec] 425b2c8020d5478c74f5b8b3947512afef90969f logged out
[exec]
[exec]
[exec] ======================================================================
[exec] ======================================================================
[exec] Finished build.
[exec] ======================================================================
[exec] ======================================================================
[exec]
[exec]
BUILD FAILED
/home/jenkins/jenkins-slave/workspace/PreCommit-ZOOKEEPER-Build/trunk/build.xml:1714: exec returned: 2
Total time: 46 minutes 7 seconds
Build step 'Execute shell' marked build as failure
Archiving artifacts
Sending artifact delta relative to PreCommit-ZOOKEEPER-Build #2489
Archived 7 artifacts
Archive block size is 32768
Received 3 blocks and 459293 bytes
Compression is 17.6%
Took 1.6 sec
Recording test results
Description set: ZOOKEEPER-2124
Email was triggered for: Failure
Sending email for trigger: Failure
###################################################################################
############################## FAILED TESTS (if any) ##############################
2 tests failed.
REGRESSION: org.apache.zookeeper.test.ReconfigTest.testPortChange
Error Message:
expected:<test[1]> but was:<test[0]>
Stack Trace:
junit.framework.AssertionFailedError: expected:<test[1]> but was:<test[0]>
at org.apache.zookeeper.test.ReconfigTest.testNormalOperation(ReconfigTest.java:151)
at org.apache.zookeeper.test.ReconfigTest.testPortChange(ReconfigTest.java:600)
at org.apache.zookeeper.JUnit4ZKTestRunner$LoggedInvokeMethod.evaluate(JUnit4ZKTestRunner.java:52)
FAILED: org.apache.zookeeper.test.AsyncHammerTest.testHammer
Error Message:
null
Stack Trace:
junit.framework.AssertionFailedError
at org.apache.zookeeper.test.AsyncHammerTest.testHammer(AsyncHammerTest.java:186)
at org.apache.zookeeper.JUnit4ZKTestRunner$LoggedInvokeMethod.evaluate(JUnit4ZKTestRunner.java:52)