You are viewing a plain text version of this content. The canonical link for it is here.
Posted to builds@beam.apache.org by Apache Jenkins Server <je...@builds.apache.org> on 2022/04/20 18:01:09 UTC
Build failed in Jenkins: beam_PostCommit_Sickbay_Python36 #2
See <https://ci-beam.apache.org/job/beam_PostCommit_Sickbay_Python36/2/display/redirect?page=changes>
Changes:
[Kenneth Knowles] Upgrade to Gradle 7.4
[Kenneth Knowles] Remove Python module dependency on Dataflow worker
[pandiana] BigQueryServicesImpl: reduce number of threads spawned by
[Heejong Lee] [BEAM-14251] add output_coder_override to ExpansionRequest
[Heejong Lee] remove null
[rarokni] [BEAM-14307] Fix Slow Side input pattern bug in sample
[noreply] [BEAM-13925] Dont double assign committers if author or other reviewer
[noreply] [BEAM-13739] Remove deprecated shallow clone funcs (#17362)
[noreply] [BEAM-11104] Pipe Continuation to DataSource level (#17334)
[noreply] [BEAM-11105] Basic Watermark Estimation (Wall Clock Observing) (#17267)
[noreply] Respect output coder for TextIO. (#17367)
[Heejong Lee] better error msg
[noreply] Merge pull request #17200 from [BEAM-12164]: fix the autoscaling backlog
[andyye333] Change func to PTransform
[noreply] [BEAM-17035] Call python3 directly when it is available. (#17366)
[noreply] Merge pull request #17375: [BEAM-8691] Declare newer
[noreply] [BEAM-13204] Fix website bug where code tabs do not appear if the
[Heejong Lee] update from comments
[noreply] [BEAM-14316] Introducing KafkaIO.Read implementation compatibility
[noreply] [BEAM-14290] Address staticcheck warnings in the reflectx package
[noreply] [BEAM-14302] Simply bools in fn.go, genx_test.go (#17356)
[noreply] Merge pull request #17382: [BEAM-12356] Close DatasetService leak as
[noreply] Populate actual dataflow job id to bigquery write trace id (#17130)
[relax] mark static thread as a daemon thread
[noreply] [BEAM-13866] Add miscellaneous exec unit tests (#17363)
[mmack] [BEAM-14323] Improve IDE integration of Spark cross version builds
[noreply] [BEAM-14112] Fixed ReadFromBigQuery with Interactive Beam (#17306)
------------------------------------------
Started by timer
Running as SYSTEM
[EnvInject] - Loading node environment variables.
Building remotely on apache-beam-jenkins-14 (beam) in workspace <https://ci-beam.apache.org/job/beam_PostCommit_Sickbay_Python36/ws/>
The recommended git tool is: NONE
No credentials specified
Wiping out workspace first.
Cloning the remote Git repository
Cloning repository https://github.com/apache/beam.git
> git init <https://ci-beam.apache.org/job/beam_PostCommit_Sickbay_Python36/ws/src> # timeout=10
Fetching upstream changes from https://github.com/apache/beam.git
> git --version # timeout=10
> git --version # 'git version 2.25.1'
> git fetch --tags --force --progress -- https://github.com/apache/beam.git +refs/heads/*:refs/remotes/origin/* # timeout=10
> git config remote.origin.url https://github.com/apache/beam.git # timeout=10
> git config --add remote.origin.fetch +refs/heads/*:refs/remotes/origin/* # timeout=10
> git config remote.origin.url https://github.com/apache/beam.git # timeout=10
Fetching upstream changes from https://github.com/apache/beam.git
> git fetch --tags --force --progress -- https://github.com/apache/beam.git +refs/heads/*:refs/remotes/origin/* +refs/pull/${ghprbPullId}/*:refs/remotes/origin/pr/${ghprbPullId}/* # timeout=10
> git rev-parse origin/master^{commit} # timeout=10
Checking out Revision 1fa7f45cf91681bb8ae53a23da705cb543a2bb58 (origin/master)
> git config core.sparsecheckout # timeout=10
> git checkout -f 1fa7f45cf91681bb8ae53a23da705cb543a2bb58 # timeout=10
Commit message: "[BEAM-14112] Fixed ReadFromBigQuery with Interactive Beam (#17306)"
> git rev-list --no-walk 2aa24dc3758750bd76c024dc787c06b91fd725ed # timeout=10
No emails were triggered.
[EnvInject] - Executing scripts and injecting environment variables after the SCM step.
[EnvInject] - Injecting as environment variables the properties content
SPARK_LOCAL_IP=127.0.0.1
SETUPTOOLS_USE_DISTUTILS=stdlib
[EnvInject] - Variables injected successfully.
[Gradle] - Launching build.
[src] $ <https://ci-beam.apache.org/job/beam_PostCommit_Sickbay_Python36/ws/src/gradlew> --continue --max-workers=12 -Dorg.gradle.jvmargs=-Xms2g -Dorg.gradle.jvmargs=-Xmx4g -Dorg.gradle.vfs.watch=false -Pdocker-pull-licenses :python36postCommitSickbay
Starting a Gradle Daemon, 3 busy Daemons could not be reused, use --status for details
Configuration on demand is an incubating feature.
> Task :buildSrc:compileJava NO-SOURCE
> Task :buildSrc:compileGroovy FROM-CACHE
> Task :buildSrc:pluginDescriptors
> Task :buildSrc:processResources
> Task :buildSrc:classes
> Task :buildSrc:jar
> Task :buildSrc:assemble
> Task :buildSrc:spotlessGroovy FROM-CACHE
> Task :buildSrc:spotlessGroovyCheck UP-TO-DATE
> Task :buildSrc:spotlessGroovyGradle FROM-CACHE
> Task :buildSrc:spotlessGroovyGradleCheck UP-TO-DATE
> Task :buildSrc:spotlessCheck UP-TO-DATE
> Task :buildSrc:pluginUnderTestMetadata
> Task :buildSrc:compileTestJava NO-SOURCE
> Task :buildSrc:compileTestGroovy NO-SOURCE
> Task :buildSrc:processTestResources NO-SOURCE
> Task :buildSrc:testClasses UP-TO-DATE
> Task :buildSrc:test NO-SOURCE
> Task :buildSrc:validatePlugins FROM-CACHE
> Task :buildSrc:check UP-TO-DATE
> Task :buildSrc:build
FAILURE: Build failed with an exception.
* What went wrong:
Task 'python36postCommitSickbay' not found in root project 'beam'.
* Try:
> Run gradlew tasks to get a list of available tasks.
> Run with --stacktrace option to get the stack trace.
> Run with --info or --debug option to get more log output.
> Run with --scan to get full insights.
* Get more help at https://help.gradle.org
BUILD FAILED in 32s
10 actionable tasks: 4 executed, 4 from cache, 2 up-to-date
Publishing build scan...
https://gradle.com/s/m6na3y6fi24tu
Build step 'Invoke Gradle script' changed build result to FAILURE
Build step 'Invoke Gradle script' marked build as failure
---------------------------------------------------------------------
To unsubscribe, e-mail: builds-unsubscribe@beam.apache.org
For additional commands, e-mail: builds-help@beam.apache.org
Build failed in Jenkins: beam_PostCommit_Sickbay_Python36 #3
Posted by Apache Jenkins Server <je...@builds.apache.org>.
See <https://ci-beam.apache.org/job/beam_PostCommit_Sickbay_Python36/3/display/redirect?page=changes>
Changes:
[bulat.safiullin] [BEAM-14247] [Website] add image
[bulat.safiullin] [BEAM-14247] [Website] center image
[mattcasters] BEAM-1857 : CHANGES.md entry for 2.38.0
[noreply] Update .asf.yaml (#17409)
[noreply] [BEAM-14336] Sickbay flight delays test - dataset seems to be missing
[noreply] [BEAM-14338] Update watermark unit tests to use time.Time.Equals()
[noreply] [BEAM-14328] Tweaks to "Differences from pandas" page (#17413)
[Andrew Pilloud] [BEAM-14253] Disable broken test pending Dataflow fix
[yiru] fix: BigQuery Storage Connector trace id population missing bracket
[noreply] [BEAM-14330] Temporarily disable the clusters auto-cleanup (#17400)
[noreply] Update Beam website to release 2.38.0 (#17378)
[noreply] [BEAM-14213] Add API and construction time validation for Batched DoFns
------------------------------------------
Started by timer
Running as SYSTEM
[EnvInject] - Loading node environment variables.
Building remotely on apache-beam-jenkins-11 (beam) in workspace <https://ci-beam.apache.org/job/beam_PostCommit_Sickbay_Python36/ws/>
The recommended git tool is: NONE
No credentials specified
Wiping out workspace first.
Cloning the remote Git repository
Cloning repository https://github.com/apache/beam.git
> git init <https://ci-beam.apache.org/job/beam_PostCommit_Sickbay_Python36/ws/src> # timeout=10
Fetching upstream changes from https://github.com/apache/beam.git
> git --version # timeout=10
> git --version # 'git version 2.25.1'
> git fetch --tags --force --progress -- https://github.com/apache/beam.git +refs/heads/*:refs/remotes/origin/* # timeout=10
> git config remote.origin.url https://github.com/apache/beam.git # timeout=10
> git config --add remote.origin.fetch +refs/heads/*:refs/remotes/origin/* # timeout=10
> git config remote.origin.url https://github.com/apache/beam.git # timeout=10
Fetching upstream changes from https://github.com/apache/beam.git
> git fetch --tags --force --progress -- https://github.com/apache/beam.git +refs/heads/*:refs/remotes/origin/* +refs/pull/${ghprbPullId}/*:refs/remotes/origin/pr/${ghprbPullId}/* # timeout=10
> git rev-parse origin/master^{commit} # timeout=10
Checking out Revision 97f2bbda4c6b4b4d92e57b43bf5b9b5e6ccb2253 (origin/master)
> git config core.sparsecheckout # timeout=10
> git checkout -f 97f2bbda4c6b4b4d92e57b43bf5b9b5e6ccb2253 # timeout=10
Commit message: "[BEAM-14213] Add API and construction time validation for Batched DoFns (#17253)"
> git rev-list --no-walk 1fa7f45cf91681bb8ae53a23da705cb543a2bb58 # timeout=10
No emails were triggered.
[EnvInject] - Executing scripts and injecting environment variables after the SCM step.
[EnvInject] - Injecting as environment variables the properties content
SPARK_LOCAL_IP=127.0.0.1
SETUPTOOLS_USE_DISTUTILS=stdlib
[EnvInject] - Variables injected successfully.
[Gradle] - Launching build.
[src] $ <https://ci-beam.apache.org/job/beam_PostCommit_Sickbay_Python36/ws/src/gradlew> --continue --max-workers=12 -Dorg.gradle.jvmargs=-Xms2g -Dorg.gradle.jvmargs=-Xmx4g -Dorg.gradle.vfs.watch=false -Pdocker-pull-licenses :python36postCommitSickbay
Starting a Gradle Daemon, 1 busy Daemon could not be reused, use --status for details
Configuration on demand is an incubating feature.
> Task :buildSrc:compileJava NO-SOURCE
> Task :buildSrc:compileGroovy FROM-CACHE
> Task :buildSrc:pluginDescriptors
> Task :buildSrc:processResources
> Task :buildSrc:classes
> Task :buildSrc:jar
> Task :buildSrc:assemble
> Task :buildSrc:spotlessGroovy FROM-CACHE
> Task :buildSrc:spotlessGroovyCheck UP-TO-DATE
> Task :buildSrc:spotlessGroovyGradle FROM-CACHE
> Task :buildSrc:spotlessGroovyGradleCheck UP-TO-DATE
> Task :buildSrc:spotlessCheck UP-TO-DATE
> Task :buildSrc:pluginUnderTestMetadata
> Task :buildSrc:compileTestJava NO-SOURCE
> Task :buildSrc:compileTestGroovy NO-SOURCE
> Task :buildSrc:processTestResources NO-SOURCE
> Task :buildSrc:testClasses UP-TO-DATE
> Task :buildSrc:test NO-SOURCE
> Task :buildSrc:validatePlugins FROM-CACHE
> Task :buildSrc:check UP-TO-DATE
> Task :buildSrc:build
FAILURE: Build failed with an exception.
* What went wrong:
Task 'python36postCommitSickbay' not found in root project 'beam'.
* Try:
> Run gradlew tasks to get a list of available tasks.
> Run with --stacktrace option to get the stack trace.
> Run with --info or --debug option to get more log output.
> Run with --scan to get full insights.
* Get more help at https://help.gradle.org
BUILD FAILED in 26s
10 actionable tasks: 4 executed, 4 from cache, 2 up-to-date
Publishing build scan...
https://gradle.com/s/d6quskyjhqlni
Build step 'Invoke Gradle script' changed build result to FAILURE
Build step 'Invoke Gradle script' marked build as failure
---------------------------------------------------------------------
To unsubscribe, e-mail: builds-unsubscribe@beam.apache.org
For additional commands, e-mail: builds-help@beam.apache.org