You are viewing a plain text version of this content. The canonical link for it is here.
Posted to builds@solr.apache.org by Policeman Jenkins Server <je...@thetaphi.de> on 2025/02/08 13:27:34 UTC

[JENKINS-EA] Solr-main-Windows (64bit/hotspot/jdk-24-ea+16) - Build # 5167 - Still Failing!

Build: https://jenkins.thetaphi.de/job/Solr-main-Windows/5167/
Java: 64bit/hotspot/jdk-24-ea+16 -XX:+UseCompressedOops -XX:+UseG1GC

No tests ran.

[JENKINS] Solr-main-Windows (64bit/hotspot/jdk-22) - Build # 5195 - Still Failing!

Posted by Policeman Jenkins Server <je...@thetaphi.de>.
Build: https://jenkins.thetaphi.de/job/Solr-main-Windows/5195/
Java: 64bit/hotspot/jdk-22 -XX:-UseCompressedOops -XX:+UseSerialGC

No tests ran.

[JENKINS] Solr-main-Windows (64bit/hotspot/jdk-21.0.1) - Build # 5194 - Still Failing!

Posted by Policeman Jenkins Server <je...@thetaphi.de>.
Build: https://jenkins.thetaphi.de/job/Solr-main-Windows/5194/
Java: 64bit/hotspot/jdk-21.0.1 -XX:+UseCompressedOops -XX:+UseG1GC

No tests ran.

[JENKINS] Solr-main-Windows (64bit/hotspot/jdk-22) - Build # 5193 - Still Failing!

Posted by Policeman Jenkins Server <je...@thetaphi.de>.
Build: https://jenkins.thetaphi.de/job/Solr-main-Windows/5193/
Java: 64bit/hotspot/jdk-22 -XX:-UseCompressedOops -XX:+UseG1GC

No tests ran.

[JENKINS] Solr-main-Windows (64bit/hotspot/jdk-22) - Build # 5192 - Still Failing!

Posted by Policeman Jenkins Server <je...@thetaphi.de>.
Build: https://jenkins.thetaphi.de/job/Solr-main-Windows/5192/
Java: 64bit/hotspot/jdk-22 -XX:-UseCompressedOops -XX:+UseG1GC

No tests ran.

[JENKINS-EA] Solr-main-Windows (64bit/hotspot/jdk-25-ea+11) - Build # 5191 - Still Failing!

Posted by Policeman Jenkins Server <je...@thetaphi.de>.
Build: https://jenkins.thetaphi.de/job/Solr-main-Windows/5191/
Java: 64bit/hotspot/jdk-25-ea+11 -XX:+UseCompressedOops -XX:+UseSerialGC

No tests ran.

[JENKINS] Solr-main-Windows (64bit/hotspot/jdk-24-rc) - Build # 5190 - Still Failing!

Posted by Policeman Jenkins Server <je...@thetaphi.de>.
Build: https://jenkins.thetaphi.de/job/Solr-main-Windows/5190/
Java: 64bit/hotspot/jdk-24-rc -XX:+UseCompressedOops -XX:+UseG1GC

No tests ran.

[JENKINS] Solr-main-Windows (64bit/hotspot/jdk-21.0.1) - Build # 5189 - Still Failing!

Posted by Policeman Jenkins Server <je...@thetaphi.de>.
Build: https://jenkins.thetaphi.de/job/Solr-main-Windows/5189/
Java: 64bit/hotspot/jdk-21.0.1 -XX:-UseCompressedOops -XX:+UseSerialGC

All tests passed

[JENKINS] Solr-main-Windows (64bit/hotspot/jdk-21.0.1) - Build # 5188 - Still Failing!

Posted by Policeman Jenkins Server <je...@thetaphi.de>.
Build: https://jenkins.thetaphi.de/job/Solr-main-Windows/5188/
Java: 64bit/hotspot/jdk-21.0.1 -XX:+UseCompressedOops -XX:+UseParallelGC

All tests passed

[JENKINS-EA] Solr-main-Windows (64bit/hotspot/jdk-25-ea+11) - Build # 5187 - Still Failing!

Posted by Policeman Jenkins Server <je...@thetaphi.de>.
Build: https://jenkins.thetaphi.de/job/Solr-main-Windows/5187/
Java: 64bit/hotspot/jdk-25-ea+11 -XX:+UseCompressedOops -XX:+UseParallelGC

No tests ran.

[JENKINS-EA] Solr-main-Windows (64bit/hotspot/jdk-25-ea+11) - Build # 5186 - Still Failing!

Posted by Policeman Jenkins Server <je...@thetaphi.de>.
Build: https://jenkins.thetaphi.de/job/Solr-main-Windows/5186/
Java: 64bit/hotspot/jdk-25-ea+11 -XX:+UseCompressedOops -XX:+UseG1GC

No tests ran.

[JENKINS] Solr-main-Windows (64bit/hotspot/jdk-22) - Build # 5185 - Still Failing!

Posted by Policeman Jenkins Server <je...@thetaphi.de>.
Build: https://jenkins.thetaphi.de/job/Solr-main-Windows/5185/
Java: 64bit/hotspot/jdk-22 -XX:+UseCompressedOops -XX:+UseParallelGC

No tests ran.

[JENKINS] Solr-main-Windows (64bit/hotspot/jdk-22) - Build # 5184 - Still Failing!

Posted by Policeman Jenkins Server <je...@thetaphi.de>.
Build: https://jenkins.thetaphi.de/job/Solr-main-Windows/5184/
Java: 64bit/hotspot/jdk-22 -XX:-UseCompressedOops -XX:+UseParallelGC

No tests ran.

[JENKINS] Solr-main-Windows (64bit/hotspot/jdk-21.0.1) - Build # 5183 - Still Failing!

Posted by Policeman Jenkins Server <je...@thetaphi.de>.
Build: https://jenkins.thetaphi.de/job/Solr-main-Windows/5183/
Java: 64bit/hotspot/jdk-21.0.1 -XX:-UseCompressedOops -XX:+UseSerialGC

All tests passed

[JENKINS] Solr-main-Windows (64bit/hotspot/jdk-21.0.1) - Build # 5182 - Still Failing!

Posted by Policeman Jenkins Server <je...@thetaphi.de>.
Build: https://jenkins.thetaphi.de/job/Solr-main-Windows/5182/
Java: 64bit/hotspot/jdk-21.0.1 -XX:-UseCompressedOops -XX:+UseParallelGC

All tests passed

[JENKINS-EA] Solr-main-Windows (64bit/hotspot/jdk-25-ea+11) - Build # 5181 - Still Failing!

Posted by Policeman Jenkins Server <je...@thetaphi.de>.
Build: https://jenkins.thetaphi.de/job/Solr-main-Windows/5181/
Java: 64bit/hotspot/jdk-25-ea+11 -XX:+UseCompressedOops -XX:+UseG1GC

No tests ran.

[JENKINS-EA] Solr-main-Windows (64bit/hotspot/jdk-25-ea+11) - Build # 5180 - Still Failing!

Posted by Policeman Jenkins Server <je...@thetaphi.de>.
Build: https://jenkins.thetaphi.de/job/Solr-main-Windows/5180/
Java: 64bit/hotspot/jdk-25-ea+11 -XX:-UseCompressedOops -XX:+UseParallelGC

No tests ran.

[JENKINS] Solr-main-Windows (64bit/hotspot/jdk-21.0.1) - Build # 5179 - Still Failing!

Posted by Policeman Jenkins Server <je...@thetaphi.de>.
Build: https://jenkins.thetaphi.de/job/Solr-main-Windows/5179/
Java: 64bit/hotspot/jdk-21.0.1 -XX:-UseCompressedOops -XX:+UseParallelGC

All tests passed

[JENKINS] Solr-main-Windows (64bit/hotspot/jdk-23) - Build # 5178 - Still Failing!

Posted by Policeman Jenkins Server <je...@thetaphi.de>.
Build: https://jenkins.thetaphi.de/job/Solr-main-Windows/5178/
Java: 64bit/hotspot/jdk-23 -XX:-UseCompressedOops -XX:+UseSerialGC

No tests ran.

[JENKINS] Solr-main-Windows (64bit/hotspot/jdk-21.0.1) - Build # 5177 - Still Failing!

Posted by Policeman Jenkins Server <je...@thetaphi.de>.
Build: https://jenkins.thetaphi.de/job/Solr-main-Windows/5177/
Java: 64bit/hotspot/jdk-21.0.1 -XX:-UseCompressedOops -XX:+UseParallelGC

2 tests failed.
FAILED:  org.apache.solr.ltr.TestLTRQParserPlugin.ltr_expensiveFeatureRescoringAndPartialResultsNotTolerated_shouldRaiseException

Error Message:
java.lang.AssertionError: Path not found: /error/msg

Stack Trace:
java.lang.AssertionError: Path not found: /error/msg
	at __randomizedtesting.SeedInfo.seed([98F6BBCB769AF802:2A66479E52CB5221]:0)
	at org.junit.Assert.fail(Assert.java:89)
	at org.apache.solr.util.RestTestBase.assertJsonMatches(RestTestBase.java:268)
	at org.apache.solr.util.RestTestBase.assertJQ(RestTestBase.java:210)
	at org.apache.solr.util.RestTestBase.assertJQ(RestTestBase.java:182)
	at org.apache.solr.ltr.TestLTRQParserPlugin.ltr_expensiveFeatureRescoringAndPartialResultsNotTolerated_shouldRaiseException(TestLTRQParserPlugin.java:195)
	at java.base/jdk.internal.reflect.DirectMethodHandleAccessor.invoke(DirectMethodHandleAccessor.java:103)
	at java.base/java.lang.reflect.Method.invoke(Method.java:580)
	at com.carrotsearch.randomizedtesting.RandomizedRunner.invoke(RandomizedRunner.java:1758)
	at com.carrotsearch.randomizedtesting.RandomizedRunner$8.evaluate(RandomizedRunner.java:946)
	at com.carrotsearch.randomizedtesting.RandomizedRunner$9.evaluate(RandomizedRunner.java:982)
	at com.carrotsearch.randomizedtesting.RandomizedRunner$10.evaluate(RandomizedRunner.java:996)
	at com.carrotsearch.randomizedtesting.rules.SystemPropertiesRestoreRule$1.evaluate(SystemPropertiesRestoreRule.java:80)
	at org.junit.rules.RunRules.evaluate(RunRules.java:20)
	at org.apache.lucene.tests.util.TestRuleSetupTeardownChained$1.evaluate(TestRuleSetupTeardownChained.java:48)
	at org.apache.lucene.tests.util.AbstractBeforeAfterRule$1.evaluate(AbstractBeforeAfterRule.java:43)
	at org.apache.lucene.tests.util.TestRuleThreadAndTestName$1.evaluate(TestRuleThreadAndTestName.java:45)
	at org.apache.lucene.tests.util.TestRuleIgnoreAfterMaxFailures$1.evaluate(TestRuleIgnoreAfterMaxFailures.java:60)
	at org.apache.lucene.tests.util.TestRuleMarkFailure$1.evaluate(TestRuleMarkFailure.java:44)
	at org.junit.rules.RunRules.evaluate(RunRules.java:20)
	at com.carrotsearch.randomizedtesting.rules.StatementAdapter.evaluate(StatementAdapter.java:36)
	at com.carrotsearch.randomizedtesting.ThreadLeakControl$StatementRunner.run(ThreadLeakControl.java:390)
	at com.carrotsearch.randomizedtesting.ThreadLeakControl.forkTimeoutingTask(ThreadLeakControl.java:843)
	at com.carrotsearch.randomizedtesting.ThreadLeakControl$3.evaluate(ThreadLeakControl.java:490)
	at com.carrotsearch.randomizedtesting.RandomizedRunner.runSingleTest(RandomizedRunner.java:955)
	at com.carrotsearch.randomizedtesting.RandomizedRunner$5.evaluate(RandomizedRunner.java:840)
	at com.carrotsearch.randomizedtesting.RandomizedRunner$6.evaluate(RandomizedRunner.java:891)
	at com.carrotsearch.randomizedtesting.RandomizedRunner$7.evaluate(RandomizedRunner.java:902)
	at org.junit.rules.ExternalResource$1.evaluate(ExternalResource.java:54)
	at com.carrotsearch.randomizedtesting.rules.StatementAdapter.evaluate(StatementAdapter.java:36)
	at com.carrotsearch.randomizedtesting.rules.StatementAdapter.evaluate(StatementAdapter.java:36)
	at org.apache.lucene.tests.util.AbstractBeforeAfterRule$1.evaluate(AbstractBeforeAfterRule.java:43)
	at com.carrotsearch.randomizedtesting.rules.SystemPropertiesRestoreRule$1.evaluate(SystemPropertiesRestoreRule.java:80)
	at org.junit.rules.RunRules.evaluate(RunRules.java:20)
	at org.apache.lucene.tests.util.AbstractBeforeAfterRule$1.evaluate(AbstractBeforeAfterRule.java:43)
	at com.carrotsearch.randomizedtesting.rules.StatementAdapter.evaluate(StatementAdapter.java:36)
	at org.apache.lucene.tests.util.TestRuleStoreClassName$1.evaluate(TestRuleStoreClassName.java:38)
	at com.carrotsearch.randomizedtesting.rules.NoShadowingOrOverridesOnMethodsRule$1.evaluate(NoShadowingOrOverridesOnMethodsRule.java:40)
	at com.carrotsearch.randomizedtesting.rules.NoShadowingOrOverridesOnMethodsRule$1.evaluate(NoShadowingOrOverridesOnMethodsRule.java:40)
	at com.carrotsearch.randomizedtesting.rules.StatementAdapter.evaluate(StatementAdapter.java:36)
	at com.carrotsearch.randomizedtesting.rules.StatementAdapter.evaluate(StatementAdapter.java:36)
	at org.apache.lucene.tests.util.TestRuleAssertionsRequired$1.evaluate(TestRuleAssertionsRequired.java:53)
	at org.apache.lucene.tests.util.AbstractBeforeAfterRule$1.evaluate(AbstractBeforeAfterRule.java:43)
	at org.apache.lucene.tests.util.TestRuleMarkFailure$1.evaluate(TestRuleMarkFailure.java:44)
	at org.apache.lucene.tests.util.TestRuleIgnoreAfterMaxFailures$1.evaluate(TestRuleIgnoreAfterMaxFailures.java:60)
	at org.apache.lucene.tests.util.TestRuleIgnoreTestSuites$1.evaluate(TestRuleIgnoreTestSuites.java:47)
	at org.junit.rules.RunRules.evaluate(RunRules.java:20)
	at com.carrotsearch.randomizedtesting.rules.StatementAdapter.evaluate(StatementAdapter.java:36)
	at com.carrotsearch.randomizedtesting.ThreadLeakControl$StatementRunner.run(ThreadLeakControl.java:390)
	at com.carrotsearch.randomizedtesting.ThreadLeakControl.lambda$forkTimeoutingTask$0(ThreadLeakControl.java:850)
	at java.base/java.lang.Thread.run(Thread.java:1583)


FAILED:  org.apache.solr.common.cloud.TestPerReplicaStates.classMethod

Error Message:
java.lang.AssertionError: ObjectTracker found 1 object(s) that were not released!!! [LBHttp2SolrClient]
org.apache.solr.client.solrj.impl.LBHttp2SolrClient:org.apache.solr.common.util.ObjectReleaseTracker$ObjectTrackerException: org.apache.solr.client.solrj.impl.LBHttp2SolrClient
	at org.apache.solr.common.util.ObjectReleaseTracker.track(ObjectReleaseTracker.java:54)
	at org.apache.solr.client.solrj.impl.LBSolrClient.<init>(LBSolrClient.java:413)
	at org.apache.solr.client.solrj.impl.LBHttp2SolrClient.<init>(LBHttp2SolrClient.java:103)
	at org.apache.solr.client.solrj.impl.LBHttp2SolrClient$Builder.build(LBHttp2SolrClient.java:328)
	at org.apache.solr.client.solrj.impl.CloudHttp2SolrClient.<init>(CloudHttp2SolrClient.java:76)
	at org.apache.solr.client.solrj.impl.CloudHttp2SolrClient$Builder.build(CloudHttp2SolrClient.java:478)
	at org.apache.solr.cloud.ZkController.getSolrCloudManager(ZkController.java:868)
	at org.apache.solr.cloud.Overseer.getSolrCloudManager(Overseer.java:950)
	at org.apache.solr.cloud.api.collections.OverseerCollectionMessageHandler.<init>(OverseerCollectionMessageHandler.java:107)
	at org.apache.solr.cloud.OverseerCollectionConfigSetProcessor.getOverseerMessageHandlerSelector(OverseerCollectionConfigSetProcessor.java:101)
	at org.apache.solr.cloud.OverseerCollectionConfigSetProcessor.<init>(OverseerCollectionConfigSetProcessor.java:77)
	at org.apache.solr.cloud.OverseerCollectionConfigSetProcessor.<init>(OverseerCollectionConfigSetProcessor.java:45)
	at org.apache.solr.cloud.Overseer.start(Overseer.java:771)
	at org.apache.solr.cloud.OverseerElectionContext.runLeaderProcess(OverseerElectionContext.java:76)
	at org.apache.solr.cloud.LeaderElector.runIamLeaderProcess(LeaderElector.java:169)
	at org.apache.solr.cloud.LeaderElector.checkIfIamLeader(LeaderElector.java:129)
	at org.apache.solr.cloud.LeaderElector$ElectionWatcher.process(LeaderElector.java:349)
	at org.apache.solr.common.cloud.SolrZkClient$ProcessWatchWithExecutor.lambda$process$0(SolrZkClient.java:1179)
	at org.apache.solr.common.util.ExecutorUtil$MDCAwareThreadPoolExecutor.lambda$execute$0(ExecutorUtil.java:380)
	at java.base/java.util.concurrent.ThreadPoolExecutor.runWorker(ThreadPoolExecutor.java:1144)
	at java.base/java.util.concurrent.ThreadPoolExecutor$Worker.run(ThreadPoolExecutor.java:642)
	at java.base/java.lang.Thread.run(Thread.java:1583)
Caused by: java.lang.Exception: Submitter stack trace
	at org.apache.solr.common.util.ExecutorUtil$MDCAwareThreadPoolExecutor.execute(ExecutorUtil.java:347)
	at org.apache.solr.common.cloud.SolrZkClient$ProcessWatchWithExecutor.process(SolrZkClient.java:1176)
	at org.apache.curator.framework.imps.NamespaceWatcher.process(NamespaceWatcher.java:69)
	at org.apache.zookeeper.ClientCnxn$EventThread.processEvent(ClientCnxn.java:564)
	at org.apache.zookeeper.ClientCnxn$EventThread.run(ClientCnxn.java:539)

 expected null, but was:<ObjectTracker found 1 object(s) that were not released!!! [LBHttp2SolrClient]
org.apache.solr.client.solrj.impl.LBHttp2SolrClient:org.apache.solr.common.util.ObjectReleaseTracker$ObjectTrackerException: org.apache.solr.client.solrj.impl.LBHttp2SolrClient
	at org.apache.solr.common.util.ObjectReleaseTracker.track(ObjectReleaseTracker.java:54)
	at org.apache.solr.client.solrj.impl.LBSolrClient.<init>(LBSolrClient.java:413)
	at org.apache.solr.client.solrj.impl.LBHttp2SolrClient.<init>(LBHttp2SolrClient.java:103)
	at org.apache.solr.client.solrj.impl.LBHttp2SolrClient$Builder.build(LBHttp2SolrClient.java:328)
	at org.apache.solr.client.solrj.impl.CloudHttp2SolrClient.<init>(CloudHttp2SolrClient.java:76)
	at org.apache.solr.client.solrj.impl.CloudHttp2SolrClient$Builder.build(CloudHttp2SolrClient.java:478)
	at org.apache.solr.cloud.ZkController.getSolrCloudManager(ZkController.java:868)
	at org.apache.solr.cloud.Overseer.getSolrCloudManager(Overseer.java:950)
	at org.apache.solr.cloud.api.collections.OverseerCollectionMessageHandler.<init>(OverseerCollectionMessageHandler.java:107)
	at org.apache.solr.cloud.OverseerCollectionConfigSetProcessor.getOverseerMessageHandlerSelector(OverseerCollectionConfigSetProcessor.java:101)
	at org.apache.solr.cloud.OverseerCollectionConfigSetProcessor.<init>(OverseerCollectionConfigSetProcessor.java:77)
	at org.apache.solr.cloud.OverseerCollectionConfigSetProcessor.<init>(OverseerCollectionConfigSetProcessor.java:45)
	at org.apache.solr.cloud.Overseer.start(Overseer.java:771)
	at org.apache.solr.cloud.OverseerElectionContext.runLeaderProcess(OverseerElectionContext.java:76)
	at org.apache.solr.cloud.LeaderElector.runIamLeaderProcess(LeaderElector.java:169)
	at org.apache.solr.cloud.LeaderElector.checkIfIamLeader(LeaderElector.java:129)
	at org.apache.solr.cloud.LeaderElector$ElectionWatcher.process(LeaderElector.java:349)
	at org.apache.solr.common.cloud.SolrZkClient$ProcessWatchWithExecutor.lambda$process$0(SolrZkClient.java:1179)
	at org.apache.solr.common.util.ExecutorUtil$MDCAwareThreadPoolExecutor.lambda$execute$0(ExecutorUtil.java:380)
	at java.base/java.util.concurrent.ThreadPoolExecutor.runWorker(ThreadPoolExecutor.java:1144)
	at java.base/java.util.concurrent.ThreadPoolExecutor$Worker.run(ThreadPoolExecutor.java:642)
	at java.base/java.lang.Thread.run(Thread.java:1583)
Caused by: java.lang.Exception: Submitter stack trace
	at org.apache.solr.common.util.ExecutorUtil$MDCAwareThreadPoolExecutor.execute(ExecutorUtil.java:347)
	at org.apache.solr.common.cloud.SolrZkClient$ProcessWatchWithExecutor.process(SolrZkClient.java:1176)
	at org.apache.curator.framework.imps.NamespaceWatcher.process(NamespaceWatcher.java:69)
	at org.apache.zookeeper.ClientCnxn$EventThread.processEvent(ClientCnxn.java:564)
	at org.apache.zookeeper.ClientCnxn$EventThread.run(ClientCnxn.java:539)

>

Stack Trace:
java.lang.AssertionError: ObjectTracker found 1 object(s) that were not released!!! [LBHttp2SolrClient]
org.apache.solr.client.solrj.impl.LBHttp2SolrClient:org.apache.solr.common.util.ObjectReleaseTracker$ObjectTrackerException: org.apache.solr.client.solrj.impl.LBHttp2SolrClient
	at org.apache.solr.common.util.ObjectReleaseTracker.track(ObjectReleaseTracker.java:54)
	at org.apache.solr.client.solrj.impl.LBSolrClient.<init>(LBSolrClient.java:413)
	at org.apache.solr.client.solrj.impl.LBHttp2SolrClient.<init>(LBHttp2SolrClient.java:103)
	at org.apache.solr.client.solrj.impl.LBHttp2SolrClient$Builder.build(LBHttp2SolrClient.java:328)
	at org.apache.solr.client.solrj.impl.CloudHttp2SolrClient.<init>(CloudHttp2SolrClient.java:76)
	at org.apache.solr.client.solrj.impl.CloudHttp2SolrClient$Builder.build(CloudHttp2SolrClient.java:478)
	at org.apache.solr.cloud.ZkController.getSolrCloudManager(ZkController.java:868)
	at org.apache.solr.cloud.Overseer.getSolrCloudManager(Overseer.java:950)
	at org.apache.solr.cloud.api.collections.OverseerCollectionMessageHandler.<init>(OverseerCollectionMessageHandler.java:107)
	at org.apache.solr.cloud.OverseerCollectionConfigSetProcessor.getOverseerMessageHandlerSelector(OverseerCollectionConfigSetProcessor.java:101)
	at org.apache.solr.cloud.OverseerCollectionConfigSetProcessor.<init>(OverseerCollectionConfigSetProcessor.java:77)
	at org.apache.solr.cloud.OverseerCollectionConfigSetProcessor.<init>(OverseerCollectionConfigSetProcessor.java:45)
	at org.apache.solr.cloud.Overseer.start(Overseer.java:771)
	at org.apache.solr.cloud.OverseerElectionContext.runLeaderProcess(OverseerElectionContext.java:76)
	at org.apache.solr.cloud.LeaderElector.runIamLeaderProcess(LeaderElector.java:169)
	at org.apache.solr.cloud.LeaderElector.checkIfIamLeader(LeaderElector.java:129)
	at org.apache.solr.cloud.LeaderElector$ElectionWatcher.process(LeaderElector.java:349)
	at org.apache.solr.common.cloud.SolrZkClient$ProcessWatchWithExecutor.lambda$process$0(SolrZkClient.java:1179)
	at org.apache.solr.common.util.ExecutorUtil$MDCAwareThreadPoolExecutor.lambda$execute$0(ExecutorUtil.java:380)
	at java.base/java.util.concurrent.ThreadPoolExecutor.runWorker(ThreadPoolExecutor.java:1144)
	at java.base/java.util.concurrent.ThreadPoolExecutor$Worker.run(ThreadPoolExecutor.java:642)
	at java.base/java.lang.Thread.run(Thread.java:1583)
Caused by: java.lang.Exception: Submitter stack trace
	at org.apache.solr.common.util.ExecutorUtil$MDCAwareThreadPoolExecutor.execute(ExecutorUtil.java:347)
	at org.apache.solr.common.cloud.SolrZkClient$ProcessWatchWithExecutor.process(SolrZkClient.java:1176)
	at org.apache.curator.framework.imps.NamespaceWatcher.process(NamespaceWatcher.java:69)
	at org.apache.zookeeper.ClientCnxn$EventThread.processEvent(ClientCnxn.java:564)
	at org.apache.zookeeper.ClientCnxn$EventThread.run(ClientCnxn.java:539)

 expected null, but was:<ObjectTracker found 1 object(s) that were not released!!! [LBHttp2SolrClient]
org.apache.solr.client.solrj.impl.LBHttp2SolrClient:org.apache.solr.common.util.ObjectReleaseTracker$ObjectTrackerException: org.apache.solr.client.solrj.impl.LBHttp2SolrClient
	at org.apache.solr.common.util.ObjectReleaseTracker.track(ObjectReleaseTracker.java:54)
	at org.apache.solr.client.solrj.impl.LBSolrClient.<init>(LBSolrClient.java:413)
	at org.apache.solr.client.solrj.impl.LBHttp2SolrClient.<init>(LBHttp2SolrClient.java:103)
	at org.apache.solr.client.solrj.impl.LBHttp2SolrClient$Builder.build(LBHttp2SolrClient.java:328)
	at org.apache.solr.client.solrj.impl.CloudHttp2SolrClient.<init>(CloudHttp2SolrClient.java:76)
	at org.apache.solr.client.solrj.impl.CloudHttp2SolrClient$Builder.build(CloudHttp2SolrClient.java:478)
	at org.apache.solr.cloud.ZkController.getSolrCloudManager(ZkController.java:868)
	at org.apache.solr.cloud.Overseer.getSolrCloudManager(Overseer.java:950)
	at org.apache.solr.cloud.api.collections.OverseerCollectionMessageHandler.<init>(OverseerCollectionMessageHandler.java:107)
	at org.apache.solr.cloud.OverseerCollectionConfigSetProcessor.getOverseerMessageHandlerSelector(OverseerCollectionConfigSetProcessor.java:101)
	at org.apache.solr.cloud.OverseerCollectionConfigSetProcessor.<init>(OverseerCollectionConfigSetProcessor.java:77)
	at org.apache.solr.cloud.OverseerCollectionConfigSetProcessor.<init>(OverseerCollectionConfigSetProcessor.java:45)
	at org.apache.solr.cloud.Overseer.start(Overseer.java:771)
	at org.apache.solr.cloud.OverseerElectionContext.runLeaderProcess(OverseerElectionContext.java:76)
	at org.apache.solr.cloud.LeaderElector.runIamLeaderProcess(LeaderElector.java:169)
	at org.apache.solr.cloud.LeaderElector.checkIfIamLeader(LeaderElector.java:129)
	at org.apache.solr.cloud.LeaderElector$ElectionWatcher.process(LeaderElector.java:349)
	at org.apache.solr.common.cloud.SolrZkClient$ProcessWatchWithExecutor.lambda$process$0(SolrZkClient.java:1179)
	at org.apache.solr.common.util.ExecutorUtil$MDCAwareThreadPoolExecutor.lambda$execute$0(ExecutorUtil.java:380)
	at java.base/java.util.concurrent.ThreadPoolExecutor.runWorker(ThreadPoolExecutor.java:1144)
	at java.base/java.util.concurrent.ThreadPoolExecutor$Worker.run(ThreadPoolExecutor.java:642)
	at java.base/java.lang.Thread.run(Thread.java:1583)
Caused by: java.lang.Exception: Submitter stack trace
	at org.apache.solr.common.util.ExecutorUtil$MDCAwareThreadPoolExecutor.execute(ExecutorUtil.java:347)
	at org.apache.solr.common.cloud.SolrZkClient$ProcessWatchWithExecutor.process(SolrZkClient.java:1176)
	at org.apache.curator.framework.imps.NamespaceWatcher.process(NamespaceWatcher.java:69)
	at org.apache.zookeeper.ClientCnxn$EventThread.processEvent(ClientCnxn.java:564)
	at org.apache.zookeeper.ClientCnxn$EventThread.run(ClientCnxn.java:539)

>
	at __randomizedtesting.SeedInfo.seed([98F6BBCB769AF802]:0)
	at org.junit.Assert.fail(Assert.java:89)
	at org.junit.Assert.failNotNull(Assert.java:756)
	at org.junit.Assert.assertNull(Assert.java:738)
	at org.apache.solr.SolrTestCase$1.afterIfSuccessful(SolrTestCase.java:103)
	at com.carrotsearch.randomizedtesting.rules.TestRuleAdapter$1.afterIfSuccessful(TestRuleAdapter.java:36)
	at com.carrotsearch.randomizedtesting.rules.StatementAdapter.evaluate(StatementAdapter.java:37)
	at com.carrotsearch.randomizedtesting.rules.StatementAdapter.evaluate(StatementAdapter.java:36)
	at org.apache.lucene.tests.util.AbstractBeforeAfterRule$1.evaluate(AbstractBeforeAfterRule.java:43)
	at com.carrotsearch.randomizedtesting.rules.SystemPropertiesRestoreRule$1.evaluate(SystemPropertiesRestoreRule.java:80)
	at org.junit.rules.RunRules.evaluate(RunRules.java:20)
	at org.apache.lucene.tests.util.AbstractBeforeAfterRule$1.evaluate(AbstractBeforeAfterRule.java:43)
	at com.carrotsearch.randomizedtesting.rules.StatementAdapter.evaluate(StatementAdapter.java:36)
	at org.apache.lucene.tests.util.TestRuleStoreClassName$1.evaluate(TestRuleStoreClassName.java:38)
	at com.carrotsearch.randomizedtesting.rules.NoShadowingOrOverridesOnMethodsRule$1.evaluate(NoShadowingOrOverridesOnMethodsRule.java:40)
	at com.carrotsearch.randomizedtesting.rules.NoShadowingOrOverridesOnMethodsRule$1.evaluate(NoShadowingOrOverridesOnMethodsRule.java:40)
	at com.carrotsearch.randomizedtesting.rules.StatementAdapter.evaluate(StatementAdapter.java:36)
	at com.carrotsearch.randomizedtesting.rules.StatementAdapter.evaluate(StatementAdapter.java:36)
	at org.apache.lucene.tests.util.TestRuleAssertionsRequired$1.evaluate(TestRuleAssertionsRequired.java:53)
	at org.apache.lucene.tests.util.AbstractBeforeAfterRule$1.evaluate(AbstractBeforeAfterRule.java:43)
	at org.apache.lucene.tests.util.TestRuleMarkFailure$1.evaluate(TestRuleMarkFailure.java:44)
	at org.apache.lucene.tests.util.TestRuleIgnoreAfterMaxFailures$1.evaluate(TestRuleIgnoreAfterMaxFailures.java:60)
	at org.apache.lucene.tests.util.TestRuleIgnoreTestSuites$1.evaluate(TestRuleIgnoreTestSuites.java:47)
	at org.junit.rules.RunRules.evaluate(RunRules.java:20)
	at com.carrotsearch.randomizedtesting.rules.StatementAdapter.evaluate(StatementAdapter.java:36)
	at com.carrotsearch.randomizedtesting.ThreadLeakControl$StatementRunner.run(ThreadLeakControl.java:390)
	at com.carrotsearch.randomizedtesting.ThreadLeakControl.lambda$forkTimeoutingTask$0(ThreadLeakControl.java:850)
	at java.base/java.lang.Thread.run(Thread.java:1583)

[JENKINS-EA] Solr-main-Windows (64bit/hotspot/jdk-25-ea+11) - Build # 5176 - Still Failing!

Posted by Policeman Jenkins Server <je...@thetaphi.de>.
Build: https://jenkins.thetaphi.de/job/Solr-main-Windows/5176/
Java: 64bit/hotspot/jdk-25-ea+11 -XX:-UseCompressedOops -XX:+UseSerialGC

No tests ran.

[JENKINS-EA] Solr-main-Windows (64bit/hotspot/jdk-25-ea+11) - Build # 5175 - Still Failing!

Posted by Policeman Jenkins Server <je...@thetaphi.de>.
Build: https://jenkins.thetaphi.de/job/Solr-main-Windows/5175/
Java: 64bit/hotspot/jdk-25-ea+11 -XX:+UseCompressedOops -XX:+UseSerialGC

No tests ran.

[JENKINS] Solr-main-Windows (64bit/hotspot/jdk-21.0.1) - Build # 5174 - Still Failing!

Posted by Policeman Jenkins Server <je...@thetaphi.de>.
Build: https://jenkins.thetaphi.de/job/Solr-main-Windows/5174/
Java: 64bit/hotspot/jdk-21.0.1 -XX:-UseCompressedOops -XX:+UseSerialGC

All tests passed

[JENKINS] Solr-main-Windows (64bit/hotspot/jdk-23) - Build # 5173 - Still Failing!

Posted by Policeman Jenkins Server <je...@thetaphi.de>.
Build: https://jenkins.thetaphi.de/job/Solr-main-Windows/5173/
Java: 64bit/hotspot/jdk-23 -XX:+UseCompressedOops -XX:+UseParallelGC

No tests ran.

[JENKINS] Solr-main-Windows (64bit/hotspot/jdk-23) - Build # 5172 - Still Failing!

Posted by Policeman Jenkins Server <je...@thetaphi.de>.
Build: https://jenkins.thetaphi.de/job/Solr-main-Windows/5172/
Java: 64bit/hotspot/jdk-23 -XX:+UseCompressedOops -XX:+UseG1GC

No tests ran.

[JENKINS] Solr-main-Windows (64bit/hotspot/jdk-24-rc) - Build # 5171 - Still Failing!

Posted by Policeman Jenkins Server <je...@thetaphi.de>.
Build: https://jenkins.thetaphi.de/job/Solr-main-Windows/5171/
Java: 64bit/hotspot/jdk-24-rc -XX:-UseCompressedOops -XX:+UseSerialGC

No tests ran.

[JENKINS] Solr-main-Windows (64bit/hotspot/jdk-23) - Build # 5170 - Still Failing!

Posted by Policeman Jenkins Server <je...@thetaphi.de>.
Build: https://jenkins.thetaphi.de/job/Solr-main-Windows/5170/
Java: 64bit/hotspot/jdk-23 -XX:-UseCompressedOops -XX:+UseParallelGC

No tests ran.

[JENKINS] Solr-main-Windows (64bit/hotspot/jdk-23) - Build # 5169 - Still Failing!

Posted by Policeman Jenkins Server <je...@thetaphi.de>.
Build: https://jenkins.thetaphi.de/job/Solr-main-Windows/5169/
Java: 64bit/hotspot/jdk-23 -XX:+UseCompressedOops -XX:+UseG1GC

No tests ran.

[JENKINS-EA] Solr-main-Windows (64bit/hotspot/jdk-24-ea+16) - Build # 5168 - Still Failing!

Posted by Policeman Jenkins Server <je...@thetaphi.de>.
Build: https://jenkins.thetaphi.de/job/Solr-main-Windows/5168/
Java: 64bit/hotspot/jdk-24-ea+16 -XX:-UseCompressedOops -XX:+UseParallelGC

No tests ran.