You are viewing a plain text version of this content. The canonical link for it is here.
Posted to builds@cassandra.apache.org by Apache Jenkins Server <je...@builds.apache.org> on 2022/05/13 17:58:43 UTC

Build complete: Cassandra-trunk #1145 [UNSTABLE] b9101d21bd349be506522e055bc34efe1fba5a16

-------------------------------------------------------------------------------
Build Cassandra-trunk #1145 Still unstable
URL: https://ci-cassandra.apache.org/job/Cassandra-trunk/1145/
-------------------------------------------------------------------------------
Changes:
[Brandon Williams] Fsync TOC and Digest files after they're written


-------------------------------------------------------------------------------
Failed Tests:
27 tests failed.
FAILED:  dtest-novnode.sslnodetonode_test.TestNodeToNodeSSLEncryption.test_optional_outbound_tls
FAILED:  dtest-offheap.bootstrap_test.TestBootstrap.test_simultaneous_bootstrap
FAILED:  dtest-upgrade.upgrade_tests.cql_tests.TestCQLNodes3RF3_Upgrade_current_3_0_x_To_indev_trunk.test_add_deletion_info_in_unsorted_column
FAILED:  dtest-upgrade.upgrade_tests.cql_tests.TestCQLNodes3RF3_Upgrade_indev_3_11_x_To_indev_trunk.test_conditional_delete
FAILED:  dtest-upgrade.upgrade_tests.cql_tests.TestCQLNodes2RF1_Upgrade_current_3_0_x_To_indev_trunk.test_deletion
FAILED:  dtest-upgrade.upgrade_tests.cql_tests.TestCQLNodes2RF1_Upgrade_current_3_0_x_To_indev_trunk.test_deletion
FAILED:  dtest-upgrade.upgrade_tests.cql_tests.TestCQLNodes2RF1_Upgrade_current_3_0_x_To_indev_trunk.test_limit_compact_table
FAILED:  org.apache.cassandra.distributed.test.FullRepairCoordinatorNeighbourDownTest.validationParticipentCrashesAndComesBack[DATACENTER_AWARE/true]
FAILED:  org.apache.cassandra.distributed.test.MessageFiltersTest.hintSerializationTest
FAILED:  org.apache.cassandra.utils.memory.LongBufferPoolTest.testPoolAllocateWithRecyclePartially
FAILED:  org.apache.cassandra.tools.TopPartitionsTest.testServiceTopPartitionsSingleTable-cdc
FAILED:  org.apache.cassandra.db.commitlog.CommitLogSegmentManagerCDCTest.testCompletedFlag
FAILED:  org.apache.cassandra.db.commitlog.CommitLogSegmentManagerCDCTest.testSwitchingCDCWriteModes
FAILED:  org.apache.cassandra.db.virtual.GossipInfoTableTest.testSelectAllWithStateTransitions-cdc
FAILED:  org.apache.cassandra.net.ConnectionTest.testMessageDeliveryOnReconnect-cdc
FAILED:  org.apache.cassandra.cql3.validation.operations.AggregationTest.testWrongStateType
FAILED:  org.apache.cassandra.cql3.validation.operations.CompactStorageTest.testCounterAndColumnSelection
FAILED:  org.apache.cassandra.net.ConnectionTest.testMessageDeliveryOnReconnect-compression
FAILED:  org.apache.cassandra.cql3.KeywordTest.test[keyword TRIGGER isReserved false]
FAILED:  org.apache.cassandra.cql3.KeywordTest.test[keyword USER isReserved false]
FAILED:  org.apache.cassandra.net.ProxyHandlerConnectionsTest.testExpireSome-compression
FAILED:  org.apache.cassandra.db.SinglePartitionSliceCommandTest.testPartitionDeletionRangeDeletionTie
FAILED:  org.apache.cassandra.db.SinglePartitionSliceCommandTest.testPartitionDeletionRangeDeletionTie
FAILED:  org.apache.cassandra.cql3.ViewComplexTTLTest.testUpdateColumnInViewPKWithTTLWithFlush[3]
FAILED:  org.apache.cassandra.cql3.validation.entities.SecondaryIndexTest.testIndexOnPartitionKeyInsertExpiringColumn
FAILED:  org.apache.cassandra.distributed.upgrade.CompactStorageUpgradeTest.compactStorageUpgradeTest
FAILED:  org.apache.cassandra.distributed.upgrade.CompactStorageUpgradeTest.compactStorageUpgradeTest

-------------------------------------------------------------------------------
For complete test report and logs see https://nightlies.apache.org/cassandra/Cassandra-trunk/1145/