You are viewing a plain text version of this content. The canonical link for it is here.
Posted to dev@river.apache.org by Apache Jenkins Server <je...@builds.apache.org> on 2013/06/07 04:13:34 UTC
Build failed in Jenkins: river-qa-refactor-arm #59
See <https://builds.apache.org/job/river-qa-refactor-arm/59/changes>
Changes:
[peter_firmstone] Minor fixes for synchronization and other minor tidy ups.
------------------------------------------
[...truncated 8460 lines...]
[java] Test Passed: OK
[java]
[java] -----------------------------------------
[java] com/sun/jini/test/spec/javaspace/conformance/snapshot/SnapshotTransactionTakeIfExistsTest.td
[java] Test Passed: OK
[java]
[java] -----------------------------------------
[java] com/sun/jini/test/spec/javaspace/conformance/snapshot/SnapshotTransactionTakeIfExistsWaitTest.td
[java] Test Passed: OK
[java]
[java] -----------------------------------------
[java] com/sun/jini/test/spec/javaspace/conformance/snapshot/SnapshotTransactionTakeNO_WAITTest.td
[java] Test Passed: OK
[java]
[java] -----------------------------------------
[java] com/sun/jini/test/spec/javaspace/conformance/snapshot/SnapshotTransactionTakeReadTest.td
[java] Test Passed: OK
[java]
[java] -----------------------------------------
[java] com/sun/jini/test/spec/javaspace/conformance/snapshot/SnapshotTransactionTakeTest.td
[java] Test Passed: OK
[java]
[java] -----------------------------------------
[java] com/sun/jini/test/spec/javaspace/conformance/snapshot/SnapshotTransactionTakeWaitTest.td
[java] Test Passed: OK
[java]
[java] -----------------------------------------
[java] com/sun/jini/test/spec/javaspace/conformance/snapshot/SnapshotTransactionWriteLeaseANYTest.td
[java] Test Passed: OK
[java]
[java] -----------------------------------------
[java] com/sun/jini/test/spec/javaspace/conformance/snapshot/SnapshotTransactionWriteLeaseFOREVERTest.td
[java] Test Passed: OK
[java]
[java] -----------------------------------------
[java] com/sun/jini/test/spec/javaspace/conformance/snapshot/SnapshotTransactionWriteNegativeLeaseTest.td
[java] Test Passed: OK
[java]
[java] -----------------------------------------
[java] com/sun/jini/test/spec/javaspace/conformance/snapshot/SnapshotTransactionWriteTakeIfExistsNotifyTest.td
[java] Test Passed: OK
[java]
[java] -----------------------------------------
[java] com/sun/jini/test/spec/javaspace/conformance/snapshot/SnapshotTransactionWriteTakeIfExistsTest.td
[java] Test Passed: OK
[java]
[java] -----------------------------------------
[java] com/sun/jini/test/spec/javaspace/conformance/snapshot/SnapshotTransactionWriteTakeNotifyTest.td
[java] Test Passed: OK
[java]
[java] -----------------------------------------
[java] com/sun/jini/test/spec/javaspace/conformance/snapshot/SnapshotTransactionWriteTakeTest.td
[java] Test Passed: OK
[java]
[java] -----------------------------------------
[java] com/sun/jini/test/spec/javaspace/conformance/snapshot/SnapshotTransactionWriteTest.td
[java] Test Passed: OK
[java]
[java] -----------------------------------------
[java] com/sun/jini/test/spec/javaspace/conformance/snapshot/SnapshotWriteLeaseANYTest.td
[java] Test Passed: OK
[java]
[java] -----------------------------------------
[java] com/sun/jini/test/spec/javaspace/conformance/snapshot/SnapshotWriteLeaseFOREVERTest.td
[java] Test Passed: OK
[java]
[java] -----------------------------------------
[java] com/sun/jini/test/spec/javaspace/conformance/snapshot/SnapshotWriteNegativeLeaseTest.td
[java] Test Passed: OK
[java]
[java] -----------------------------------------
[java] com/sun/jini/test/spec/javaspace/conformance/snapshot/SnapshotWriteTest.td
[java] Test Passed: OK
[java]
[java] -----------------------------------------
[java] com/sun/jini/test/impl/mahalo/AdminIFShutdownTest.td
[java] Test Passed: OK
[java]
[java] -----------------------------------------
[java] com/sun/jini/test/impl/mahalo/AdminIFTest.td
[java] Test Passed: OK
[java]
[java] -----------------------------------------
[java] com/sun/jini/test/impl/mahalo/LeaseExpireCancelTest.td
[java] Test Passed: OK
[java]
[java] -----------------------------------------
[java] com/sun/jini/test/impl/mahalo/LeaseExpireRenewTest.td
[java] Test Passed: OK
[java]
[java] -----------------------------------------
[java] com/sun/jini/test/impl/mahalo/LeaseMapTest.td
[java] Test Passed: OK
[java]
[java] -----------------------------------------
[java] com/sun/jini/test/impl/mahalo/LeaseTest.td
[java] Test Passed: OK
[java]
[java] -----------------------------------------
[java] com/sun/jini/test/impl/mahalo/MahaloCreateShutdownTest.td
[java] Test Passed: OK
[java]
[java] -----------------------------------------
[java] com/sun/jini/test/impl/mahalo/MahaloIFTest.td
[java] Test Passed: OK
[java]
[java] -----------------------------------------
[java] com/sun/jini/test/impl/mahalo/MahaloImplReadyStateTest.td
[java] Test Skipped: verifiers are: com.sun.jini.test.impl.mercury.ActivatableMercuryVerifier com.sun.jini.qa.harness.SkipConfigTestVerifier
[java] -----------------------------------------
[java] com/sun/jini/test/impl/mahalo/NestableServerTransactionCreatedToStringTest.td
[java] Test Passed: OK
[java]
[java] -----------------------------------------
[java] com/sun/jini/test/impl/mahalo/NestableTransactionCreatedToStringTest.td
[java] Test Passed: OK
[java]
[java] -----------------------------------------
[java] com/sun/jini/test/impl/mahalo/PrepareAndCommitExceptionTest.td
[java] Test Passed: OK
[java]
[java] -----------------------------------------
[java] com/sun/jini/test/impl/mahalo/PrepareAndCommitExceptionTest2.td
[java] Test Passed: OK
[java]
[java] -----------------------------------------
[java] com/sun/jini/test/impl/mahalo/PrepareAndCommitExceptionTest3.td
[java] Test Passed: OK
[java]
[java] -----------------------------------------
[java] com/sun/jini/test/impl/mahalo/PrepareAndCommitExceptionTest4.td
[java] Test Passed: OK
[java]
[java] -----------------------------------------
[java] com/sun/jini/test/impl/mahalo/PrepareAndCommitExceptionTest5.td
[java] Test Passed: OK
[java]
[java] -----------------------------------------
[java] com/sun/jini/test/impl/mahalo/RandomStressTest.td
[java] Test Passed: OK
[java]
[java] -----------------------------------------
[java] com/sun/jini/test/impl/mahalo/ServerTransactionEqualityTest.td
[java] Test Passed: OK
[java]
[java] -----------------------------------------
[java] com/sun/jini/test/impl/mahalo/ServerTransactionToStringTest.td
[java] Test Passed: OK
[java]
[java] -----------------------------------------
[java] com/sun/jini/test/impl/mahalo/TransactionCreatedToStringTest.td
[java] Test Passed: OK
[java]
[java] -----------------------------------------
[java] com/sun/jini/test/impl/mahalo/TransactionManagerCreatedToStringTest.td
[java] Test Passed: OK
[java]
[java] -----------------------------------------
[java] com/sun/jini/test/impl/mahalo/TxnMgrImplNullActivationConfigEntries.td
[java] Test Skipped: verifiers are: com.sun.jini.test.impl.mahalo.ActivatableMahaloVerifier
[java] -----------------------------------------
[java] com/sun/jini/test/impl/mahalo/TxnMgrImplNullConfigEntries.td
[java] Test Passed: OK
[java]
[java] -----------------------------------------
[java] com/sun/jini/test/impl/mahalo/TxnMgrImplNullRecoveredLocators.td
[java] Test Skipped: verifiers are: com.sun.jini.test.impl.mahalo.ActivatableMahaloVerifier
[java] -----------------------------------------
[java] com/sun/jini/test/impl/mahalo/TxnMgrProxyEqualityTest.td
[java] Test Passed: OK
[java]
[java] -----------------------------------------
[java] com/sun/jini/test/spec/txnmanager/AsynchAbortOnCommitTest.td
[java] Test Passed: OK
[java]
[java] -----------------------------------------
[java] com/sun/jini/test/spec/txnmanager/AsynchAbortOnPrepareTest.td
[java] Test Passed: OK
[java]
[java] -----------------------------------------
[java] com/sun/jini/test/spec/txnmanager/CommitExpiredTest.td
[java] Test Passed: OK
[java]
[java] -----------------------------------------
[java] com/sun/jini/test/spec/txnmanager/CommitTimeoutTest.td
[java] Test Passed: OK
[java]
[java] -----------------------------------------
[java] com/sun/jini/test/spec/txnmanager/GetStateTest.td
[java] Test Passed: OK
[java]
[java] -----------------------------------------
[java] com/sun/jini/test/spec/txnmanager/JoinIdempotentTest.td
[java] Test Passed: OK
[java]
[java] -----------------------------------------
[java] com/sun/jini/test/spec/txnmanager/JoinWhileActiveTest.td
[java] Test Passed: OK
[java]
[java] -----------------------------------------
[java] com/sun/jini/test/spec/txnmanager/ManyParticipantsTest.td
[java] Test Passed: OK
[java]
[java] -----------------------------------------
[java] com/sun/jini/test/spec/txnmanager/PrepareTimeoutTest.td
[java] Test Passed: OK
[java]
[java] -----------------------------------------
[java] com/sun/jini/test/spec/txnmanager/RollBackErrorTest.td
[java] Test Passed: OK
[java]
[java] -----------------------------------------
[java] com/sun/jini/test/spec/txnmanager/RollForwardErrorTest.td
[java] Test Passed: OK
[java]
[java] -----------------------------------------
[java] com/sun/jini/test/spec/txnmanager/TwoPhaseTest.td
[java] Test Passed: OK
[java]
[java] -----------------------------------------
[java]
[java] # of tests started = 1342
[java] # of tests completed = 1342
[java] # of tests skipped = 43
[java] # of tests passed = 1340
[java] # of tests failed = 2
[java]
[java] -----------------------------------------
[java]
[java] Date finished:
[java] Thu Jun 06 21:08:07 CDT 2013
[java] Time elapsed:
[java] 62980 seconds
[java]
[java] Java Result: 1
collect-result:
[copy] Copying 1 file to <https://builds.apache.org/job/river-qa-refactor-arm/ws/qa/result>
[copy] Copying 1 file to <https://builds.apache.org/job/river-qa-refactor-arm/ws/qa/result>
[zip] Building zip: <https://builds.apache.org/job/river-qa-refactor-arm/59/artifact/qa/result/qaresults-arm-Linux-1.7.0_06.zip>
BUILD FAILED
<https://builds.apache.org/job/river-qa-refactor-arm/ws/build.xml>:55: The following error occurred while executing this line:
<https://builds.apache.org/job/river-qa-refactor-arm/ws/qa/build.xml>:412: The following error occurred while executing this line:
<https://builds.apache.org/job/river-qa-refactor-arm/ws/qa/build.xml>:380: condition satisfied
Total time: 1063 minutes 47 seconds
Build step 'Invoke Ant' marked build as failure
Archiving artifacts
Jenkins build is back to normal : river-qa-refactor-arm #63
Posted by Apache Jenkins Server <je...@builds.apache.org>.
See <https://builds.apache.org/job/river-qa-refactor-arm/63/changes>
Build failed in Jenkins: river-qa-refactor-arm #62
Posted by Apache Jenkins Server <je...@builds.apache.org>.
See <https://builds.apache.org/job/river-qa-refactor-arm/62/changes>
Changes:
[peter_firmstone] Synchronization fixes relating to LeaseMap implementations. The LeaseMap interface was originally specified as an unsynchronized Map, however relaxing this requirement allows for some implementations to be synchronized or concurrent.
Updated ClassServer to use Starter interface.
Changed ReadyState to be non blocking when ready.
Fixed unsynchronized access to proxy references in FiddlerImpl.
------------------------------------------
[...truncated 8472 lines...]
[java] Test Passed: OK
[java]
[java] -----------------------------------------
[java] com/sun/jini/test/spec/javaspace/conformance/snapshot/SnapshotTransactionTakeIfExistsTest.td
[java] Test Passed: OK
[java]
[java] -----------------------------------------
[java] com/sun/jini/test/spec/javaspace/conformance/snapshot/SnapshotTransactionTakeIfExistsWaitTest.td
[java] Test Passed: OK
[java]
[java] -----------------------------------------
[java] com/sun/jini/test/spec/javaspace/conformance/snapshot/SnapshotTransactionTakeNO_WAITTest.td
[java] Test Passed: OK
[java]
[java] -----------------------------------------
[java] com/sun/jini/test/spec/javaspace/conformance/snapshot/SnapshotTransactionTakeReadTest.td
[java] Test Passed: OK
[java]
[java] -----------------------------------------
[java] com/sun/jini/test/spec/javaspace/conformance/snapshot/SnapshotTransactionTakeTest.td
[java] Test Passed: OK
[java]
[java] -----------------------------------------
[java] com/sun/jini/test/spec/javaspace/conformance/snapshot/SnapshotTransactionTakeWaitTest.td
[java] Test Passed: OK
[java]
[java] -----------------------------------------
[java] com/sun/jini/test/spec/javaspace/conformance/snapshot/SnapshotTransactionWriteLeaseANYTest.td
[java] Test Passed: OK
[java]
[java] -----------------------------------------
[java] com/sun/jini/test/spec/javaspace/conformance/snapshot/SnapshotTransactionWriteLeaseFOREVERTest.td
[java] Test Passed: OK
[java]
[java] -----------------------------------------
[java] com/sun/jini/test/spec/javaspace/conformance/snapshot/SnapshotTransactionWriteNegativeLeaseTest.td
[java] Test Passed: OK
[java]
[java] -----------------------------------------
[java] com/sun/jini/test/spec/javaspace/conformance/snapshot/SnapshotTransactionWriteTakeIfExistsNotifyTest.td
[java] Test Passed: OK
[java]
[java] -----------------------------------------
[java] com/sun/jini/test/spec/javaspace/conformance/snapshot/SnapshotTransactionWriteTakeIfExistsTest.td
[java] Test Passed: OK
[java]
[java] -----------------------------------------
[java] com/sun/jini/test/spec/javaspace/conformance/snapshot/SnapshotTransactionWriteTakeNotifyTest.td
[java] Test Passed: OK
[java]
[java] -----------------------------------------
[java] com/sun/jini/test/spec/javaspace/conformance/snapshot/SnapshotTransactionWriteTakeTest.td
[java] Test Passed: OK
[java]
[java] -----------------------------------------
[java] com/sun/jini/test/spec/javaspace/conformance/snapshot/SnapshotTransactionWriteTest.td
[java] Test Passed: OK
[java]
[java] -----------------------------------------
[java] com/sun/jini/test/spec/javaspace/conformance/snapshot/SnapshotWriteLeaseANYTest.td
[java] Test Passed: OK
[java]
[java] -----------------------------------------
[java] com/sun/jini/test/spec/javaspace/conformance/snapshot/SnapshotWriteLeaseFOREVERTest.td
[java] Test Passed: OK
[java]
[java] -----------------------------------------
[java] com/sun/jini/test/spec/javaspace/conformance/snapshot/SnapshotWriteNegativeLeaseTest.td
[java] Test Passed: OK
[java]
[java] -----------------------------------------
[java] com/sun/jini/test/spec/javaspace/conformance/snapshot/SnapshotWriteTest.td
[java] Test Passed: OK
[java]
[java] -----------------------------------------
[java] com/sun/jini/test/impl/mahalo/AdminIFShutdownTest.td
[java] Test Passed: OK
[java]
[java] -----------------------------------------
[java] com/sun/jini/test/impl/mahalo/AdminIFTest.td
[java] Test Passed: OK
[java]
[java] -----------------------------------------
[java] com/sun/jini/test/impl/mahalo/LeaseExpireCancelTest.td
[java] Test Passed: OK
[java]
[java] -----------------------------------------
[java] com/sun/jini/test/impl/mahalo/LeaseExpireRenewTest.td
[java] Test Passed: OK
[java]
[java] -----------------------------------------
[java] com/sun/jini/test/impl/mahalo/LeaseMapTest.td
[java] Test Passed: OK
[java]
[java] -----------------------------------------
[java] com/sun/jini/test/impl/mahalo/LeaseTest.td
[java] Test Passed: OK
[java]
[java] -----------------------------------------
[java] com/sun/jini/test/impl/mahalo/MahaloCreateShutdownTest.td
[java] Test Passed: OK
[java]
[java] -----------------------------------------
[java] com/sun/jini/test/impl/mahalo/MahaloIFTest.td
[java] Test Passed: OK
[java]
[java] -----------------------------------------
[java] com/sun/jini/test/impl/mahalo/MahaloImplReadyStateTest.td
[java] Test Skipped: verifiers are: com.sun.jini.test.impl.mercury.ActivatableMercuryVerifier com.sun.jini.qa.harness.SkipConfigTestVerifier
[java] -----------------------------------------
[java] com/sun/jini/test/impl/mahalo/NestableServerTransactionCreatedToStringTest.td
[java] Test Passed: OK
[java]
[java] -----------------------------------------
[java] com/sun/jini/test/impl/mahalo/NestableTransactionCreatedToStringTest.td
[java] Test Passed: OK
[java]
[java] -----------------------------------------
[java] com/sun/jini/test/impl/mahalo/PrepareAndCommitExceptionTest.td
[java] Test Passed: OK
[java]
[java] -----------------------------------------
[java] com/sun/jini/test/impl/mahalo/PrepareAndCommitExceptionTest2.td
[java] Test Passed: OK
[java]
[java] -----------------------------------------
[java] com/sun/jini/test/impl/mahalo/PrepareAndCommitExceptionTest3.td
[java] Test Passed: OK
[java]
[java] -----------------------------------------
[java] com/sun/jini/test/impl/mahalo/PrepareAndCommitExceptionTest4.td
[java] Test Passed: OK
[java]
[java] -----------------------------------------
[java] com/sun/jini/test/impl/mahalo/PrepareAndCommitExceptionTest5.td
[java] Test Passed: OK
[java]
[java] -----------------------------------------
[java] com/sun/jini/test/impl/mahalo/RandomStressTest.td
[java] Test Passed: OK
[java]
[java] -----------------------------------------
[java] com/sun/jini/test/impl/mahalo/ServerTransactionEqualityTest.td
[java] Test Passed: OK
[java]
[java] -----------------------------------------
[java] com/sun/jini/test/impl/mahalo/ServerTransactionToStringTest.td
[java] Test Passed: OK
[java]
[java] -----------------------------------------
[java] com/sun/jini/test/impl/mahalo/TransactionCreatedToStringTest.td
[java] Test Passed: OK
[java]
[java] -----------------------------------------
[java] com/sun/jini/test/impl/mahalo/TransactionManagerCreatedToStringTest.td
[java] Test Passed: OK
[java]
[java] -----------------------------------------
[java] com/sun/jini/test/impl/mahalo/TxnMgrImplNullActivationConfigEntries.td
[java] Test Skipped: verifiers are: com.sun.jini.test.impl.mahalo.ActivatableMahaloVerifier
[java] -----------------------------------------
[java] com/sun/jini/test/impl/mahalo/TxnMgrImplNullConfigEntries.td
[java] Test Passed: OK
[java]
[java] -----------------------------------------
[java] com/sun/jini/test/impl/mahalo/TxnMgrImplNullRecoveredLocators.td
[java] Test Skipped: verifiers are: com.sun.jini.test.impl.mahalo.ActivatableMahaloVerifier
[java] -----------------------------------------
[java] com/sun/jini/test/impl/mahalo/TxnMgrProxyEqualityTest.td
[java] Test Passed: OK
[java]
[java] -----------------------------------------
[java] com/sun/jini/test/spec/txnmanager/AsynchAbortOnCommitTest.td
[java] Test Passed: OK
[java]
[java] -----------------------------------------
[java] com/sun/jini/test/spec/txnmanager/AsynchAbortOnPrepareTest.td
[java] Test Passed: OK
[java]
[java] -----------------------------------------
[java] com/sun/jini/test/spec/txnmanager/CommitExpiredTest.td
[java] Test Passed: OK
[java]
[java] -----------------------------------------
[java] com/sun/jini/test/spec/txnmanager/CommitTimeoutTest.td
[java] Test Passed: OK
[java]
[java] -----------------------------------------
[java] com/sun/jini/test/spec/txnmanager/GetStateTest.td
[java] Test Passed: OK
[java]
[java] -----------------------------------------
[java] com/sun/jini/test/spec/txnmanager/JoinIdempotentTest.td
[java] Test Passed: OK
[java]
[java] -----------------------------------------
[java] com/sun/jini/test/spec/txnmanager/JoinWhileActiveTest.td
[java] Test Passed: OK
[java]
[java] -----------------------------------------
[java] com/sun/jini/test/spec/txnmanager/ManyParticipantsTest.td
[java] Test Passed: OK
[java]
[java] -----------------------------------------
[java] com/sun/jini/test/spec/txnmanager/PrepareTimeoutTest.td
[java] Test Passed: OK
[java]
[java] -----------------------------------------
[java] com/sun/jini/test/spec/txnmanager/RollBackErrorTest.td
[java] Test Passed: OK
[java]
[java] -----------------------------------------
[java] com/sun/jini/test/spec/txnmanager/RollForwardErrorTest.td
[java] Test Passed: OK
[java]
[java] -----------------------------------------
[java] com/sun/jini/test/spec/txnmanager/TwoPhaseTest.td
[java] Test Passed: OK
[java]
[java] -----------------------------------------
[java]
[java] # of tests started = 1342
[java] # of tests completed = 1342
[java] # of tests skipped = 43
[java] # of tests passed = 1340
[java] # of tests failed = 2
[java]
[java] -----------------------------------------
[java]
[java] Date finished:
[java] Fri Jul 05 11:08:15 CDT 2013
[java] Time elapsed:
[java] 63534 seconds
[java]
[java] Java Result: 1
collect-result:
[copy] Copying 1 file to <https://builds.apache.org/job/river-qa-refactor-arm/ws/qa/result>
[copy] Copying 1 file to <https://builds.apache.org/job/river-qa-refactor-arm/ws/qa/result>
[zip] Building zip: <https://builds.apache.org/job/river-qa-refactor-arm/62/artifact/qa/result/qaresults-arm-Linux-1.7.0_06.zip>
BUILD FAILED
<https://builds.apache.org/job/river-qa-refactor-arm/ws/build.xml>:55: The following error occurred while executing this line:
<https://builds.apache.org/job/river-qa-refactor-arm/ws/qa/build.xml>:412: The following error occurred while executing this line:
<https://builds.apache.org/job/river-qa-refactor-arm/ws/qa/build.xml>:380: condition satisfied
Total time: 1072 minutes 57 seconds
Build step 'Invoke Ant' marked build as failure
Archiving artifacts
Build failed in Jenkins: river-qa-refactor-arm #61
Posted by Apache Jenkins Server <je...@builds.apache.org>.
See <https://builds.apache.org/job/river-qa-refactor-arm/61/changes>
Changes:
[peter_firmstone] Make MarshalledInstance an immutable object, rather than effectively immutable, so it is safely published when constructors and deserialization completes.
[peter_firmstone] Add verbosity to UnknownLeaseException's in Reggie, check ready before holding read or write locks, to avoid lock ordering issues arising in future and to avoid waiting while holding ReadersWriter lock.
------------------------------------------
[...truncated 8456 lines...]
[java] Test Passed: OK
[java]
[java] -----------------------------------------
[java] com/sun/jini/test/spec/javaspace/conformance/snapshot/SnapshotTransactionTakeIfExistsTest.td
[java] Test Passed: OK
[java]
[java] -----------------------------------------
[java] com/sun/jini/test/spec/javaspace/conformance/snapshot/SnapshotTransactionTakeIfExistsWaitTest.td
[java] Test Passed: OK
[java]
[java] -----------------------------------------
[java] com/sun/jini/test/spec/javaspace/conformance/snapshot/SnapshotTransactionTakeNO_WAITTest.td
[java] Test Passed: OK
[java]
[java] -----------------------------------------
[java] com/sun/jini/test/spec/javaspace/conformance/snapshot/SnapshotTransactionTakeReadTest.td
[java] Test Passed: OK
[java]
[java] -----------------------------------------
[java] com/sun/jini/test/spec/javaspace/conformance/snapshot/SnapshotTransactionTakeTest.td
[java] Test Passed: OK
[java]
[java] -----------------------------------------
[java] com/sun/jini/test/spec/javaspace/conformance/snapshot/SnapshotTransactionTakeWaitTest.td
[java] Test Passed: OK
[java]
[java] -----------------------------------------
[java] com/sun/jini/test/spec/javaspace/conformance/snapshot/SnapshotTransactionWriteLeaseANYTest.td
[java] Test Passed: OK
[java]
[java] -----------------------------------------
[java] com/sun/jini/test/spec/javaspace/conformance/snapshot/SnapshotTransactionWriteLeaseFOREVERTest.td
[java] Test Passed: OK
[java]
[java] -----------------------------------------
[java] com/sun/jini/test/spec/javaspace/conformance/snapshot/SnapshotTransactionWriteNegativeLeaseTest.td
[java] Test Passed: OK
[java]
[java] -----------------------------------------
[java] com/sun/jini/test/spec/javaspace/conformance/snapshot/SnapshotTransactionWriteTakeIfExistsNotifyTest.td
[java] Test Passed: OK
[java]
[java] -----------------------------------------
[java] com/sun/jini/test/spec/javaspace/conformance/snapshot/SnapshotTransactionWriteTakeIfExistsTest.td
[java] Test Passed: OK
[java]
[java] -----------------------------------------
[java] com/sun/jini/test/spec/javaspace/conformance/snapshot/SnapshotTransactionWriteTakeNotifyTest.td
[java] Test Passed: OK
[java]
[java] -----------------------------------------
[java] com/sun/jini/test/spec/javaspace/conformance/snapshot/SnapshotTransactionWriteTakeTest.td
[java] Test Passed: OK
[java]
[java] -----------------------------------------
[java] com/sun/jini/test/spec/javaspace/conformance/snapshot/SnapshotTransactionWriteTest.td
[java] Test Passed: OK
[java]
[java] -----------------------------------------
[java] com/sun/jini/test/spec/javaspace/conformance/snapshot/SnapshotWriteLeaseANYTest.td
[java] Test Passed: OK
[java]
[java] -----------------------------------------
[java] com/sun/jini/test/spec/javaspace/conformance/snapshot/SnapshotWriteLeaseFOREVERTest.td
[java] Test Passed: OK
[java]
[java] -----------------------------------------
[java] com/sun/jini/test/spec/javaspace/conformance/snapshot/SnapshotWriteNegativeLeaseTest.td
[java] Test Passed: OK
[java]
[java] -----------------------------------------
[java] com/sun/jini/test/spec/javaspace/conformance/snapshot/SnapshotWriteTest.td
[java] Test Passed: OK
[java]
[java] -----------------------------------------
[java] com/sun/jini/test/impl/mahalo/AdminIFShutdownTest.td
[java] Test Passed: OK
[java]
[java] -----------------------------------------
[java] com/sun/jini/test/impl/mahalo/AdminIFTest.td
[java] Test Passed: OK
[java]
[java] -----------------------------------------
[java] com/sun/jini/test/impl/mahalo/LeaseExpireCancelTest.td
[java] Test Passed: OK
[java]
[java] -----------------------------------------
[java] com/sun/jini/test/impl/mahalo/LeaseExpireRenewTest.td
[java] Test Passed: OK
[java]
[java] -----------------------------------------
[java] com/sun/jini/test/impl/mahalo/LeaseMapTest.td
[java] Test Passed: OK
[java]
[java] -----------------------------------------
[java] com/sun/jini/test/impl/mahalo/LeaseTest.td
[java] Test Passed: OK
[java]
[java] -----------------------------------------
[java] com/sun/jini/test/impl/mahalo/MahaloCreateShutdownTest.td
[java] Test Passed: OK
[java]
[java] -----------------------------------------
[java] com/sun/jini/test/impl/mahalo/MahaloIFTest.td
[java] Test Passed: OK
[java]
[java] -----------------------------------------
[java] com/sun/jini/test/impl/mahalo/MahaloImplReadyStateTest.td
[java] Test Skipped: verifiers are: com.sun.jini.test.impl.mercury.ActivatableMercuryVerifier com.sun.jini.qa.harness.SkipConfigTestVerifier
[java] -----------------------------------------
[java] com/sun/jini/test/impl/mahalo/NestableServerTransactionCreatedToStringTest.td
[java] Test Passed: OK
[java]
[java] -----------------------------------------
[java] com/sun/jini/test/impl/mahalo/NestableTransactionCreatedToStringTest.td
[java] Test Passed: OK
[java]
[java] -----------------------------------------
[java] com/sun/jini/test/impl/mahalo/PrepareAndCommitExceptionTest.td
[java] Test Passed: OK
[java]
[java] -----------------------------------------
[java] com/sun/jini/test/impl/mahalo/PrepareAndCommitExceptionTest2.td
[java] Test Passed: OK
[java]
[java] -----------------------------------------
[java] com/sun/jini/test/impl/mahalo/PrepareAndCommitExceptionTest3.td
[java] Test Passed: OK
[java]
[java] -----------------------------------------
[java] com/sun/jini/test/impl/mahalo/PrepareAndCommitExceptionTest4.td
[java] Test Passed: OK
[java]
[java] -----------------------------------------
[java] com/sun/jini/test/impl/mahalo/PrepareAndCommitExceptionTest5.td
[java] Test Passed: OK
[java]
[java] -----------------------------------------
[java] com/sun/jini/test/impl/mahalo/RandomStressTest.td
[java] Test Passed: OK
[java]
[java] -----------------------------------------
[java] com/sun/jini/test/impl/mahalo/ServerTransactionEqualityTest.td
[java] Test Passed: OK
[java]
[java] -----------------------------------------
[java] com/sun/jini/test/impl/mahalo/ServerTransactionToStringTest.td
[java] Test Passed: OK
[java]
[java] -----------------------------------------
[java] com/sun/jini/test/impl/mahalo/TransactionCreatedToStringTest.td
[java] Test Passed: OK
[java]
[java] -----------------------------------------
[java] com/sun/jini/test/impl/mahalo/TransactionManagerCreatedToStringTest.td
[java] Test Passed: OK
[java]
[java] -----------------------------------------
[java] com/sun/jini/test/impl/mahalo/TxnMgrImplNullActivationConfigEntries.td
[java] Test Skipped: verifiers are: com.sun.jini.test.impl.mahalo.ActivatableMahaloVerifier
[java] -----------------------------------------
[java] com/sun/jini/test/impl/mahalo/TxnMgrImplNullConfigEntries.td
[java] Test Passed: OK
[java]
[java] -----------------------------------------
[java] com/sun/jini/test/impl/mahalo/TxnMgrImplNullRecoveredLocators.td
[java] Test Skipped: verifiers are: com.sun.jini.test.impl.mahalo.ActivatableMahaloVerifier
[java] -----------------------------------------
[java] com/sun/jini/test/impl/mahalo/TxnMgrProxyEqualityTest.td
[java] Test Passed: OK
[java]
[java] -----------------------------------------
[java] com/sun/jini/test/spec/txnmanager/AsynchAbortOnCommitTest.td
[java] Test Passed: OK
[java]
[java] -----------------------------------------
[java] com/sun/jini/test/spec/txnmanager/AsynchAbortOnPrepareTest.td
[java] Test Passed: OK
[java]
[java] -----------------------------------------
[java] com/sun/jini/test/spec/txnmanager/CommitExpiredTest.td
[java] Test Passed: OK
[java]
[java] -----------------------------------------
[java] com/sun/jini/test/spec/txnmanager/CommitTimeoutTest.td
[java] Test Passed: OK
[java]
[java] -----------------------------------------
[java] com/sun/jini/test/spec/txnmanager/GetStateTest.td
[java] Test Passed: OK
[java]
[java] -----------------------------------------
[java] com/sun/jini/test/spec/txnmanager/JoinIdempotentTest.td
[java] Test Passed: OK
[java]
[java] -----------------------------------------
[java] com/sun/jini/test/spec/txnmanager/JoinWhileActiveTest.td
[java] Test Passed: OK
[java]
[java] -----------------------------------------
[java] com/sun/jini/test/spec/txnmanager/ManyParticipantsTest.td
[java] Test Passed: OK
[java]
[java] -----------------------------------------
[java] com/sun/jini/test/spec/txnmanager/PrepareTimeoutTest.td
[java] Test Passed: OK
[java]
[java] -----------------------------------------
[java] com/sun/jini/test/spec/txnmanager/RollBackErrorTest.td
[java] Test Passed: OK
[java]
[java] -----------------------------------------
[java] com/sun/jini/test/spec/txnmanager/RollForwardErrorTest.td
[java] Test Passed: OK
[java]
[java] -----------------------------------------
[java] com/sun/jini/test/spec/txnmanager/TwoPhaseTest.td
[java] Test Passed: OK
[java]
[java] -----------------------------------------
[java]
[java] # of tests started = 1342
[java] # of tests completed = 1342
[java] # of tests skipped = 43
[java] # of tests passed = 1341
[java] # of tests failed = 1
[java]
[java] -----------------------------------------
[java]
[java] Date finished:
[java] Tue Jul 02 13:33:49 CDT 2013
[java] Time elapsed:
[java] 62884 seconds
[java]
[java] Java Result: 1
collect-result:
[copy] Copying 1 file to <https://builds.apache.org/job/river-qa-refactor-arm/ws/qa/result>
[copy] Copying 1 file to <https://builds.apache.org/job/river-qa-refactor-arm/ws/qa/result>
[zip] Building zip: <https://builds.apache.org/job/river-qa-refactor-arm/61/artifact/qa/result/qaresults-arm-Linux-1.7.0_06.zip>
BUILD FAILED
<https://builds.apache.org/job/river-qa-refactor-arm/ws/build.xml>:55: The following error occurred while executing this line:
<https://builds.apache.org/job/river-qa-refactor-arm/ws/qa/build.xml>:412: The following error occurred while executing this line:
<https://builds.apache.org/job/river-qa-refactor-arm/ws/qa/build.xml>:380: condition satisfied
Total time: 1062 minutes 7 seconds
Build step 'Invoke Ant' marked build as failure
Archiving artifacts
Build failed in Jenkins: river-qa-refactor-arm #60
Posted by Apache Jenkins Server <je...@builds.apache.org>.
See <https://builds.apache.org/job/river-qa-refactor-arm/60/changes>
Changes:
[peter_firmstone] Ensure remaining transitions are processed prior to termination in OperationJournal
------------------------------------------
[...truncated 8456 lines...]
[java] Test Passed: OK
[java]
[java] -----------------------------------------
[java] com/sun/jini/test/spec/javaspace/conformance/snapshot/SnapshotTransactionTakeIfExistsTest.td
[java] Test Passed: OK
[java]
[java] -----------------------------------------
[java] com/sun/jini/test/spec/javaspace/conformance/snapshot/SnapshotTransactionTakeIfExistsWaitTest.td
[java] Test Passed: OK
[java]
[java] -----------------------------------------
[java] com/sun/jini/test/spec/javaspace/conformance/snapshot/SnapshotTransactionTakeNO_WAITTest.td
[java] Test Passed: OK
[java]
[java] -----------------------------------------
[java] com/sun/jini/test/spec/javaspace/conformance/snapshot/SnapshotTransactionTakeReadTest.td
[java] Test Passed: OK
[java]
[java] -----------------------------------------
[java] com/sun/jini/test/spec/javaspace/conformance/snapshot/SnapshotTransactionTakeTest.td
[java] Test Passed: OK
[java]
[java] -----------------------------------------
[java] com/sun/jini/test/spec/javaspace/conformance/snapshot/SnapshotTransactionTakeWaitTest.td
[java] Test Passed: OK
[java]
[java] -----------------------------------------
[java] com/sun/jini/test/spec/javaspace/conformance/snapshot/SnapshotTransactionWriteLeaseANYTest.td
[java] Test Passed: OK
[java]
[java] -----------------------------------------
[java] com/sun/jini/test/spec/javaspace/conformance/snapshot/SnapshotTransactionWriteLeaseFOREVERTest.td
[java] Test Passed: OK
[java]
[java] -----------------------------------------
[java] com/sun/jini/test/spec/javaspace/conformance/snapshot/SnapshotTransactionWriteNegativeLeaseTest.td
[java] Test Passed: OK
[java]
[java] -----------------------------------------
[java] com/sun/jini/test/spec/javaspace/conformance/snapshot/SnapshotTransactionWriteTakeIfExistsNotifyTest.td
[java] Test Passed: OK
[java]
[java] -----------------------------------------
[java] com/sun/jini/test/spec/javaspace/conformance/snapshot/SnapshotTransactionWriteTakeIfExistsTest.td
[java] Test Passed: OK
[java]
[java] -----------------------------------------
[java] com/sun/jini/test/spec/javaspace/conformance/snapshot/SnapshotTransactionWriteTakeNotifyTest.td
[java] Test Passed: OK
[java]
[java] -----------------------------------------
[java] com/sun/jini/test/spec/javaspace/conformance/snapshot/SnapshotTransactionWriteTakeTest.td
[java] Test Passed: OK
[java]
[java] -----------------------------------------
[java] com/sun/jini/test/spec/javaspace/conformance/snapshot/SnapshotTransactionWriteTest.td
[java] Test Passed: OK
[java]
[java] -----------------------------------------
[java] com/sun/jini/test/spec/javaspace/conformance/snapshot/SnapshotWriteLeaseANYTest.td
[java] Test Passed: OK
[java]
[java] -----------------------------------------
[java] com/sun/jini/test/spec/javaspace/conformance/snapshot/SnapshotWriteLeaseFOREVERTest.td
[java] Test Passed: OK
[java]
[java] -----------------------------------------
[java] com/sun/jini/test/spec/javaspace/conformance/snapshot/SnapshotWriteNegativeLeaseTest.td
[java] Test Passed: OK
[java]
[java] -----------------------------------------
[java] com/sun/jini/test/spec/javaspace/conformance/snapshot/SnapshotWriteTest.td
[java] Test Passed: OK
[java]
[java] -----------------------------------------
[java] com/sun/jini/test/impl/mahalo/AdminIFShutdownTest.td
[java] Test Passed: OK
[java]
[java] -----------------------------------------
[java] com/sun/jini/test/impl/mahalo/AdminIFTest.td
[java] Test Passed: OK
[java]
[java] -----------------------------------------
[java] com/sun/jini/test/impl/mahalo/LeaseExpireCancelTest.td
[java] Test Passed: OK
[java]
[java] -----------------------------------------
[java] com/sun/jini/test/impl/mahalo/LeaseExpireRenewTest.td
[java] Test Passed: OK
[java]
[java] -----------------------------------------
[java] com/sun/jini/test/impl/mahalo/LeaseMapTest.td
[java] Test Passed: OK
[java]
[java] -----------------------------------------
[java] com/sun/jini/test/impl/mahalo/LeaseTest.td
[java] Test Passed: OK
[java]
[java] -----------------------------------------
[java] com/sun/jini/test/impl/mahalo/MahaloCreateShutdownTest.td
[java] Test Passed: OK
[java]
[java] -----------------------------------------
[java] com/sun/jini/test/impl/mahalo/MahaloIFTest.td
[java] Test Passed: OK
[java]
[java] -----------------------------------------
[java] com/sun/jini/test/impl/mahalo/MahaloImplReadyStateTest.td
[java] Test Skipped: verifiers are: com.sun.jini.test.impl.mercury.ActivatableMercuryVerifier com.sun.jini.qa.harness.SkipConfigTestVerifier
[java] -----------------------------------------
[java] com/sun/jini/test/impl/mahalo/NestableServerTransactionCreatedToStringTest.td
[java] Test Passed: OK
[java]
[java] -----------------------------------------
[java] com/sun/jini/test/impl/mahalo/NestableTransactionCreatedToStringTest.td
[java] Test Passed: OK
[java]
[java] -----------------------------------------
[java] com/sun/jini/test/impl/mahalo/PrepareAndCommitExceptionTest.td
[java] Test Passed: OK
[java]
[java] -----------------------------------------
[java] com/sun/jini/test/impl/mahalo/PrepareAndCommitExceptionTest2.td
[java] Test Passed: OK
[java]
[java] -----------------------------------------
[java] com/sun/jini/test/impl/mahalo/PrepareAndCommitExceptionTest3.td
[java] Test Passed: OK
[java]
[java] -----------------------------------------
[java] com/sun/jini/test/impl/mahalo/PrepareAndCommitExceptionTest4.td
[java] Test Passed: OK
[java]
[java] -----------------------------------------
[java] com/sun/jini/test/impl/mahalo/PrepareAndCommitExceptionTest5.td
[java] Test Passed: OK
[java]
[java] -----------------------------------------
[java] com/sun/jini/test/impl/mahalo/RandomStressTest.td
[java] Test Passed: OK
[java]
[java] -----------------------------------------
[java] com/sun/jini/test/impl/mahalo/ServerTransactionEqualityTest.td
[java] Test Passed: OK
[java]
[java] -----------------------------------------
[java] com/sun/jini/test/impl/mahalo/ServerTransactionToStringTest.td
[java] Test Passed: OK
[java]
[java] -----------------------------------------
[java] com/sun/jini/test/impl/mahalo/TransactionCreatedToStringTest.td
[java] Test Passed: OK
[java]
[java] -----------------------------------------
[java] com/sun/jini/test/impl/mahalo/TransactionManagerCreatedToStringTest.td
[java] Test Passed: OK
[java]
[java] -----------------------------------------
[java] com/sun/jini/test/impl/mahalo/TxnMgrImplNullActivationConfigEntries.td
[java] Test Skipped: verifiers are: com.sun.jini.test.impl.mahalo.ActivatableMahaloVerifier
[java] -----------------------------------------
[java] com/sun/jini/test/impl/mahalo/TxnMgrImplNullConfigEntries.td
[java] Test Passed: OK
[java]
[java] -----------------------------------------
[java] com/sun/jini/test/impl/mahalo/TxnMgrImplNullRecoveredLocators.td
[java] Test Skipped: verifiers are: com.sun.jini.test.impl.mahalo.ActivatableMahaloVerifier
[java] -----------------------------------------
[java] com/sun/jini/test/impl/mahalo/TxnMgrProxyEqualityTest.td
[java] Test Passed: OK
[java]
[java] -----------------------------------------
[java] com/sun/jini/test/spec/txnmanager/AsynchAbortOnCommitTest.td
[java] Test Passed: OK
[java]
[java] -----------------------------------------
[java] com/sun/jini/test/spec/txnmanager/AsynchAbortOnPrepareTest.td
[java] Test Passed: OK
[java]
[java] -----------------------------------------
[java] com/sun/jini/test/spec/txnmanager/CommitExpiredTest.td
[java] Test Passed: OK
[java]
[java] -----------------------------------------
[java] com/sun/jini/test/spec/txnmanager/CommitTimeoutTest.td
[java] Test Passed: OK
[java]
[java] -----------------------------------------
[java] com/sun/jini/test/spec/txnmanager/GetStateTest.td
[java] Test Passed: OK
[java]
[java] -----------------------------------------
[java] com/sun/jini/test/spec/txnmanager/JoinIdempotentTest.td
[java] Test Passed: OK
[java]
[java] -----------------------------------------
[java] com/sun/jini/test/spec/txnmanager/JoinWhileActiveTest.td
[java] Test Passed: OK
[java]
[java] -----------------------------------------
[java] com/sun/jini/test/spec/txnmanager/ManyParticipantsTest.td
[java] Test Passed: OK
[java]
[java] -----------------------------------------
[java] com/sun/jini/test/spec/txnmanager/PrepareTimeoutTest.td
[java] Test Passed: OK
[java]
[java] -----------------------------------------
[java] com/sun/jini/test/spec/txnmanager/RollBackErrorTest.td
[java] Test Passed: OK
[java]
[java] -----------------------------------------
[java] com/sun/jini/test/spec/txnmanager/RollForwardErrorTest.td
[java] Test Passed: OK
[java]
[java] -----------------------------------------
[java] com/sun/jini/test/spec/txnmanager/TwoPhaseTest.td
[java] Test Passed: OK
[java]
[java] -----------------------------------------
[java]
[java] # of tests started = 1342
[java] # of tests completed = 1342
[java] # of tests skipped = 43
[java] # of tests passed = 1341
[java] # of tests failed = 1
[java]
[java] -----------------------------------------
[java]
[java] Date finished:
[java] Sat Jun 29 14:40:31 CDT 2013
[java] Time elapsed:
[java] 63072 seconds
[java]
[java] Java Result: 1
collect-result:
[copy] Copying 1 file to <https://builds.apache.org/job/river-qa-refactor-arm/ws/qa/result>
[copy] Copying 1 file to <https://builds.apache.org/job/river-qa-refactor-arm/ws/qa/result>
[zip] Building zip: <https://builds.apache.org/job/river-qa-refactor-arm/60/artifact/qa/result/qaresults-arm-Linux-1.7.0_06.zip>
BUILD FAILED
<https://builds.apache.org/job/river-qa-refactor-arm/ws/build.xml>:55: The following error occurred while executing this line:
<https://builds.apache.org/job/river-qa-refactor-arm/ws/qa/build.xml>:412: The following error occurred while executing this line:
<https://builds.apache.org/job/river-qa-refactor-arm/ws/qa/build.xml>:380: condition satisfied
Total time: 1065 minutes 15 seconds
Build step 'Invoke Ant' marked build as failure
Archiving artifacts