You are viewing a plain text version of this content. The canonical link for it is here.
Posted to dev@oozie.apache.org by Apache Jenkins Server <je...@builds.apache.org> on 2020/01/09 11:30:04 UTC
Failed: OOZIE-3579 PreCommit Build #1284
Jira: https://issues.apache.org/jira/browse/OOZIE-3579
Build: https://builds.apache.org/job/PreCommit-OOZIE-Build/1284/
###################################################################################
########################## LAST 100 LINES OF THE CONSOLE ###########################
[...truncated 2.15 MB...]
[TRACE] Summary file size is 2998 bytes
[TRACE] Full summary file size is 1987 bytes
[TRACE] File [/home/jenkins/jenkins-slave/workspace/PreCommit-OOZIE-Build/test-patch/tmp/SPOTBUGS_DIFF/diff/findbugs-diff-0.1.0-all.jar] removed
[TRACE] File [/home/jenkins/jenkins-slave/workspace/PreCommit-OOZIE-Build/test-patch/tmp/SPOTBUGS_DIFF/diff/findbugs-diff-0.1.0-all.jar.md5] removed
Running test-patch task BACKWARDS_COMPATIBILITY
Running test-patch task TESTS
Running test-patch task DISTRO
Running test-patch task MODERNIZER
Running modernizer op=report
[TRACE] grep -c '.*ERROR.*Prefer' /home/jenkins/jenkins-slave/workspace/PreCommit-OOZIE-Build/test-patch/reports/MODERNIZER-clean.txt
[TRACE] Modernizer errors before patch: 51
[TRACE] grep -c '.*ERROR.*Prefer' /home/jenkins/jenkins-slave/workspace/PreCommit-OOZIE-Build/test-patch/reports/MODERNIZER-patch.txt
[TRACE] Modernizer errors after patch: 51
Testing JIRA OOZIE-3579
Cleaning local git workspace
----------------------------
+1 PATCH_APPLIES
+1 CLEAN
-1 RAW_PATCH_ANALYSIS
+1 the patch does not introduce any @author tags
+1 the patch does not introduce any tabs
+1 the patch does not introduce any trailing spaces
+1 the patch does not introduce any star imports
+1 the patch does not introduce any line longer than 132
-1 the patch does not add/modify any testcase
+1 RAT
+1 the patch does not seem to introduce new RAT warnings
+1 JAVADOC
+1 Javadoc generation succeeded with the patch
+1 the patch does not seem to introduce new Javadoc warning(s)
+1 COMPILE
+1 HEAD compiles
+1 patch compiles
+1 the patch does not seem to introduce new javac warnings
-1 There are [1] new bugs found below threshold in total that must be fixed.
+1 There are no new bugs found in [core].
+1 There are no new bugs found in [tools].
+1 There are no new bugs found in [docs].
+1 There are no new bugs found in [sharelib/streaming].
+1 There are no new bugs found in [sharelib/spark].
+1 There are no new bugs found in [sharelib/hive2].
+1 There are no new bugs found in [sharelib/hcatalog].
+1 There are no new bugs found in [sharelib/distcp].
+1 There are no new bugs found in [sharelib/hive].
-1 There are [1] new bugs found below threshold in [sharelib/oozie] that must be fixed.
You can find the SpotBugs diff here (look for the red and orange ones): sharelib/oozie/findbugs-new.html
The most important SpotBugs errors are:
At ShellMain.java:[line 93]: This usage of java/lang/ProcessBuilder.<init>(Ljava/util/List;)V can be vulnerable to Command Injection
At ShellMain.java:[line 91]: At ShellMain.java:[line 90]
At ShellMain.java:[line 92]
+1 There are no new bugs found in [sharelib/sqoop].
+1 There are no new bugs found in [sharelib/pig].
+1 There are no new bugs found in [sharelib/git].
+1 There are no new bugs found in [webapp].
+1 There are no new bugs found in [client].
+1 There are no new bugs found in [examples].
+1 There are no new bugs found in [fluent-job/fluent-job-api].
+1 There are no new bugs found in [server].
+1 BACKWARDS_COMPATIBILITY
+1 the patch does not change any JPA Entity/Colum/Basic/Lob/Transient annotations
+1 the patch does not modify JPA files
+1 TESTS
Tests run: 3200
Tests failed at first run:
TestDaylightOffsetCalculator#testCalculateBetweenDSTStartAndStandardEndGivesPositiveOffset
TestBlockingInputStream#testFastWritingBlockingInputStream
TestPriorityDelayQueue#testPeek
For the complete list of flaky tests, see TEST-SUMMARY-FULL files.
+1 DISTRO
+1 distro tarball builds with the patch
+1 MODERNIZER
----------------------------
-1 Overall result, please check the reported -1(s)
The full output of the test-patch run is available at
https://builds.apache.org/job/PreCommit-OOZIE-Build/1284/
Adding comment to JIRA
% Total % Received % Xferd Average Speed Time Time Time Current
Dload Upload Total Spent Left Speed
0 0 0 0 0 0 0 0 --:--:-- --:--:-- --:--:-- 0 0 0 0 0 0 0 0 0 --:--:-- --:--:-- --:--:-- 0100 4005 0 0 100 4005 0 2686 0:00:01 0:00:01 --:--:-- 2684{"self":"https://issues.apache.org/jira/rest/api/2/issue/13278068/comment/17011722","id":"17011722","author":{"self":"https://issues.apache.org/jira/rest/api/2/user?username=hadoopqa","name":"hadoopqa","key":"hadoopqa","avatarUrls":{"48x48":"https://issues.apache.org/jira/secure/useravatar?ownerId=hadoopqa&avatarId=10393","24x24":"https://issues.apache.org/jira/secure/useravatar?size=small&ownerId=hadoopqa&avatarId=10393","16x16":"https://issues.apache.org/jira/secure/useravatar?size=xsmall&ownerId=hadoopqa&avatarId=10393","32x32":"https://issues.apache.org/jira/secure/useravatar?size=medium&ownerId=hadoopqa&avatarId=10393"},"displayName":"Hadoop QA","active":true,"timeZone":"Etc/UTC"},"body":"\nTesting JIRA OOZIE-3579\n\nCleaning local git workspace\n\n----------------------------\n\n{color:green}+1 PATCH_APPLIES{color}\n{color:green}+1 CLEAN{color}\n{color:red}-1 RAW_PATCH_ANALYSIS{color}\n. {color:green}+1{color} the patch does not introduce any @author tags\n. {color:green}+1{color} the patch does not introduce any tabs\n. {color:green}+1{color} the patch does not introduce any trailing spaces\n. {color:green}+1{color} the patch does not introduce any star imports\n. {color:green}+1{color} the patch does not introduce any line longer than 132\n. {color:red}-1{color} the patch does not add/modify any testcase\n{color:green}+1 RAT{color}\n. {color:green}+1{color} the patch does not seem to introduce new RAT warnings\n{color:green}+1 JAVADOC{color}\n. {color:green}+1{color} Javadoc generation succeeded with the patch\n. {color:green}+1{color} the patch does not seem to introduce new Javadoc warning(s)\n{color:green}+1 COMPILE{color}\n. {color:green}+1{color} HEAD compiles\n. {color:green}+1{color} patch compiles\n. {color:green}+1{color} the patch does not seem to introduce new javac warnings\n{color:red}-1{color} There are [1] new bugs found below threshold in total that must be fixed.\n. {color:green}+1{color} There are no new bugs found in [core].\n. {color:green}+1{color} There are no new bugs found in [tools].\n. {color:green}+1{color} There are no new bugs found in [docs].\n. {color:green}+1{color} There are no new bugs found in [sharelib/streaming].\n. {color:green}+1{color} There are no new bugs found in [sharelib/spark].\n. {color:green}+1{color} There are no new bugs found in [sharelib/hive2].\n. {color:green}+1{color} There are no new bugs found in [sharelib/hcatalog].\n. {color:green}+1{color} There are no new bugs found in [sharelib/distcp].\n. {color:green}+1{color} There are no new bugs found in [sharelib/hive].\n. {color:red}-1{color} There are [1] new bugs found below threshold in [sharelib/oozie] that must be fixed.\n. You can find the SpotBugs diff here (look for the red and orange ones): sharelib/oozie/findbugs-new.html\n. The most important SpotBugs errors are:\n. At ShellMain.java:[line 93]: This usage of java/lang/ProcessBuilder.<init>(Ljava/util/List;)V can be vulnerable to Command Injection\n. At ShellMain.java:[line 91]: At ShellMain.java:[line 90]\n. At ShellMain.java:[line 92]\n. {color:green}+1{color} There are no new bugs found in [sharelib/sqoop].\n. {color:green}+1{color} There are no new bugs found in [sharelib/pig].\n. {color:green}+1{color} There are no new bugs found in [sharelib/git].\n. {color:green}+1{color} There are no new bugs found in [webapp].\n. {color:green}+1{color} There are no new bugs found in [client].\n. {color:green}+1{color} There are no new bugs found in [examples].\n. {color:green}+1{color} There are no new bugs found in [fluent-job/fluent-job-api].\n. {color:green}+1{color} There are no new bugs found in [server].\n{color:green}+1 BACKWARDS_COMPATIBILITY{color}\n. {color:green}+1{color} the patch does not change any JPA Entity/Colum/Basic/Lob/Transient annotations\n. {color:green}+1{color} the patch does not modify JPA files\n{color:green}+1 TESTS{color}\n. Tests run: 3200\n. {color:orange}Tests failed at first run:{color}\nTestDaylightOffsetC100 9386 0 5381 100 4005 3440 2560 0:00:01 0:00:01 --:--:-- 5997
alculator#testCalculateBetweenDSTStartAndStandardEndGivesPositiveOffset\nTestBlockingInputStream#testFastWritingBlockingInputStream\nTestPriorityDelayQueue#testPeek\n. For the complete list of flaky tests, see TEST-SUMMARY-FULL files.\n{color:green}+1 DISTRO{color}\n. {color:green}+1{color} distro tarball builds with the patch \n{color:green}+1 MODERNIZER{color}\n\n----------------------------\n{color:red}*-1 Overall result, please check the reported -1(s)*{color}\n\n\nThe full output of the test-patch run is available at\n\n. https://builds.apache.org/job/PreCommit-OOZIE-Build/1284/\n\n","updateAuthor":{"self":"https://issues.apache.org/jira/rest/api/2/user?username=hadoopqa","name":"hadoopqa","key":"hadoopqa","avatarUrls":{"48x48":"https://issues.apache.org/jira/secure/useravatar?ownerId=hadoopqa&avatarId=10393","24x24":"https://issues.apache.org/jira/secure/useravatar?size=small&ownerId=hadoopqa&avatarId=10393","16x16":"https://issues.apache.org/jira/secure/useravatar?size=xsmall&ownerId=hadoopqa&avatarId=10393","32x32":"https://issues.apache.org/jira/secure/useravatar?size=medium&ownerId=hadoopqa&avatarId=10393"},"displayName":"Hadoop QA","active":true,"timeZone":"Etc/UTC"},"created":"2020-01-09T11:29:59.875+0000","updated":"2020-01-09T11:29:59.875+0000"}
test-patch exit code: 1
Build step 'Execute shell' marked build as failure
[description-setter] Description set: OOZIE-3579
Archiving artifacts
Recording test results
ERROR: Step ?Publish JUnit test result report? failed: No test report files were found. Configuration error?
Email was triggered for: Failure - Any
Sending email for trigger: Failure - Any
###################################################################################
############################## FAILED TESTS (if any) ##############################
No tests ran.
Failed: OOZIE-3569 PreCommit Build #1291
Posted by Apache Jenkins Server <je...@builds.apache.org>.
Jira: https://issues.apache.org/jira/browse/OOZIE-3569
Build: https://builds.apache.org/job/PreCommit-OOZIE-Build/1291/
###################################################################################
########################## LAST 100 LINES OF THE CONSOLE ###########################
[...truncated 2.16 MB...]
Running test-patch task DISTRO
Running test-patch task MODERNIZER
Running modernizer op=report
[TRACE] grep -c '.*ERROR.*Prefer' /home/jenkins/jenkins-slave/workspace/PreCommit-OOZIE-Build/test-patch/reports/MODERNIZER-clean.txt
[TRACE] Modernizer errors before patch: 52
[TRACE] grep -c '.*ERROR.*Prefer' /home/jenkins/jenkins-slave/workspace/PreCommit-OOZIE-Build/test-patch/reports/MODERNIZER-patch.txt
[TRACE] Modernizer errors after patch: 52
Testing JIRA OOZIE-3569
Cleaning local git workspace
----------------------------
+1 PATCH_APPLIES
+1 CLEAN
-1 RAW_PATCH_ANALYSIS
+1 the patch does not introduce any @author tags
+1 the patch does not introduce any tabs
+1 the patch does not introduce any trailing spaces
+1 the patch does not introduce any star imports
+1 the patch does not introduce any line longer than 132
-1 the patch does not add/modify any testcase
+1 RAT
+1 the patch does not seem to introduce new RAT warnings
+1 JAVADOC
+1 Javadoc generation succeeded with the patch
+1 the patch does not seem to introduce new Javadoc warning(s)
+1 COMPILE
+1 HEAD compiles
+1 patch compiles
+1 the patch does not seem to introduce new javac warnings
-1 There are [4] new bugs found below threshold in total that must be fixed.
+1 There are no new bugs found in [fluent-job/fluent-job-api].
+1 There are no new bugs found in [docs].
-1 There are [3] new bugs found below threshold in [core] that must be fixed.
You can find the SpotBugs diff here (look for the red and orange ones): core/findbugs-new.html
The most important SpotBugs errors are:
At AuthorizationService.java:[line 192]: java/io/File.<init>(Ljava/lang/String;Ljava/lang/String;)V reads a file whose location might be specified by user input
At AuthorizationService.java:[line 191]: At AuthorizationService.java:[line 189]
At ShareLibService.java:[line 695]: Unsafe comparison of hash that are susceptible to timing attack
At ShareLibService.java:[line 691]: At ShareLibService.java:[line 689]
Possible injection that can lead to Source spoofing, header override and email body injection.: At ShareLibService.java:[line 693]
+1 There are no new bugs found in [sharelib/spark].
+1 There are no new bugs found in [sharelib/git].
+1 There are no new bugs found in [sharelib/sqoop].
+1 There are no new bugs found in [sharelib/hive2].
+1 There are no new bugs found in [sharelib/streaming].
+1 There are no new bugs found in [sharelib/pig].
-1 There are [1] new bugs found below threshold in [sharelib/oozie] that must be fixed.
You can find the SpotBugs diff here (look for the red and orange ones): sharelib/oozie/findbugs-new.html
The most important SpotBugs errors are:
At ShellMain.java:[line 93]: This usage of java/lang/ProcessBuilder.<init>(Ljava/util/List;)V can be vulnerable to Command Injection
At ShellMain.java:[line 91]: At ShellMain.java:[line 90]
At ShellMain.java:[line 92]
+1 There are no new bugs found in [sharelib/hive].
+1 There are no new bugs found in [sharelib/hcatalog].
+1 There are no new bugs found in [sharelib/distcp].
+1 There are no new bugs found in [tools].
+1 There are no new bugs found in [server].
+1 There are no new bugs found in [client].
+1 There are no new bugs found in [examples].
+1 There are no new bugs found in [webapp].
+1 BACKWARDS_COMPATIBILITY
+1 the patch does not change any JPA Entity/Colum/Basic/Lob/Transient annotations
+1 the patch does not modify JPA files
+1 TESTS
Tests run: 3207
Tests failed at first run:
TestBlockingInputStream#testFastWritingBlockingInputStream
TestBlockingInputStream#testLimitedWritingBlockingInputStream
For the complete list of flaky tests, see TEST-SUMMARY-FULL files.
+1 DISTRO
+1 distro tarball builds with the patch
+1 MODERNIZER
----------------------------
-1 Overall result, please check the reported -1(s)
The full output of the test-patch run is available at
https://builds.apache.org/job/PreCommit-OOZIE-Build/1291/
Adding comment to JIRA
% Total % Received % Xferd Average Speed Time Time Time Current
Dload Upload Total Spent Left Speed
0 0 0 0 0 0 0 0 --:--:-- --:--:-- --:--:-- 0 0 0 0 0 0 0 0 0 --:--:-- --:--:-- --:--:-- 0100 4704 0 0 100 4704 0 3176 0:00:01 0:00:01 --:--:-- 3176{"self":"https://issues.apache.org/jira/rest/api/2/issue/13274936/comment/17021219","id":"17021219","author":{"self":"https://issues.apache.org/jira/rest/api/2/user?username=hadoopqa","name":"hadoopqa","key":"hadoopqa","avatarUrls":{"48x48":"https://issues.apache.org/jira/secure/useravatar?ownerId=hadoopqa&avatarId=10393","24x24":"https://issues.apache.org/jira/secure/useravatar?size=small&ownerId=hadoopqa&avatarId=10393","16x16":"https://issues.apache.org/jira/secure/useravatar?size=xsmall&ownerId=hadoopqa&avatarId=10393","32x32":"https://issues.apache.org/jira/secure/useravatar?size=medium&ownerId=hadoopqa&avatarId=10393"},"displayName":"Hadoop QA","active":true,"timeZone":"Etc/UTC"},"body":"\nTesting JIRA OOZIE-3569\n\nCleaning local git workspace\n\n----------------------------\n\n{color:green}+1 PATCH_APPLIES{color}\n{color:green}+1 CLEAN{color}\n{color:red}-1 RAW_PATCH_ANALYSIS{color}\n. {color:green}+1{color} the patch does not introduce any @author tags\n. {color:green}+1{color} the patch does not introduce any tabs\n. {color:green}+1{color} the patch does not introduce any trailing spaces\n. {color:green}+1{color} the patch does not introduce any star imports\n. {color:green}+1{color} the patch does not introduce any line longer than 132\n. {color:red}-1{color} the patch does not add/modify any testcase\n{color:green}+1 RAT{color}\n. {color:green}+1{color} the patch does not seem to introduce new RAT warnings\n{color:green}+1 JAVADOC{color}\n. {color:green}+1{color} Javadoc generation succeeded with the patch\n. {color:green}+1{color} the patch does not seem to introduce new Javadoc warning(s)\n{color:green}+1 COMPILE{color}\n. {color:green}+1{color} HEAD compiles\n. {color:green}+1{color} patch compiles\n. {color:green}+1{color} the patch does not seem to introduce new javac warnings\n{color:red}-1{color} There are [4] new bugs found below threshold in total that must be fixed.\n. {color:green}+1{color} There are no new bugs found in [fluent-job/fluent-job-api].\n. {color:green}+1{color} There are no new bugs found in [docs].\n. {color:red}-1{color} There are [3] new bugs found below threshold in [core] that must be fixed.\n. You can find the SpotBugs diff here (look for the red and orange ones): core/findbugs-new.html\n. The most important SpotBugs errors are:\n. At AuthorizationService.java:[line 192]: java/io/File.<init>(Ljava/lang/String;Ljava/lang/String;)V reads a file whose location might be specified by user input\n. At AuthorizationService.java:[line 191]: At AuthorizationService.java:[line 189]\n. At ShareLibService.java:[line 695]: Unsafe comparison of hash that are susceptible to timing attack\n. At ShareLibService.java:[line 691]: At ShareLibService.java:[line 689]\n. Possible injection that can lead to Source spoofing, header override and email body injection.: At ShareLibService.java:[line 693]\n. {color:green}+1{color} There are no new bugs found in [sharelib/spark].\n. {color:green}+1{color} There are no new bugs found in [sharelib/git].\n. {color:green}+1{color} There are no new bugs found in [sharelib/sqoop].\n. {color:green}+1{color} There are no new bugs found in [sharelib/hive2].\n. {color:green}+1{color} There are no new bugs found in [sharelib/streaming].\n. {color:green}+1{color} There are no new bugs found in [sharelib/pig].\n. {color:red}-1{color} There are [1] new bugs found below threshold in [sharelib/oozie] that must be fixed.\n. You can find the SpotBugs diff here (look for the red and orange ones): sharelib/oozie/findbugs-new.html\n. The most important SpotBugs errors are:\n. At ShellMain.java:[line 93]: This usage of java/lang/ProcessBuilder.<init>(Ljava/util/List;)V can be vulnerable to Command Injection\n. At ShellMain.java:[line 91]: At ShellMain.java:[line 90]\n. At ShellMain.java:[line 92]\n. {color:green}+1{color} There are no new bugs found in [sharelib/hive].\n. {color:green}+1{color} There are no new bugs found in [sharelib/hcatalog].\n. {color:gre100 10784 0 6080 100 4704 3930 3040 0:00:01 0:00:01 --:--:-- 6966
en}+1{color} There are no new bugs found in [sharelib/distcp].\n. {color:green}+1{color} There are no new bugs found in [tools].\n. {color:green}+1{color} There are no new bugs found in [server].\n. {color:green}+1{color} There are no new bugs found in [client].\n. {color:green}+1{color} There are no new bugs found in [examples].\n. {color:green}+1{color} There are no new bugs found in [webapp].\n{color:green}+1 BACKWARDS_COMPATIBILITY{color}\n. {color:green}+1{color} the patch does not change any JPA Entity/Colum/Basic/Lob/Transient annotations\n. {color:green}+1{color} the patch does not modify JPA files\n{color:green}+1 TESTS{color}\n. Tests run: 3207\n. {color:orange}Tests failed at first run:{color}\nTestBlockingInputStream#testFastWritingBlockingInputStream\nTestBlockingInputStream#testLimitedWritingBlockingInputStream\n. For the complete list of flaky tests, see TEST-SUMMARY-FULL files.\n{color:green}+1 DISTRO{color}\n. {color:green}+1{color} distro tarball builds with the patch \n{color:green}+1 MODERNIZER{color}\n\n----------------------------\n{color:red}*-1 Overall result, please check the reported -1(s)*{color}\n\n\nThe full output of the test-patch run is available at\n\n. https://builds.apache.org/job/PreCommit-OOZIE-Build/1291/\n\n","updateAuthor":{"self":"https://issues.apache.org/jira/rest/api/2/user?username=hadoopqa","name":"hadoopqa","key":"hadoopqa","avatarUrls":{"48x48":"https://issues.apache.org/jira/secure/useravatar?ownerId=hadoopqa&avatarId=10393","24x24":"https://issues.apache.org/jira/secure/useravatar?size=small&ownerId=hadoopqa&avatarId=10393","16x16":"https://issues.apache.org/jira/secure/useravatar?size=xsmall&ownerId=hadoopqa&avatarId=10393","32x32":"https://issues.apache.org/jira/secure/useravatar?size=medium&ownerId=hadoopqa&avatarId=10393"},"displayName":"Hadoop QA","active":true,"timeZone":"Etc/UTC"},"created":"2020-01-22T15:50:13.760+0000","updated":"2020-01-22T15:50:13.760+0000"}
test-patch exit code: 1
Build step 'Execute shell' marked build as failure
[description-setter] Description set: OOZIE-3569
Archiving artifacts
Recording test results
ERROR: Step ?Publish JUnit test result report? failed: No test report files were found. Configuration error?
Email was triggered for: Failure - Any
Sending email for trigger: Failure - Any
###################################################################################
############################## FAILED TESTS (if any) ##############################
No tests ran.
Failed: OOZIE-3305 PreCommit Build #1290
Posted by Apache Jenkins Server <je...@builds.apache.org>.
Jira: https://issues.apache.org/jira/browse/OOZIE-3305
Build: https://builds.apache.org/job/PreCommit-OOZIE-Build/1290/
###################################################################################
########################## LAST 100 LINES OF THE CONSOLE ###########################
[...truncated 899.97 KB...]
[ERROR] /home/jenkins/jenkins-slave/workspace/PreCommit-OOZIE-Build/server/src/main/java/org/apache/oozie/server/guice/JspHandlerProvider.java:-1: Prefer javax.inject.Provider
[ERROR] /home/jenkins/jenkins-slave/workspace/PreCommit-OOZIE-Build/server/src/main/java/org/apache/oozie/server/guice/ServicesProvider.java:-1: Prefer javax.inject.Provider
[ERROR] /home/jenkins/jenkins-slave/workspace/PreCommit-OOZIE-Build/server/src/main/java/org/apache/oozie/server/guice/ConstraintSecurityHandlerProvider.java:-1: Prefer javax.inject.Provider
[ERROR] /home/jenkins/jenkins-slave/workspace/PreCommit-OOZIE-Build/server/src/main/java/org/apache/oozie/server/guice/JettyServerProvider.java:-1: Prefer javax.inject.Provider
[INFO]
[INFO] -------------------< org.apache.oozie:oozie-distro >--------------------
[INFO] Building Apache Oozie Distro 5.3.0-SNAPSHOT [24/25]
[INFO] --------------------------------[ jar ]---------------------------------
[INFO]
[INFO] --- maven-clean-plugin:3.0.0:clean (default-clean) @ oozie-distro ---
[INFO] Deleting /home/jenkins/jenkins-slave/workspace/PreCommit-OOZIE-Build/distro/target
[INFO]
[INFO] --- maven-remote-resources-plugin:1.5:process (process-resource-bundles) @ oozie-distro ---
[INFO]
[INFO] --- maven-resources-plugin:3.0.2:resources (default-resources) @ oozie-distro ---
[INFO] Using 'UTF-8' encoding to copy filtered resources.
[INFO] skip non existing resourceDirectory /home/jenkins/jenkins-slave/workspace/PreCommit-OOZIE-Build/distro/src/main/resources
[INFO] Copying 3 resources
[INFO]
[INFO] --- maven-compiler-plugin:3.7.0:compile (default-compile) @ oozie-distro ---
[INFO] No sources to compile
[INFO]
[INFO] --- modernizer-maven-plugin:1.8.0:modernizer (default-cli) @ oozie-distro ---
[INFO]
[INFO] ----------< org.apache.oozie:oozie-zookeeper-security-tests >-----------
[INFO] Building Apache Oozie ZooKeeper Security Tests 5.3.0-SNAPSHOT [25/25]
[INFO] --------------------------------[ jar ]---------------------------------
[INFO]
[INFO] --- maven-clean-plugin:3.0.0:clean (default-clean) @ oozie-zookeeper-security-tests ---
[INFO] Deleting /home/jenkins/jenkins-slave/workspace/PreCommit-OOZIE-Build/zookeeper-security-tests/target
[INFO]
[INFO] --- maven-remote-resources-plugin:1.5:process (process-resource-bundles) @ oozie-zookeeper-security-tests ---
[INFO]
[INFO] --- maven-resources-plugin:3.0.2:resources (default-resources) @ oozie-zookeeper-security-tests ---
[INFO] Using 'UTF-8' encoding to copy filtered resources.
[INFO] skip non existing resourceDirectory /home/jenkins/jenkins-slave/workspace/PreCommit-OOZIE-Build/zookeeper-security-tests/src/main/resources
[INFO] Copying 3 resources
[INFO]
[INFO] --- maven-compiler-plugin:3.7.0:compile (default-compile) @ oozie-zookeeper-security-tests ---
[INFO] No sources to compile
[INFO]
[INFO] --- modernizer-maven-plugin:1.8.0:modernizer (default-cli) @ oozie-zookeeper-security-tests ---
[INFO] ------------------------------------------------------------------------
[INFO] Reactor Summary for Apache Oozie Main 5.3.0-SNAPSHOT:
[INFO]
[INFO] Apache Oozie Main .................................. SUCCESS [ 0.937 s]
[INFO] Apache Oozie Fluent Job ............................ SUCCESS [ 0.076 s]
[INFO] Apache Oozie Fluent Job API ........................ SUCCESS [ 6.745 s]
[INFO] Apache Oozie Client ................................ SUCCESS [ 1.762 s]
[INFO] Apache Oozie Share Lib Oozie ....................... SUCCESS [ 1.356 s]
[INFO] Apache Oozie Share Lib HCatalog .................... SUCCESS [ 0.982 s]
[INFO] Apache Oozie Share Lib Distcp ...................... SUCCESS [ 0.252 s]
[INFO] Apache Oozie Core .................................. SUCCESS [ 7.881 s]
[INFO] Apache Oozie Share Lib Streaming ................... SUCCESS [ 1.698 s]
[INFO] Apache Oozie Share Lib Pig ......................... SUCCESS [ 1.214 s]
[INFO] Apache Oozie Share Lib Git ......................... SUCCESS [ 1.755 s]
[INFO] Apache Oozie Share Lib Hive ........................ SUCCESS [ 0.953 s]
[INFO] Apache Oozie Share Lib Hive 2 ...................... SUCCESS [ 1.534 s]
[INFO] Apache Oozie Share Lib Sqoop ....................... SUCCESS [ 1.601 s]
[INFO] Apache Oozie Examples .............................. SUCCESS [ 1.602 s]
[INFO] Apache Oozie Share Lib Spark ....................... SUCCESS [ 2.375 s]
[INFO] Apache Oozie Share Lib ............................. SUCCESS [ 0.019 s]
[INFO] Apache Oozie Docs .................................. SUCCESS [ 0.035 s]
[INFO] Apache Oozie WebApp ................................ SUCCESS [ 2.034 s]
[INFO] Apache Oozie Tools ................................. SUCCESS [ 1.327 s]
[INFO] Apache Oozie MiniOozie ............................. SUCCESS [ 1.224 s]
[INFO] Apache Oozie Fluent Job Client ..................... SUCCESS [ 0.635 s]
[INFO] Apache Oozie Server ................................ SUCCESS [ 2.022 s]
[INFO] Apache Oozie Distro ................................ SUCCESS [ 1.521 s]
[INFO] Apache Oozie ZooKeeper Security Tests .............. SUCCESS [ 1.673 s]
[INFO] ------------------------------------------------------------------------
[INFO] BUILD SUCCESS
[INFO] ------------------------------------------------------------------------
[INFO] Total time: 44.792 s
[INFO] Finished at: 2020-01-18T03:58:47Z
[INFO] ------------------------------------------------------------------------
EXITVALUE 0
[TRACE] Modernizer output in HEAD verified and saved
Applying patch
error: unrecognized input
error: unrecognized input
Patch failed to apply to head of branch
Adding comment to JIRA
% Total % Received % Xferd Average Speed Time Time Time Current
Dload Upload Total Spent Left Speed
0 0 0 0 0 0 0 0 --:--:-- --:--:-- --:--:-- 0 0 0 0 0 0 0 0 0 --:--:-- --:--:-- --:--:-- 0100 199 0 0 100 199 0 133 0:00:01 0:00:01 --:--:-- 133100 1774 0 1575 100 199 907 114 0:00:01 0:00:01 --:--:-- 1021
{"self":"https://issues.apache.org/jira/rest/api/2/issue/13172659/comment/17018490","id":"17018490","author":{"self":"https://issues.apache.org/jira/rest/api/2/user?username=hadoopqa","name":"hadoopqa","key":"hadoopqa","avatarUrls":{"48x48":"https://issues.apache.org/jira/secure/useravatar?ownerId=hadoopqa&avatarId=10393","24x24":"https://issues.apache.org/jira/secure/useravatar?size=small&ownerId=hadoopqa&avatarId=10393","16x16":"https://issues.apache.org/jira/secure/useravatar?size=xsmall&ownerId=hadoopqa&avatarId=10393","32x32":"https://issues.apache.org/jira/secure/useravatar?size=medium&ownerId=hadoopqa&avatarId=10393"},"displayName":"Hadoop QA","active":true,"timeZone":"Etc/UTC"},"body":"\nTesting JIRA OOZIE-3305\n\nCleaning local git workspace\n\n----------------------------\n\n{color:red}-1{color} Patch failed to apply to head of branch\n\n----------------------------\n","updateAuthor":{"self":"https://issues.apache.org/jira/rest/api/2/user?username=hadoopqa","name":"hadoopqa","key":"hadoopqa","avatarUrls":{"48x48":"https://issues.apache.org/jira/secure/useravatar?ownerId=hadoopqa&avatarId=10393","24x24":"https://issues.apache.org/jira/secure/useravatar?size=small&ownerId=hadoopqa&avatarId=10393","16x16":"https://issues.apache.org/jira/secure/useravatar?size=xsmall&ownerId=hadoopqa&avatarId=10393","32x32":"https://issues.apache.org/jira/secure/useravatar?size=medium&ownerId=hadoopqa&avatarId=10393"},"displayName":"Hadoop QA","active":true,"timeZone":"Etc/UTC"},"created":"2020-01-18T03:58:48.745+0000","updated":"2020-01-18T03:58:48.745+0000"}
test-patch exit code: 1
Build step 'Execute shell' marked build as failure
[description-setter] Description set: OOZIE-3305
Archiving artifacts
Recording test results
ERROR: Step ?Publish JUnit test result report? failed: No test report files were found. Configuration error?
Email was triggered for: Failure - Any
Sending email for trigger: Failure - Any
###################################################################################
############################## FAILED TESTS (if any) ##############################
No tests ran.
Failed: OOZIE-3305 PreCommit Build #1289
Posted by Apache Jenkins Server <je...@builds.apache.org>.
Jira: https://issues.apache.org/jira/browse/OOZIE-3305
Build: https://builds.apache.org/job/PreCommit-OOZIE-Build/1289/
###################################################################################
########################## LAST 100 LINES OF THE CONSOLE ###########################
[...truncated 900.90 KB...]
[ERROR] /home/jenkins/jenkins-slave/workspace/PreCommit-OOZIE-Build/server/src/main/java/org/apache/oozie/server/guice/JspHandlerProvider.java:-1: Prefer javax.inject.Provider
[ERROR] /home/jenkins/jenkins-slave/workspace/PreCommit-OOZIE-Build/server/src/main/java/org/apache/oozie/server/guice/ServicesProvider.java:-1: Prefer javax.inject.Provider
[ERROR] /home/jenkins/jenkins-slave/workspace/PreCommit-OOZIE-Build/server/src/main/java/org/apache/oozie/server/guice/ConstraintSecurityHandlerProvider.java:-1: Prefer javax.inject.Provider
[ERROR] /home/jenkins/jenkins-slave/workspace/PreCommit-OOZIE-Build/server/src/main/java/org/apache/oozie/server/guice/JettyServerProvider.java:-1: Prefer javax.inject.Provider
[INFO]
[INFO] -------------------< org.apache.oozie:oozie-distro >--------------------
[INFO] Building Apache Oozie Distro 5.3.0-SNAPSHOT [24/25]
[INFO] --------------------------------[ jar ]---------------------------------
[INFO]
[INFO] --- maven-clean-plugin:3.0.0:clean (default-clean) @ oozie-distro ---
[INFO] Deleting /home/jenkins/jenkins-slave/workspace/PreCommit-OOZIE-Build/distro/target
[INFO]
[INFO] --- maven-remote-resources-plugin:1.5:process (process-resource-bundles) @ oozie-distro ---
[INFO]
[INFO] --- maven-resources-plugin:3.0.2:resources (default-resources) @ oozie-distro ---
[INFO] Using 'UTF-8' encoding to copy filtered resources.
[INFO] skip non existing resourceDirectory /home/jenkins/jenkins-slave/workspace/PreCommit-OOZIE-Build/distro/src/main/resources
[INFO] Copying 3 resources
[INFO]
[INFO] --- maven-compiler-plugin:3.7.0:compile (default-compile) @ oozie-distro ---
[INFO] No sources to compile
[INFO]
[INFO] --- modernizer-maven-plugin:1.8.0:modernizer (default-cli) @ oozie-distro ---
[INFO]
[INFO] ----------< org.apache.oozie:oozie-zookeeper-security-tests >-----------
[INFO] Building Apache Oozie ZooKeeper Security Tests 5.3.0-SNAPSHOT [25/25]
[INFO] --------------------------------[ jar ]---------------------------------
[INFO]
[INFO] --- maven-clean-plugin:3.0.0:clean (default-clean) @ oozie-zookeeper-security-tests ---
[INFO] Deleting /home/jenkins/jenkins-slave/workspace/PreCommit-OOZIE-Build/zookeeper-security-tests/target
[INFO]
[INFO] --- maven-remote-resources-plugin:1.5:process (process-resource-bundles) @ oozie-zookeeper-security-tests ---
[INFO]
[INFO] --- maven-resources-plugin:3.0.2:resources (default-resources) @ oozie-zookeeper-security-tests ---
[INFO] Using 'UTF-8' encoding to copy filtered resources.
[INFO] skip non existing resourceDirectory /home/jenkins/jenkins-slave/workspace/PreCommit-OOZIE-Build/zookeeper-security-tests/src/main/resources
[INFO] Copying 3 resources
[INFO]
[INFO] --- maven-compiler-plugin:3.7.0:compile (default-compile) @ oozie-zookeeper-security-tests ---
[INFO] No sources to compile
[INFO]
[INFO] --- modernizer-maven-plugin:1.8.0:modernizer (default-cli) @ oozie-zookeeper-security-tests ---
[INFO] ------------------------------------------------------------------------
[INFO] Reactor Summary for Apache Oozie Main 5.3.0-SNAPSHOT:
[INFO]
[INFO] Apache Oozie Main .................................. SUCCESS [ 0.853 s]
[INFO] Apache Oozie Fluent Job ............................ SUCCESS [ 0.074 s]
[INFO] Apache Oozie Fluent Job API ........................ SUCCESS [ 6.974 s]
[INFO] Apache Oozie Client ................................ SUCCESS [ 1.707 s]
[INFO] Apache Oozie Share Lib Oozie ....................... SUCCESS [ 1.369 s]
[INFO] Apache Oozie Share Lib HCatalog .................... SUCCESS [ 1.305 s]
[INFO] Apache Oozie Share Lib Distcp ...................... SUCCESS [ 0.378 s]
[INFO] Apache Oozie Core .................................. SUCCESS [ 8.867 s]
[INFO] Apache Oozie Share Lib Streaming ................... SUCCESS [ 1.873 s]
[INFO] Apache Oozie Share Lib Pig ......................... SUCCESS [ 1.164 s]
[INFO] Apache Oozie Share Lib Git ......................... SUCCESS [ 1.688 s]
[INFO] Apache Oozie Share Lib Hive ........................ SUCCESS [ 0.913 s]
[INFO] Apache Oozie Share Lib Hive 2 ...................... SUCCESS [ 1.482 s]
[INFO] Apache Oozie Share Lib Sqoop ....................... SUCCESS [ 1.549 s]
[INFO] Apache Oozie Examples .............................. SUCCESS [ 1.625 s]
[INFO] Apache Oozie Share Lib Spark ....................... SUCCESS [ 2.417 s]
[INFO] Apache Oozie Share Lib ............................. SUCCESS [ 0.016 s]
[INFO] Apache Oozie Docs .................................. SUCCESS [ 0.034 s]
[INFO] Apache Oozie WebApp ................................ SUCCESS [ 1.872 s]
[INFO] Apache Oozie Tools ................................. SUCCESS [ 1.264 s]
[INFO] Apache Oozie MiniOozie ............................. SUCCESS [ 1.378 s]
[INFO] Apache Oozie Fluent Job Client ..................... SUCCESS [ 1.077 s]
[INFO] Apache Oozie Server ................................ SUCCESS [ 2.121 s]
[INFO] Apache Oozie Distro ................................ SUCCESS [ 1.569 s]
[INFO] Apache Oozie ZooKeeper Security Tests .............. SUCCESS [ 1.681 s]
[INFO] ------------------------------------------------------------------------
[INFO] BUILD SUCCESS
[INFO] ------------------------------------------------------------------------
[INFO] Total time: 46.833 s
[INFO] Finished at: 2020-01-18T03:38:49Z
[INFO] ------------------------------------------------------------------------
EXITVALUE 0
[TRACE] Modernizer output in HEAD verified and saved
Applying patch
error: unrecognized input
error: unrecognized input
Patch failed to apply to head of branch
Adding comment to JIRA
% Total % Received % Xferd Average Speed Time Time Time Current
Dload Upload Total Spent Left Speed
0 0 0 0 0 0 0 0 --:--:-- --:--:-- --:--:-- 0100 199 0 0 100 199 0 133 0:00:01 0:00:01 --:--:-- 133100 1774 0 1575 100 199 901 113 0:00:01 0:00:01 --:--:-- 1015
{"self":"https://issues.apache.org/jira/rest/api/2/issue/13172659/comment/17018486","id":"17018486","author":{"self":"https://issues.apache.org/jira/rest/api/2/user?username=hadoopqa","name":"hadoopqa","key":"hadoopqa","avatarUrls":{"48x48":"https://issues.apache.org/jira/secure/useravatar?ownerId=hadoopqa&avatarId=10393","24x24":"https://issues.apache.org/jira/secure/useravatar?size=small&ownerId=hadoopqa&avatarId=10393","16x16":"https://issues.apache.org/jira/secure/useravatar?size=xsmall&ownerId=hadoopqa&avatarId=10393","32x32":"https://issues.apache.org/jira/secure/useravatar?size=medium&ownerId=hadoopqa&avatarId=10393"},"displayName":"Hadoop QA","active":true,"timeZone":"Etc/UTC"},"body":"\nTesting JIRA OOZIE-3305\n\nCleaning local git workspace\n\n----------------------------\n\n{color:red}-1{color} Patch failed to apply to head of branch\n\n----------------------------\n","updateAuthor":{"self":"https://issues.apache.org/jira/rest/api/2/user?username=hadoopqa","name":"hadoopqa","key":"hadoopqa","avatarUrls":{"48x48":"https://issues.apache.org/jira/secure/useravatar?ownerId=hadoopqa&avatarId=10393","24x24":"https://issues.apache.org/jira/secure/useravatar?size=small&ownerId=hadoopqa&avatarId=10393","16x16":"https://issues.apache.org/jira/secure/useravatar?size=xsmall&ownerId=hadoopqa&avatarId=10393","32x32":"https://issues.apache.org/jira/secure/useravatar?size=medium&ownerId=hadoopqa&avatarId=10393"},"displayName":"Hadoop QA","active":true,"timeZone":"Etc/UTC"},"created":"2020-01-18T03:38:51.133+0000","updated":"2020-01-18T03:38:51.133+0000"}
test-patch exit code: 1
Build step 'Execute shell' marked build as failure
[description-setter] Description set: OOZIE-3305
Archiving artifacts
Recording test results
ERROR: Step ?Publish JUnit test result report? failed: No test report files were found. Configuration error?
Email was triggered for: Failure - Any
Sending email for trigger: Failure - Any
###################################################################################
############################## FAILED TESTS (if any) ##############################
No tests ran.
Failed: OOZIE-3575 PreCommit Build #1288
Posted by Apache Jenkins Server <je...@builds.apache.org>.
Jira: https://issues.apache.org/jira/browse/OOZIE-3575
Build: https://builds.apache.org/job/PreCommit-OOZIE-Build/1288/
###################################################################################
########################## LAST 100 LINES OF THE CONSOLE ###########################
[...truncated 2.16 MB...]
[TRACE] File [/home/jenkins/jenkins-slave/workspace/PreCommit-OOZIE-Build/test-patch/tmp/SPOTBUGS_DIFF/diff/findbugs-diff-0.1.0-all.jar] removed
[TRACE] File [/home/jenkins/jenkins-slave/workspace/PreCommit-OOZIE-Build/test-patch/tmp/SPOTBUGS_DIFF/diff/findbugs-diff-0.1.0-all.jar.md5] removed
Running test-patch task BACKWARDS_COMPATIBILITY
Running test-patch task TESTS
Running test-patch task DISTRO
Running test-patch task MODERNIZER
Running modernizer op=report
[TRACE] grep -c '.*ERROR.*Prefer' /home/jenkins/jenkins-slave/workspace/PreCommit-OOZIE-Build/test-patch/reports/MODERNIZER-clean.txt
[TRACE] Modernizer errors before patch: 51
[TRACE] grep -c '.*ERROR.*Prefer' /home/jenkins/jenkins-slave/workspace/PreCommit-OOZIE-Build/test-patch/reports/MODERNIZER-patch.txt
[TRACE] Modernizer errors after patch: 51
Testing JIRA OOZIE-3575
Cleaning local git workspace
----------------------------
+1 PATCH_APPLIES
+1 CLEAN
+1 RAW_PATCH_ANALYSIS
+1 the patch does not introduce any @author tags
+1 the patch does not introduce any tabs
+1 the patch does not introduce any trailing spaces
+1 the patch does not introduce any star imports
+1 the patch does not introduce any line longer than 132
+1 the patch adds/modifies 1 testcase(s)
+1 RAT
+1 the patch does not seem to introduce new RAT warnings
+1 JAVADOC
+1 Javadoc generation succeeded with the patch
+1 the patch does not seem to introduce new Javadoc warning(s)
+1 COMPILE
+1 HEAD compiles
+1 patch compiles
+1 the patch does not seem to introduce new javac warnings
-1 There are [5] new bugs found below threshold in total that must be fixed.
+1 There are no new bugs found in [tools].
-1 There are [5] new bugs found below threshold in [core] that must be fixed.
You can find the SpotBugs diff here (look for the red and orange ones): core/findbugs-new.html
The most important SpotBugs errors are:
At BulkJPAExecutor.java:[line 206]: This use of javax/persistence/EntityManager.createQuery(Ljava/lang/String;)Ljavax/persistence/Query; can be vulnerable to SQL/JPQL injection
At BulkJPAExecutor.java:[line 176]: At BulkJPAExecutor.java:[line 175]
At BulkJPAExecutor.java:[line 205]: At BulkJPAExecutor.java:[line 199]
This use of javax/persistence/EntityManager.createQuery(Ljava/lang/String;)Ljavax/persistence/Query; can be vulnerable to SQL/JPQL injection: At BulkJPAExecutor.java:[line 206]
At BulkJPAExecutor.java:[line 111]: At BulkJPAExecutor.java:[line 127]
+1 There are no new bugs found in [examples].
+1 There are no new bugs found in [webapp].
+1 There are no new bugs found in [sharelib/hive2].
+1 There are no new bugs found in [sharelib/distcp].
+1 There are no new bugs found in [sharelib/streaming].
+1 There are no new bugs found in [sharelib/hcatalog].
+1 There are no new bugs found in [sharelib/spark].
+1 There are no new bugs found in [sharelib/hive].
+1 There are no new bugs found in [sharelib/git].
+1 There are no new bugs found in [sharelib/sqoop].
+1 There are no new bugs found in [sharelib/oozie].
+1 There are no new bugs found in [sharelib/pig].
+1 There are no new bugs found in [fluent-job/fluent-job-api].
+1 There are no new bugs found in [client].
+1 There are no new bugs found in [server].
+1 There are no new bugs found in [docs].
+1 BACKWARDS_COMPATIBILITY
+1 the patch does not change any JPA Entity/Colum/Basic/Lob/Transient annotations
+1 the patch does not modify JPA files
+1 TESTS
Tests run: 3206
Tests failed at first run:
TestCoordActionsKillXCommand#testActionKillCommandDate
TestCoordChangeXCommand#testCoord_throwException
TestBlockingInputStream#testFastWritingBlockingInputStream
For the complete list of flaky tests, see TEST-SUMMARY-FULL files.
+1 DISTRO
+1 distro tarball builds with the patch
+1 MODERNIZER
----------------------------
-1 Overall result, please check the reported -1(s)
The full output of the test-patch run is available at
https://builds.apache.org/job/PreCommit-OOZIE-Build/1288/
Adding comment to JIRA
% Total % Received % Xferd Average Speed Time Time Time Current
Dload Upload Total Spent Left Speed
0 0 0 0 0 0 0 0 --:--:-- --:--:-- --:--:-- 0 0 0 0 0 0 0 0 0 --:--:-- --:--:-- --:--:-- 0100 4330 0 0 100 4330 0 2902 0:00:01 0:00:01 --:--:-- 2900{"self":"https://issues.apache.org/jira/rest/api/2/issue/13275707/comment/17014436","id":"17014436","author":{"self":"https://issues.apache.org/jira/rest/api/2/user?username=hadoopqa","name":"hadoopqa","key":"hadoopqa","avatarUrls":{"48x48":"https://issues.apache.org/jira/secure/useravatar?ownerId=hadoopqa&avatarId=10393","24x24":"https://issues.apache.org/jira/secure/useravatar?size=small&ownerId=hadoopqa&avatarId=10393","16x16":"https://issues.apache.org/jira/secure/useravatar?size=xsmall&ownerId=hadoopqa&avatarId=10393","32x32":"https://issues.apache.org/jira/secure/useravatar?size=medium&ownerId=hadoopqa&avatarId=10393"},"displayName":"Hadoop QA","active":true,"timeZone":"Etc/UTC"},"body":"\nTesting JIRA OOZIE-3575\n\nCleaning local git workspace\n\n----------------------------\n\n{color:green}+1 PATCH_APPLIES{color}\n{color:green}+1 CLEAN{color}\n{color:green}+1 RAW_PATCH_ANALYSIS{color}\n. {color:green}+1{color} the patch does not introduce any @author tags\n. {color:green}+1{color} the patch does not introduce any tabs\n. {color:green}+1{color} the patch does not introduce any trailing spaces\n. {color:green}+1{color} the patch does not introduce any star imports\n. {color:green}+1{color} the patch does not introduce any line longer than 132\n. {color:green}+1{color} the patch adds/modifies 1 testcase(s)\n{color:green}+1 RAT{color}\n. {color:green}+1{color} the patch does not seem to introduce new RAT warnings\n{color:green}+1 JAVADOC{color}\n. {color:green}+1{color} Javadoc generation succeeded with the patch\n. {color:green}+1{color} the patch does not seem to introduce new Javadoc warning(s)\n{color:green}+1 COMPILE{color}\n. {color:green}+1{color} HEAD compiles\n. {color:green}+1{color} patch compiles\n. {color:green}+1{color} the patch does not seem to introduce new javac warnings\n{color:red}-1{color} There are [5] new bugs found below threshold in total that must be fixed.\n. {color:green}+1{color} There are no new bugs found in [tools].\n. {color:red}-1{color} There are [5] new bugs found below threshold in [core] that must be fixed.\n. You can find the SpotBugs diff here (look for the red and orange ones): core/findbugs-new.html\n. The most important SpotBugs errors are:\n. At BulkJPAExecutor.java:[line 206]: This use of javax/persistence/EntityManager.createQuery(Ljava/lang/String;)Ljavax/persistence/Query; can be vulnerable to SQL/JPQL injection\n. At BulkJPAExecutor.java:[line 176]: At BulkJPAExecutor.java:[line 175]\n. At BulkJPAExecutor.java:[line 205]: At BulkJPAExecutor.java:[line 199]\n. This use of javax/persistence/EntityManager.createQuery(Ljava/lang/String;)Ljavax/persistence/Query; can be vulnerable to SQL/JPQL injection: At BulkJPAExecutor.java:[line 206]\n. At BulkJPAExecutor.java:[line 111]: At BulkJPAExecutor.java:[line 127]\n. {color:green}+1{color} There are no new bugs found in [examples].\n. {color:green}+1{color} There are no new bugs found in [webapp].\n. {color:green}+1{color} There are no new bugs found in [sharelib/hive2].\n. {color:green}+1{color} There are no new bugs found in [sharelib/distcp].\n. {color:green}+1{color} There are no new bugs found in [sharelib/streaming].\n. {color:green}+1{color} There are no new bugs found in [sharelib/hcatalog].\n. {color:green}+1{color} There are no new bugs found in [sharelib/spark].\n. {color:green}+1{color} There are no new bugs found in [sharelib/hive].\n. {color:green}+1{color} There are no new bugs found in [sharelib/git].\n. {color:green}+1{color} There are no new bugs found in [sharelib/sqoop].\n. {color:green}+1{color} There are no new bugs found in [sharelib/oozie].\n. {color:green}+1{color} There are no new bugs found in [sharelib/pig].\n. {color:green}+1{color} There are no new bugs found in [fluent-job/fluent-job-api].\n. {color:green}+1{color} There are no new bugs found in [client].\n. {color:green}+1{color} There are no new bugs found in [server].\n. {color:green}+1{color} There are no new bugs found in [docs].\n{c100 10036 0 5706 100 4330 3307 2510 0:00:01 0:00:01 --:--:-- 5817
olor:green}+1 BACKWARDS_COMPATIBILITY{color}\n. {color:green}+1{color} the patch does not change any JPA Entity/Colum/Basic/Lob/Transient annotations\n. {color:green}+1{color} the patch does not modify JPA files\n{color:green}+1 TESTS{color}\n. Tests run: 3206\n. {color:orange}Tests failed at first run:{color}\nTestCoordActionsKillXCommand#testActionKillCommandDate\nTestCoordChangeXCommand#testCoord_throwException\nTestBlockingInputStream#testFastWritingBlockingInputStream\n. For the complete list of flaky tests, see TEST-SUMMARY-FULL files.\n{color:green}+1 DISTRO{color}\n. {color:green}+1{color} distro tarball builds with the patch \n{color:green}+1 MODERNIZER{color}\n\n----------------------------\n{color:red}*-1 Overall result, please check the reported -1(s)*{color}\n\n\nThe full output of the test-patch run is available at\n\n. https://builds.apache.org/job/PreCommit-OOZIE-Build/1288/\n\n","updateAuthor":{"self":"https://issues.apache.org/jira/rest/api/2/user?username=hadoopqa","name":"hadoopqa","key":"hadoopqa","avatarUrls":{"48x48":"https://issues.apache.org/jira/secure/useravatar?ownerId=hadoopqa&avatarId=10393","24x24":"https://issues.apache.org/jira/secure/useravatar?size=small&ownerId=hadoopqa&avatarId=10393","16x16":"https://issues.apache.org/jira/secure/useravatar?size=xsmall&ownerId=hadoopqa&avatarId=10393","32x32":"https://issues.apache.org/jira/secure/useravatar?size=medium&ownerId=hadoopqa&avatarId=10393"},"displayName":"Hadoop QA","active":true,"timeZone":"Etc/UTC"},"created":"2020-01-13T16:05:17.437+0000","updated":"2020-01-13T16:05:17.437+0000"}
test-patch exit code: 1
Build step 'Execute shell' marked build as failure
[description-setter] Description set: OOZIE-3575
Archiving artifacts
Recording test results
ERROR: Step ?Publish JUnit test result report? failed: No test report files were found. Configuration error?
Email was triggered for: Failure - Any
Sending email for trigger: Failure - Any
###################################################################################
############################## FAILED TESTS (if any) ##############################
No tests ran.
Failed: OOZIE-3575 PreCommit Build #1287
Posted by Apache Jenkins Server <je...@builds.apache.org>.
Jira: https://issues.apache.org/jira/browse/OOZIE-3575
Build: https://builds.apache.org/job/PreCommit-OOZIE-Build/1287/
###################################################################################
########################## LAST 100 LINES OF THE CONSOLE ###########################
[...truncated 2.16 MB...]
Running test-patch task BACKWARDS_COMPATIBILITY
Running test-patch task TESTS
Running test-patch task DISTRO
Running test-patch task MODERNIZER
Running modernizer op=report
[TRACE] grep -c '.*ERROR.*Prefer' /home/jenkins/jenkins-slave/workspace/PreCommit-OOZIE-Build/test-patch/reports/MODERNIZER-clean.txt
[TRACE] Modernizer errors before patch: 51
[TRACE] grep -c '.*ERROR.*Prefer' /home/jenkins/jenkins-slave/workspace/PreCommit-OOZIE-Build/test-patch/reports/MODERNIZER-patch.txt
[TRACE] Modernizer errors after patch: 51
Testing JIRA OOZIE-3575
Cleaning local git workspace
----------------------------
+1 PATCH_APPLIES
+1 CLEAN
+1 RAW_PATCH_ANALYSIS
+1 the patch does not introduce any @author tags
+1 the patch does not introduce any tabs
+1 the patch does not introduce any trailing spaces
+1 the patch does not introduce any star imports
+1 the patch does not introduce any line longer than 132
+1 the patch adds/modifies 1 testcase(s)
+1 RAT
+1 the patch does not seem to introduce new RAT warnings
+1 JAVADOC
+1 Javadoc generation succeeded with the patch
+1 the patch does not seem to introduce new Javadoc warning(s)
+1 COMPILE
+1 HEAD compiles
+1 patch compiles
+1 the patch does not seem to introduce new javac warnings
-1 There are [5] new bugs found below threshold in total that must be fixed.
+1 There are no new bugs found in [fluent-job/fluent-job-api].
+1 There are no new bugs found in [docs].
-1 There are [5] new bugs found below threshold in [core] that must be fixed.
You can find the SpotBugs diff here (look for the red and orange ones): core/findbugs-new.html
The most important SpotBugs errors are:
At BulkJPAExecutor.java:[line 206]: This use of javax/persistence/EntityManager.createQuery(Ljava/lang/String;)Ljavax/persistence/Query; can be vulnerable to SQL/JPQL injection
At BulkJPAExecutor.java:[line 176]: At BulkJPAExecutor.java:[line 175]
At BulkJPAExecutor.java:[line 205]: At BulkJPAExecutor.java:[line 199]
This use of javax/persistence/EntityManager.createQuery(Ljava/lang/String;)Ljavax/persistence/Query; can be vulnerable to SQL/JPQL injection: At BulkJPAExecutor.java:[line 206]
At BulkJPAExecutor.java:[line 111]: At BulkJPAExecutor.java:[line 127]
+1 There are no new bugs found in [sharelib/spark].
+1 There are no new bugs found in [sharelib/git].
+1 There are no new bugs found in [sharelib/sqoop].
+1 There are no new bugs found in [sharelib/hive2].
+1 There are no new bugs found in [sharelib/streaming].
+1 There are no new bugs found in [sharelib/pig].
+1 There are no new bugs found in [sharelib/oozie].
+1 There are no new bugs found in [sharelib/hive].
+1 There are no new bugs found in [sharelib/hcatalog].
+1 There are no new bugs found in [sharelib/distcp].
+1 There are no new bugs found in [tools].
+1 There are no new bugs found in [server].
+1 There are no new bugs found in [client].
+1 There are no new bugs found in [examples].
+1 There are no new bugs found in [webapp].
+1 BACKWARDS_COMPATIBILITY
+1 the patch does not change any JPA Entity/Colum/Basic/Lob/Transient annotations
+1 the patch does not modify JPA files
+1 TESTS
Tests run: 3206
Tests failed at first run:
127362-[WARNING]
TestCredentials#testThrowErrorWhenMissingFileSystemPathProperty
TestCredentials#testThrowErrorWhenMissingFileSystemPathProperty
TestBlockingInputStream#testLimitedWritingBlockingInputStream
TestPriorityDelayQueue#testPeek
For the complete list of flaky tests, see TEST-SUMMARY-FULL files.
+1 DISTRO
+1 distro tarball builds with the patch
+1 MODERNIZER
----------------------------
-1 Overall result, please check the reported -1(s)
The full output of the test-patch run is available at
https://builds.apache.org/job/PreCommit-OOZIE-Build/1287/
Adding comment to JIRA
% Total % Received % Xferd Average Speed Time Time Time Current
Dload Upload Total Spent Left Speed
0 0 0 0 0 0 0 0 --:--:-- --:--:-- --:--:-- 0 0 4408 0 0 0 0 0 0 --:--:-- --:--:-- --:--:-- 0100 4408 0 0 100 4408 0 2702 0:00:01 0:00:01 --:--:-- 2700{"self":"https://issues.apache.org/jira/rest/api/2/issue/13275707/comment/17014296","id":"17014296","author":{"self":"https://issues.apache.org/jira/rest/api/2/user?username=hadoopqa","name":"hadoopqa","key":"hadoopqa","avatarUrls":{"48x48":"https://issues.apache.org/jira/secure/useravatar?ownerId=hadoopqa&avatarId=10393","24x24":"https://issues.apache.org/jira/secure/useravatar?size=small&ownerId=hadoopqa&avatarId=10393","16x16":"https://issues.apache.org/jira/secure/useravatar?size=xsmall&ownerId=hadoopqa&avatarId=10393","32x32":"https://issues.apache.org/jira/secure/useravatar?size=medium&ownerId=hadoopqa&avatarId=10393"},"displayName":"Hadoop QA","active":true,"timeZone":"Etc/UTC"},"body":"\nTesting JIRA OOZIE-3575\n\nCleaning local git workspace\n\n----------------------------\n\n{color:green}+1 PATCH_APPLIES{color}\n{color:green}+1 CLEAN{color}\n{color:green}+1 RAW_PATCH_ANALYSIS{color}\n. {color:green}+1{color} the patch does not introduce any @author tags\n. {color:green}+1{color} the patch does not introduce any tabs\n. {color:green}+1{color} the patch does not introduce any trailing spaces\n. {color:green}+1{color} the patch does not introduce any star imports\n. {color:green}+1{color} the patch does not introduce any line longer than 132\n. {color:green}+1{color} the patch adds/modifies 1 testcase(s)\n{color:green}+1 RAT{color}\n. {color:green}+1{color} the patch does not seem to introduce new RAT warnings\n{color:green}+1 JAVADOC{color}\n. {color:green}+1{color} Javadoc generation succeeded with the patch\n. {color:green}+1{color} the patch does not seem to introduce new Javadoc warning(s)\n{color:green}+1 COMPILE{color}\n. {color:green}+1{color} HEAD compiles\n. {color:green}+1{color} patch compiles\n. {color:green}+1{color} the patch does not seem to introduce new javac warnings\n{color:red}-1{color} There are [5] new bugs found below threshold in total that must be fixed.\n. {color:green}+1{color} There are no new bugs found in [fluent-job/fluent-job-api].\n. {color:green}+1{color} There are no new bugs found in [docs].\n. {color:red}-1{color} There are [5] new bugs found below threshold in [core] that must be fixed.\n. You can find the SpotBugs diff here (look for the red and orange ones): core/findbugs-new.html\n. The most important SpotBugs errors are:\n. At BulkJPAExecutor.java:[line 206]: This use of javax/persistence/EntityManager.createQuery(Ljava/lang/String;)Ljavax/persistence/Query; can be vulnerable to SQL/JPQL injection\n. At BulkJPAExecutor.java:[line 176]: At BulkJPAExecutor.java:[line 175]\n. At BulkJPAExecutor.java:[line 205]: At BulkJPAExecutor.java:[line 199]\n. This use of javax/persistence/EntityManager.createQuery(Ljava/lang/String;)Ljavax/persistence/Query; can be vulnerable to SQL/JPQL injection: At BulkJPAExecutor.java:[line 206]\n. At BulkJPAExecutor.java:[line 111]: At BulkJPAExecutor.java:[line 127]\n. {color:green}+1{color} There are no new bugs found in [sharelib/spark].\n. {color:green}+1{color} There are no new bugs found in [sharelib/git].\n. {color:green}+1{color} There are no new bugs found in [sharelib/sqoop].\n. {color:green}+1{color} There are no new bugs found in [sharelib/hive2].\n. {color:green}+1{color} There are no new bugs found in [sharelib/streaming].\n. {color:green}+1{color} There are no new bugs found in [sharelib/pig].\n. {color:green}+1{color} There are no new bugs found in [sharelib/oozie].\n. {color:green}+1{color} There are no new bugs found in [sharelib/hive].\n. {color:green}+1{color} There are no new bugs found in [sharelib/hcatalog].\n. {color:green}+1{color} There are no new bugs found in [sharelib/distcp].\n. {color:green}+1{color} There are no new bugs found in [tools].\n. {color:green}+1{color} There are no new bugs found in [server].\n. {color:green}+1{color} There are no new bugs found in [client].\n. {color:green}+1{color} There are no new bugs found in [examples].\n. {color:green}+1{color} There are no new bugs found in [webapp].\n{c100 10192 0 5784 100 4408 3544 2700 0:00:01 0:00:01 --:--:-- 6245
olor:green}+1 BACKWARDS_COMPATIBILITY{color}\n. {color:green}+1{color} the patch does not change any JPA Entity/Colum/Basic/Lob/Transient annotations\n. {color:green}+1{color} the patch does not modify JPA files\n{color:green}+1 TESTS{color}\n. Tests run: 3206\n. {color:orange}Tests failed at first run:{color}\n127362-[WARNING]\nTestCredentials#testThrowErrorWhenMissingFileSystemPathProperty\nTestCredentials#testThrowErrorWhenMissingFileSystemPathProperty\nTestBlockingInputStream#testLimitedWritingBlockingInputStream\nTestPriorityDelayQueue#testPeek\n. For the complete list of flaky tests, see TEST-SUMMARY-FULL files.\n{color:green}+1 DISTRO{color}\n. {color:green}+1{color} distro tarball builds with the patch \n{color:green}+1 MODERNIZER{color}\n\n----------------------------\n{color:red}*-1 Overall result, please check the reported -1(s)*{color}\n\n\nThe full output of the test-patch run is available at\n\n. https://builds.apache.org/job/PreCommit-OOZIE-Build/1287/\n\n","updateAuthor":{"self":"https://issues.apache.org/jira/rest/api/2/user?username=hadoopqa","name":"hadoopqa","key":"hadoopqa","avatarUrls":{"48x48":"https://issues.apache.org/jira/secure/useravatar?ownerId=hadoopqa&avatarId=10393","24x24":"https://issues.apache.org/jira/secure/useravatar?size=small&ownerId=hadoopqa&avatarId=10393","16x16":"https://issues.apache.org/jira/secure/useravatar?size=xsmall&ownerId=hadoopqa&avatarId=10393","32x32":"https://issues.apache.org/jira/secure/useravatar?size=medium&ownerId=hadoopqa&avatarId=10393"},"displayName":"Hadoop QA","active":true,"timeZone":"Etc/UTC"},"created":"2020-01-13T13:02:53.398+0000","updated":"2020-01-13T13:02:53.398+0000"}
test-patch exit code: 1
Build step 'Execute shell' marked build as failure
[description-setter] Description set: OOZIE-3575
Archiving artifacts
Recording test results
ERROR: Step ?Publish JUnit test result report? failed: No test report files were found. Configuration error?
Email was triggered for: Failure - Any
Sending email for trigger: Failure - Any
###################################################################################
############################## FAILED TESTS (if any) ##############################
No tests ran.
Failed: OOZIE-3575 PreCommit Build #1286
Posted by Apache Jenkins Server <je...@builds.apache.org>.
Jira: https://issues.apache.org/jira/browse/OOZIE-3575
Build: https://builds.apache.org/job/PreCommit-OOZIE-Build/1286/
###################################################################################
########################## LAST 100 LINES OF THE CONSOLE ###########################
[...truncated 2.16 MB...]
Running modernizer op=report
[TRACE] grep -c '.*ERROR.*Prefer' /home/jenkins/jenkins-slave/workspace/PreCommit-OOZIE-Build/test-patch/reports/MODERNIZER-clean.txt
[TRACE] Modernizer errors before patch: 51
[TRACE] grep -c '.*ERROR.*Prefer' /home/jenkins/jenkins-slave/workspace/PreCommit-OOZIE-Build/test-patch/reports/MODERNIZER-patch.txt
[TRACE] Modernizer errors after patch: 51
Testing JIRA OOZIE-3575
Cleaning local git workspace
----------------------------
+1 PATCH_APPLIES
+1 CLEAN
+1 RAW_PATCH_ANALYSIS
+1 the patch does not introduce any @author tags
+1 the patch does not introduce any tabs
+1 the patch does not introduce any trailing spaces
+1 the patch does not introduce any star imports
+1 the patch does not introduce any line longer than 132
+1 the patch adds/modifies 1 testcase(s)
+1 RAT
+1 the patch does not seem to introduce new RAT warnings
+1 JAVADOC
+1 Javadoc generation succeeded with the patch
+1 the patch does not seem to introduce new Javadoc warning(s)
+1 COMPILE
+1 HEAD compiles
+1 patch compiles
+1 the patch does not seem to introduce new javac warnings
-1 There are [6] new bugs found below threshold in total that must be fixed.
+1 There are no new bugs found in [fluent-job/fluent-job-api].
+1 There are no new bugs found in [docs].
-1 There are [5] new bugs found below threshold in [core] that must be fixed.
You can find the SpotBugs diff here (look for the red and orange ones): core/findbugs-new.html
The most important SpotBugs errors are:
At BulkJPAExecutor.java:[line 206]: This use of javax/persistence/EntityManager.createQuery(Ljava/lang/String;)Ljavax/persistence/Query; can be vulnerable to SQL/JPQL injection
At BulkJPAExecutor.java:[line 176]: At BulkJPAExecutor.java:[line 175]
At BulkJPAExecutor.java:[line 205]: At BulkJPAExecutor.java:[line 199]
This use of javax/persistence/EntityManager.createQuery(Ljava/lang/String;)Ljavax/persistence/Query; can be vulnerable to SQL/JPQL injection: At BulkJPAExecutor.java:[line 206]
At BulkJPAExecutor.java:[line 111]: At BulkJPAExecutor.java:[line 127]
+1 There are no new bugs found in [sharelib/spark].
+1 There are no new bugs found in [sharelib/git].
+1 There are no new bugs found in [sharelib/sqoop].
+1 There are no new bugs found in [sharelib/hive2].
+1 There are no new bugs found in [sharelib/streaming].
+1 There are no new bugs found in [sharelib/pig].
-1 There are [1] new bugs found below threshold in [sharelib/oozie] that must be fixed.
You can find the SpotBugs diff here (look for the red and orange ones): sharelib/oozie/findbugs-new.html
The most important SpotBugs errors are:
At ShellMain.java:[line 93]: This usage of java/lang/ProcessBuilder.<init>(Ljava/util/List;)V can be vulnerable to Command Injection
At ShellMain.java:[line 91]: At ShellMain.java:[line 90]
At ShellMain.java:[line 92]
+1 There are no new bugs found in [sharelib/hive].
+1 There are no new bugs found in [sharelib/hcatalog].
+1 There are no new bugs found in [sharelib/distcp].
+1 There are no new bugs found in [tools].
+1 There are no new bugs found in [server].
+1 There are no new bugs found in [client].
+1 There are no new bugs found in [examples].
+1 There are no new bugs found in [webapp].
+1 BACKWARDS_COMPATIBILITY
+1 the patch does not change any JPA Entity/Colum/Basic/Lob/Transient annotations
+1 the patch does not modify JPA files
+1 TESTS
Tests run: 3206
Tests failed at first run:
124654-[WARNING]
TestCredentials#testThrowErrorWhenMissingFileSystemPathProperty
TestCredentials#testThrowErrorWhenMissingFileSystemPathProperty
TestBlockingInputStream#testLimitedWritingBlockingInputStream
For the complete list of flaky tests, see TEST-SUMMARY-FULL files.
+1 DISTRO
+1 distro tarball builds with the patch
+1 MODERNIZER
----------------------------
-1 Overall result, please check the reported -1(s)
The full output of the test-patch run is available at
https://builds.apache.org/job/PreCommit-OOZIE-Build/1286/
Adding comment to JIRA
% Total % Received % Xferd Average Speed Time Time Time Current
Dload Upload Total Spent Left Speed
0 0 0 0 0 0 0 0 --:--:-- --:--:-- --:--:-- 0 0 0 0 0 0 0 0 0 --:--:-- --:--:-- --:--:-- 0100 4808 0 0 100 4808 0 3237 0:00:01 0:00:01 --:--:-- 3235{"self":"https://issues.apache.org/jira/rest/api/2/issue/13275707/comment/17012763","id":"17012763","author":{"self":"https://issues.apache.org/jira/rest/api/2/user?username=hadoopqa","name":"hadoopqa","key":"hadoopqa","avatarUrls":{"48x48":"https://issues.apache.org/jira/secure/useravatar?ownerId=hadoopqa&avatarId=10393","24x24":"https://issues.apache.org/jira/secure/useravatar?size=small&ownerId=hadoopqa&avatarId=10393","16x16":"https://issues.apache.org/jira/secure/useravatar?size=xsmall&ownerId=hadoopqa&avatarId=10393","32x32":"https://issues.apache.org/jira/secure/useravatar?size=medium&ownerId=hadoopqa&avatarId=10393"},"displayName":"Hadoop QA","active":true,"timeZone":"Etc/UTC"},"body":"\nTesting JIRA OOZIE-3575\n\nCleaning local git workspace\n\n----------------------------\n\n{color:green}+1 PATCH_APPLIES{color}\n{color:green}+1 CLEAN{color}\n{color:green}+1 RAW_PATCH_ANALYSIS{color}\n. {color:green}+1{color} the patch does not introduce any @author tags\n. {color:green}+1{color} the patch does not introduce any tabs\n. {color:green}+1{color} the patch does not introduce any trailing spaces\n. {color:green}+1{color} the patch does not introduce any star imports\n. {color:green}+1{color} the patch does not introduce any line longer than 132\n. {color:green}+1{color} the patch adds/modifies 1 testcase(s)\n{color:green}+1 RAT{color}\n. {color:green}+1{color} the patch does not seem to introduce new RAT warnings\n{color:green}+1 JAVADOC{color}\n. {color:green}+1{color} Javadoc generation succeeded with the patch\n. {color:green}+1{color} the patch does not seem to introduce new Javadoc warning(s)\n{color:green}+1 COMPILE{color}\n. {color:green}+1{color} HEAD compiles\n. {color:green}+1{color} patch compiles\n. {color:green}+1{color} the patch does not seem to introduce new javac warnings\n{color:red}-1{color} There are [6] new bugs found below threshold in total that must be fixed.\n. {color:green}+1{color} There are no new bugs found in [fluent-job/fluent-job-api].\n. {color:green}+1{color} There are no new bugs found in [docs].\n. {color:red}-1{color} There are [5] new bugs found below threshold in [core] that must be fixed.\n. You can find the SpotBugs diff here (look for the red and orange ones): core/findbugs-new.html\n. The most important SpotBugs errors are:\n. At BulkJPAExecutor.java:[line 206]: This use of javax/persistence/EntityManager.createQuery(Ljava/lang/String;)Ljavax/persistence/Query; can be vulnerable to SQL/JPQL injection\n. At BulkJPAExecutor.java:[line 176]: At BulkJPAExecutor.java:[line 175]\n. At BulkJPAExecutor.java:[line 205]: At BulkJPAExecutor.java:[line 199]\n. This use of javax/persistence/EntityManager.createQuery(Ljava/lang/String;)Ljavax/persistence/Query; can be vulnerable to SQL/JPQL injection: At BulkJPAExecutor.java:[line 206]\n. At BulkJPAExecutor.java:[line 111]: At BulkJPAExecutor.java:[line 127]\n. {color:green}+1{color} There are no new bugs found in [sharelib/spark].\n. {color:green}+1{color} There are no new bugs found in [sharelib/git].\n. {color:green}+1{color} There are no new bugs found in [sharelib/sqoop].\n. {color:green}+1{color} There are no new bugs found in [sharelib/hive2].\n. {color:green}+1{color} There are no new bugs found in [sharelib/streaming].\n. {color:green}+1{color} There are no new bugs found in [sharelib/pig].\n. {color:red}-1{color} There are [1] new bugs found below threshold in [sharelib/oozie] that must be fixed.\n. You can find the SpotBugs diff here (look for the red and orange ones): sharelib/oozie/findbugs-new.html\n. The most important SpotBugs errors are:\n. At ShellMain.java:[line 93]: This usage of java/lang/ProcessBuilder.<init>(Ljava/util/List;)V can be vulnerable to Command Injection\n. At ShellMain.java:[line 91]: At ShellMain.java:[line 90]\n. At ShellMain.java:[line 92]\n. {color:green}+1{color} There are no new bugs found in [sharelib/hive].\n. {color:green}+1{color} There are no new bugs found in [sharelib/hcatalog].\100 10992 0 6184 100 4808 3466 2695 0:00:01 0:00:01 --:--:-- 6157
n. {color:green}+1{color} There are no new bugs found in [sharelib/distcp].\n. {color:green}+1{color} There are no new bugs found in [tools].\n. {color:green}+1{color} There are no new bugs found in [server].\n. {color:green}+1{color} There are no new bugs found in [client].\n. {color:green}+1{color} There are no new bugs found in [examples].\n. {color:green}+1{color} There are no new bugs found in [webapp].\n{color:green}+1 BACKWARDS_COMPATIBILITY{color}\n. {color:green}+1{color} the patch does not change any JPA Entity/Colum/Basic/Lob/Transient annotations\n. {color:green}+1{color} the patch does not modify JPA files\n{color:green}+1 TESTS{color}\n. Tests run: 3206\n. {color:orange}Tests failed at first run:{color}\n124654-[WARNING]\nTestCredentials#testThrowErrorWhenMissingFileSystemPathProperty\nTestCredentials#testThrowErrorWhenMissingFileSystemPathProperty\nTestBlockingInputStream#testLimitedWritingBlockingInputStream\n. For the complete list of flaky tests, see TEST-SUMMARY-FULL files.\n{color:green}+1 DISTRO{color}\n. {color:green}+1{color} distro tarball builds with the patch \n{color:green}+1 MODERNIZER{color}\n\n----------------------------\n{color:red}*-1 Overall result, please check the reported -1(s)*{color}\n\n\nThe full output of the test-patch run is available at\n\n. https://builds.apache.org/job/PreCommit-OOZIE-Build/1286/\n\n","updateAuthor":{"self":"https://issues.apache.org/jira/rest/api/2/user?username=hadoopqa","name":"hadoopqa","key":"hadoopqa","avatarUrls":{"48x48":"https://issues.apache.org/jira/secure/useravatar?ownerId=hadoopqa&avatarId=10393","24x24":"https://issues.apache.org/jira/secure/useravatar?size=small&ownerId=hadoopqa&avatarId=10393","16x16":"https://issues.apache.org/jira/secure/useravatar?size=xsmall&ownerId=hadoopqa&avatarId=10393","32x32":"https://issues.apache.org/jira/secure/useravatar?size=medium&ownerId=hadoopqa&avatarId=10393"},"displayName":"Hadoop QA","active":true,"timeZone":"Etc/UTC"},"created":"2020-01-10T11:51:09.755+0000","updated":"2020-01-10T11:51:09.755+0000"}
test-patch exit code: 1
Build step 'Execute shell' marked build as failure
[description-setter] Description set: OOZIE-3575
Archiving artifacts
Recording test results
ERROR: Step ?Publish JUnit test result report? failed: No test report files were found. Configuration error?
Email was triggered for: Failure - Any
Sending email for trigger: Failure - Any
###################################################################################
############################## FAILED TESTS (if any) ##############################
No tests ran.
Failed: OOZIE-3575 PreCommit Build #1285
Posted by Apache Jenkins Server <je...@builds.apache.org>.
Jira: https://issues.apache.org/jira/browse/OOZIE-3575
Build: https://builds.apache.org/job/PreCommit-OOZIE-Build/1285/
###################################################################################
########################## LAST 100 LINES OF THE CONSOLE ###########################
[...truncated 2.16 MB...]
Running test-patch task BACKWARDS_COMPATIBILITY
Running test-patch task TESTS
Running test-patch task DISTRO
Running test-patch task MODERNIZER
Running modernizer op=report
[TRACE] grep -c '.*ERROR.*Prefer' /home/jenkins/jenkins-slave/workspace/PreCommit-OOZIE-Build/test-patch/reports/MODERNIZER-clean.txt
[TRACE] Modernizer errors before patch: 51
[TRACE] grep -c '.*ERROR.*Prefer' /home/jenkins/jenkins-slave/workspace/PreCommit-OOZIE-Build/test-patch/reports/MODERNIZER-patch.txt
[TRACE] Modernizer errors after patch: 51
Testing JIRA OOZIE-3575
Cleaning local git workspace
----------------------------
+1 PATCH_APPLIES
+1 CLEAN
-1 RAW_PATCH_ANALYSIS
+1 the patch does not introduce any @author tags
+1 the patch does not introduce any tabs
-1 the patch contains 1 line(s) with trailing spaces
+1 the patch does not introduce any star imports
+1 the patch does not introduce any line longer than 132
+1 the patch adds/modifies 1 testcase(s)
+1 RAT
+1 the patch does not seem to introduce new RAT warnings
+1 JAVADOC
+1 Javadoc generation succeeded with the patch
+1 the patch does not seem to introduce new Javadoc warning(s)
+1 COMPILE
+1 HEAD compiles
+1 patch compiles
+1 the patch does not seem to introduce new javac warnings
-1 There are [5] new bugs found below threshold in total that must be fixed.
+1 There are no new bugs found in [fluent-job/fluent-job-api].
+1 There are no new bugs found in [docs].
-1 There are [5] new bugs found below threshold in [core] that must be fixed.
You can find the SpotBugs diff here (look for the red and orange ones): core/findbugs-new.html
The most important SpotBugs errors are:
At BulkJPAExecutor.java:[line 206]: This use of javax/persistence/EntityManager.createQuery(Ljava/lang/String;)Ljavax/persistence/Query; can be vulnerable to SQL/JPQL injection
At BulkJPAExecutor.java:[line 176]: At BulkJPAExecutor.java:[line 175]
At BulkJPAExecutor.java:[line 205]: At BulkJPAExecutor.java:[line 199]
This use of javax/persistence/EntityManager.createQuery(Ljava/lang/String;)Ljavax/persistence/Query; can be vulnerable to SQL/JPQL injection: At BulkJPAExecutor.java:[line 206]
At BulkJPAExecutor.java:[line 111]: At BulkJPAExecutor.java:[line 127]
+1 There are no new bugs found in [sharelib/spark].
+1 There are no new bugs found in [sharelib/git].
+1 There are no new bugs found in [sharelib/sqoop].
+1 There are no new bugs found in [sharelib/hive2].
+1 There are no new bugs found in [sharelib/streaming].
+1 There are no new bugs found in [sharelib/pig].
+1 There are no new bugs found in [sharelib/oozie].
+1 There are no new bugs found in [sharelib/hive].
+1 There are no new bugs found in [sharelib/hcatalog].
+1 There are no new bugs found in [sharelib/distcp].
+1 There are no new bugs found in [tools].
+1 There are no new bugs found in [server].
+1 There are no new bugs found in [client].
+1 There are no new bugs found in [examples].
+1 There are no new bugs found in [webapp].
+1 BACKWARDS_COMPATIBILITY
+1 the patch does not change any JPA Entity/Colum/Basic/Lob/Transient annotations
+1 the patch does not modify JPA files
+1 TESTS
Tests run: 3206
Tests failed at first run:
127291-[WARNING]
TestCredentials#testThrowErrorWhenMissingFileSystemPathProperty
TestCredentials#testThrowErrorWhenMissingFileSystemPathProperty
TestBlockingInputStream#testFastWritingBlockingInputStream
TestBlockingInputStream#testLimitedWritingBlockingInputStream
For the complete list of flaky tests, see TEST-SUMMARY-FULL files.
+1 DISTRO
+1 distro tarball builds with the patch
+1 MODERNIZER
----------------------------
-1 Overall result, please check the reported -1(s)
The full output of the test-patch run is available at
https://builds.apache.org/job/PreCommit-OOZIE-Build/1285/
Adding comment to JIRA
% Total % Received % Xferd Average Speed Time Time Time Current
Dload Upload Total Spent Left Speed
0 0 0 0 0 0 0 0 --:--:-- --:--:-- --:--:-- 0 0 4432 0 0 0 0 0 0 --:--:-- --:--:-- --:--:-- 0{"self":"https://issues.apache.org/jira/rest/api/2/issue/13275707/comment/17012077","id":"17012077","author":{"self":"https://issues.apache.org/jira/rest/api/2/user?username=hadoopqa","name":"hadoopqa","key":"hadoopqa","avatarUrls":{"48x48":"https://issues.apache.org/jira/secure/useravatar?ownerId=hadoopqa&avatarId=10393","24x24":"https://issues.apache.org/jira/secure/useravatar?size=small&ownerId=hadoopqa&avatarId=10393","16x16":"https://issues.apache.org/jira/secure/useravatar?size=xsmall&ownerId=hadoopqa&avatarId=10393","32x32":"https://issues.apache.org/jira/secure/useravatar?size=medium&ownerId=hadoopqa&avatarId=10393"},"displayName":"Hadoop QA","active":true,"timeZone":"Etc/UTC"},"body":"\nTesting JIRA OOZIE-3575\n\nCleaning local git workspace\n\n----------------------------\n\n{color:green}+1 PATCH_APPLIES{color}\n{color:green}+1 CLEAN{color}\n{color:red}-1 RAW_PATCH_ANALYSIS{color}\n. {color:green}+1{color} the patch does not introduce any @author tags\n. {color:green}+1{color} the patch does not introduce any tabs\n. {color:red}-1{color} the patch contains 1 line(s) with trailing spaces\n. {color:green}+1{color} the patch does not introduce any star imports\n. {color:green}+1{color} the patch does not introduce any line longer than 132\n. {color:green}+1{color} the patch adds/modifies 1 testcase(s)\n{color:green}+1 RAT{color}\n. {color:green}+1{color} the patch does not seem to introduce new RAT warnings\n{color:green}+1 JAVADOC{color}\n. {color:green}+1{color} Javadoc generation succeeded with the patch\n. {color:green}+1{color} the patch does not seem to introduce new Javadoc warning(s)\n{color:green}+1 COMPILE{color}\n. {color:green}+1{color} HEAD compiles\n. {color:green}+1{color} patch compiles\n. {color:green}+1{color} the patch does not seem to introduce new javac warnings\n{color:red}-1{color} There are [5] new bugs found below threshold in total that must be fixed.\n. {color:green}+1{color} There are no new bugs found in [fluent-job/fluent-job-api].\n. {color:green}+1{color} There are no new bugs found in [docs].\n. {color:red}-1{color} There are [5] new bugs found below threshold in [core] that must be fixed.\n. You can find the SpotBugs diff here (look for the red and orange ones): core/findbugs-new.html\n. The most important SpotBugs errors are:\n. At BulkJPAExecutor.java:[line 206]: This use of javax/persistence/EntityManager.createQuery(Ljava/lang/String;)Ljavax/persistence/Query; can be vulnerable to SQL/JPQL injection\n. At BulkJPAExecutor.java:[line 176]: At BulkJPAExecutor.java:[line 175]\n. At BulkJPAExecutor.java:[line 205]: At BulkJPAExecutor.java:[line 199]\n. This use of javax/persistence/EntityManager.createQuery(Ljava/lang/String;)Ljavax/persistence/Query; can be vulnerable to SQL/JPQL injection: At BulkJPAExecutor.java:[line 206]\n. At BulkJPAExecutor.java:[line 111]: At BulkJPAExecutor.java:[line 127]\n. {color:green}+1{color} There are no new bugs found in [sharelib/spark].\n. {color:green}+1{color} There are no new bugs found in [sharelib/git].\n. {color:green}+1{color} There are no new bugs found in [sharelib/sqoop].\n. {color:green}+1{color} There are no new bugs found in [sharelib/hive2].\n. {color:green}+1{color} There are no new bugs found in [sharelib/streaming].\n. {color:green}+1{color} There are no new bugs found in [sharelib/pig].\n. {color:green}+1{color} There are no new bugs found in [sharelib/oozie].\n. {color:green}+1{color} There are no new bugs found in [sharelib/hive].\n. {color:green}+1{color} There are no new bugs found in [sharelib/hcatalog].\n. {color:green}+1{color} There are no new bugs found in [sharelib/distcp].\n. {color:green}+1{color} There are no new bugs found in [tools].\n. {color:green}+1{color} There are no new bugs found in [server].\n. {color:green}+1{color} There are no new bugs found in [client].\n. {color:green}+1{color} There are no new bugs found in [examples].\n. {color:green}+1{color} There are no new bugs found in [webapp].\n{colo100 10240 0 5808 100 4432 3682 2810 0:00:01 0:00:01 --:--:-- 6493
r:green}+1 BACKWARDS_COMPATIBILITY{color}\n. {color:green}+1{color} the patch does not change any JPA Entity/Colum/Basic/Lob/Transient annotations\n. {color:green}+1{color} the patch does not modify JPA files\n{color:green}+1 TESTS{color}\n. Tests run: 3206\n. {color:orange}Tests failed at first run:{color}\n127291-[WARNING]\nTestCredentials#testThrowErrorWhenMissingFileSystemPathProperty\nTestCredentials#testThrowErrorWhenMissingFileSystemPathProperty\nTestBlockingInputStream#testFastWritingBlockingInputStream\nTestBlockingInputStream#testLimitedWritingBlockingInputStream\n. For the complete list of flaky tests, see TEST-SUMMARY-FULL files.\n{color:green}+1 DISTRO{color}\n. {color:green}+1{color} distro tarball builds with the patch \n{color:green}+1 MODERNIZER{color}\n\n----------------------------\n{color:red}*-1 Overall result, please check the reported -1(s)*{color}\n\n\nThe full output of the test-patch run is available at\n\n. https://builds.apache.org/job/PreCommit-OOZIE-Build/1285/\n\n","updateAuthor":{"self":"https://issues.apache.org/jira/rest/api/2/user?username=hadoopqa","name":"hadoopqa","key":"hadoopqa","avatarUrls":{"48x48":"https://issues.apache.org/jira/secure/useravatar?ownerId=hadoopqa&avatarId=10393","24x24":"https://issues.apache.org/jira/secure/useravatar?size=small&ownerId=hadoopqa&avatarId=10393","16x16":"https://issues.apache.org/jira/secure/useravatar?size=xsmall&ownerId=hadoopqa&avatarId=10393","32x32":"https://issues.apache.org/jira/secure/useravatar?size=medium&ownerId=hadoopqa&avatarId=10393"},"displayName":"Hadoop QA","active":true,"timeZone":"Etc/UTC"},"created":"2020-01-09T17:50:47.459+0000","updated":"2020-01-09T17:50:47.459+0000"}
test-patch exit code: 1
Build step 'Execute shell' marked build as failure
[description-setter] Description set: OOZIE-3575
Archiving artifacts
Recording test results
ERROR: Step ?Publish JUnit test result report? failed: No test report files were found. Configuration error?
Email was triggered for: Failure - Any
Sending email for trigger: Failure - Any
###################################################################################
############################## FAILED TESTS (if any) ##############################
No tests ran.