You are viewing a plain text version of this content. The canonical link for it is here.
Posted to dev@aries.apache.org by Apache Jenkins Server <je...@builds.apache.org> on 2013/08/01 15:38:52 UTC

Build failed in Jenkins: Aries #1880

See <https://builds.apache.org/job/Aries/1880/changes>

Changes:

[gnodet] [ARIES-1090] Deadlock with ServiceRecipe

[gnodet] [ARIES-896] Attempt at another fix for deadlock in references

------------------------------------------
[...truncated 19958 lines...]
[JENKINS] Archiving <https://builds.apache.org/job/Aries/ws/aries/transaction/transaction-jms/pom.xml> to /home/hudson/hudson/jobs/Aries/modules/org.apache.aries.transaction$org.apache.aries.transaction.jms/builds/2013-08-01_12-54-35/archive/org.apache.aries.transaction/org.apache.aries.transaction.jms/1.0.1-SNAPSHOT/org.apache.aries.transaction.jms-1.0.1-SNAPSHOT.pom
[JENKINS] Archiving <https://builds.apache.org/job/Aries/ws/aries/transaction/transaction-jms/target/org.apache.aries.transaction.jms-1.0.1-SNAPSHOT.jar> to /home/hudson/hudson/jobs/Aries/modules/org.apache.aries.transaction$org.apache.aries.transaction.jms/builds/2013-08-01_12-54-35/archive/org.apache.aries.transaction/org.apache.aries.transaction.jms/1.0.1-SNAPSHOT/org.apache.aries.transaction.jms-1.0.1-SNAPSHOT.jar
[JENKINS] Archiving <https://builds.apache.org/job/Aries/ws/aries/transaction/transaction-jms/target/xbean/org.apache.aries.transaction.jms.xsd> to /home/hudson/hudson/jobs/Aries/modules/org.apache.aries.transaction$org.apache.aries.transaction.jms/builds/2013-08-01_12-54-35/archive/org.apache.aries.transaction/org.apache.aries.transaction.jms/1.0.1-SNAPSHOT/org.apache.aries.transaction.jms-1.0.1-SNAPSHOT.xsd
[JENKINS] Archiving <https://builds.apache.org/job/Aries/ws/aries/transaction/transaction-jms/target/xbean/org.apache.aries.transaction.jms.xsd.html> to /home/hudson/hudson/jobs/Aries/modules/org.apache.aries.transaction$org.apache.aries.transaction.jms/builds/2013-08-01_12-54-35/archive/org.apache.aries.transaction/org.apache.aries.transaction.jms/1.0.1-SNAPSHOT/org.apache.aries.transaction.jms-1.0.1-SNAPSHOT-schema.html
[JENKINS] Archiving <https://builds.apache.org/job/Aries/ws/aries/samples/blog/blog-api/pom.xml> to /home/hudson/hudson/jobs/Aries/modules/org.apache.aries.samples.blog$org.apache.aries.samples.blog.api/builds/2013-08-01_12-54-43/archive/org.apache.aries.samples.blog/org.apache.aries.samples.blog.api/1.0.1-SNAPSHOT/org.apache.aries.samples.blog.api-1.0.1-SNAPSHOT.pom
[JENKINS] Archiving <https://builds.apache.org/job/Aries/ws/aries/samples/ariestrader/modules/ariestrader-persist-jpa-cm/pom.xml> to /home/hudson/hudson/jobs/Aries/modules/org.apache.aries.samples.ariestrader$org.apache.aries.samples.ariestrader.persist.jpa.cm/builds/2013-08-01_12-54-46/archive/org.apache.aries.samples.ariestrader/org.apache.aries.samples.ariestrader.persist.jpa.cm/1.0.1-SNAPSHOT/org.apache.aries.samples.ariestrader.persist.jpa.cm-1.0.1-SNAPSHOT.pom
[JENKINS] Archiving <https://builds.apache.org/job/Aries/ws/aries/jmx/jmx-bundle/dependency-reduced-pom.xml> to /home/hudson/hudson/jobs/Aries/modules/org.apache.aries.jmx$org.apache.aries.jmx/builds/2013-08-01_12-54-40/archive/org.apache.aries.jmx/org.apache.aries.jmx/1.1.2-SNAPSHOT/org.apache.aries.jmx-1.1.2-SNAPSHOT.pom
[JENKINS] Archiving <https://builds.apache.org/job/Aries/ws/aries/jmx/jmx-bundle/target/org.apache.aries.jmx-1.1.2-SNAPSHOT.jar> to /home/hudson/hudson/jobs/Aries/modules/org.apache.aries.jmx$org.apache.aries.jmx/builds/2013-08-01_12-54-40/archive/org.apache.aries.jmx/org.apache.aries.jmx/1.1.2-SNAPSHOT/org.apache.aries.jmx-1.1.2-SNAPSHOT.jar
[JENKINS] Archiving <https://builds.apache.org/job/Aries/ws/aries/samples/ariestrader/assemblies/equinox-test-harness/pom.xml> to /home/hudson/hudson/jobs/Aries/modules/org.apache.aries.samples.ariestrader$equinox-test-harness/builds/2013-08-01_12-54-46/archive/org.apache.aries.samples.ariestrader/equinox-test-harness/1.0.1-SNAPSHOT/equinox-test-harness-1.0.1-SNAPSHOT.pom
[JENKINS] Archiving <https://builds.apache.org/job/Aries/ws/aries/jmx/jmx-blueprint-api/pom.xml> to /home/hudson/hudson/jobs/Aries/modules/org.apache.aries.jmx$org.apache.aries.jmx.blueprint.api/builds/2013-08-01_12-54-40/archive/org.apache.aries.jmx/org.apache.aries.jmx.blueprint.api/1.1.1-SNAPSHOT/org.apache.aries.jmx.blueprint.api-1.1.1-SNAPSHOT.pom
[JENKINS] Archiving <https://builds.apache.org/job/Aries/ws/aries/jmx/jmx-blueprint-api/target/org.apache.aries.jmx.blueprint.api-1.1.1-SNAPSHOT.jar> to /home/hudson/hudson/jobs/Aries/modules/org.apache.aries.jmx$org.apache.aries.jmx.blueprint.api/builds/2013-08-01_12-54-40/archive/org.apache.aries.jmx/org.apache.aries.jmx.blueprint.api/1.1.1-SNAPSHOT/org.apache.aries.jmx.blueprint.api-1.1.1-SNAPSHOT.jar
[JENKINS] Archiving <https://builds.apache.org/job/Aries/ws/aries/jndi/pom.xml> to /home/hudson/hudson/jobs/Aries/modules/org.apache.aries.jndi$jndi/builds/2013-08-01_12-54-32/archive/org.apache.aries.jndi/jndi/1.0.0-SNAPSHOT/jndi-1.0.0-SNAPSHOT.pom
[JENKINS] Archiving <https://builds.apache.org/job/Aries/ws/aries/samples/ariestrader/modules/ariestrader-core/pom.xml> to /home/hudson/hudson/jobs/Aries/modules/org.apache.aries.samples.ariestrader$org.apache.aries.samples.ariestrader.core/builds/2013-08-01_12-54-45/archive/org.apache.aries.samples.ariestrader/org.apache.aries.samples.ariestrader.core/1.0.1-SNAPSHOT/org.apache.aries.samples.ariestrader.core-1.0.1-SNAPSHOT.pom
[JENKINS] Archiving <https://builds.apache.org/job/Aries/ws/aries/samples/blueprint/idverifier/idverifier-assembly/pom.xml> to /home/hudson/hudson/jobs/Aries/modules/org.apache.aries.samples.blueprint.idverifier$org.apache.aries.samples.blueprint.idverifier.assembly/builds/2013-08-01_12-54-48/archive/org.apache.aries.samples.blueprint.idverifier/org.apache.aries.samples.blueprint.idverifier.assembly/1.0.1-SNAPSHOT/org.apache.aries.samples.blueprint.idverifier.assembly-1.0.1-SNAPSHOT.pom
[JENKINS] Archiving <https://builds.apache.org/job/Aries/ws/aries/eba-maven-plugin/pom.xml> to /home/hudson/hudson/jobs/Aries/modules/org.apache.aries$eba-maven-plugin/builds/2013-08-01_12-54-28/archive/org.apache.aries/eba-maven-plugin/1.0.1-SNAPSHOT/eba-maven-plugin-1.0.1-SNAPSHOT.pom
[JENKINS] Archiving <https://builds.apache.org/job/Aries/ws/aries/eba-maven-plugin/target/eba-maven-plugin-1.0.1-SNAPSHOT.jar> to /home/hudson/hudson/jobs/Aries/modules/org.apache.aries$eba-maven-plugin/builds/2013-08-01_12-54-28/archive/org.apache.aries/eba-maven-plugin/1.0.1-SNAPSHOT/eba-maven-plugin-1.0.1-SNAPSHOT.jar
[JENKINS] Archiving <https://builds.apache.org/job/Aries/ws/aries/samples/blog/blog-biz/pom.xml> to /home/hudson/hudson/jobs/Aries/modules/org.apache.aries.samples.blog$org.apache.aries.samples.blog.biz/builds/2013-08-01_12-54-44/archive/org.apache.aries.samples.blog/org.apache.aries.samples.blog.biz/1.0.1-SNAPSHOT/org.apache.aries.samples.blog.biz-1.0.1-SNAPSHOT.pom
[JENKINS] Archiving <https://builds.apache.org/job/Aries/ws/aries/proxy/proxy-itests/pom.xml> to /home/hudson/hudson/jobs/Aries/modules/org.apache.aries.proxy$org.apache.aries.proxy.itests/builds/2013-08-01_12-54-30/archive/org.apache.aries.proxy/org.apache.aries.proxy.itests/1.0.1-SNAPSHOT/org.apache.aries.proxy.itests-1.0.1-SNAPSHOT.pom
[JENKINS] Archiving <https://builds.apache.org/job/Aries/ws/aries/proxy/proxy-itests/target/org.apache.aries.proxy.itests-1.0.1-SNAPSHOT.jar> to /home/hudson/hudson/jobs/Aries/modules/org.apache.aries.proxy$org.apache.aries.proxy.itests/builds/2013-08-01_12-54-30/archive/org.apache.aries.proxy/org.apache.aries.proxy.itests/1.0.1-SNAPSHOT/org.apache.aries.proxy.itests-1.0.1-SNAPSHOT.jar
[JENKINS] Archiving <https://builds.apache.org/job/Aries/ws/aries/transaction/transaction-testds/pom.xml> to /home/hudson/hudson/jobs/Aries/modules/org.apache.aries.transaction$org.apache.aries.transaction.testds/builds/2013-08-01_12-54-35/archive/org.apache.aries.transaction/org.apache.aries.transaction.testds/1.0.1-SNAPSHOT/org.apache.aries.transaction.testds-1.0.1-SNAPSHOT.pom
[JENKINS] Archiving <https://builds.apache.org/job/Aries/ws/aries/transaction/transaction-testds/target/org.apache.aries.transaction.testds-1.0.1-SNAPSHOT.jar> to /home/hudson/hudson/jobs/Aries/modules/org.apache.aries.transaction$org.apache.aries.transaction.testds/builds/2013-08-01_12-54-35/archive/org.apache.aries.transaction/org.apache.aries.transaction.testds/1.0.1-SNAPSHOT/org.apache.aries.transaction.testds-1.0.1-SNAPSHOT.jar
[JENKINS] Archiving <https://builds.apache.org/job/Aries/ws/aries/blueprint/blueprint-testbundleb/pom.xml> to /home/hudson/hudson/jobs/Aries/modules/org.apache.aries.blueprint$org.apache.aries.blueprint.testbundleb/builds/2013-08-01_12-54-32/archive/org.apache.aries.blueprint/org.apache.aries.blueprint.testbundleb/1.0.2-SNAPSHOT/org.apache.aries.blueprint.testbundleb-1.0.2-SNAPSHOT.pom
[JENKINS] Archiving <https://builds.apache.org/job/Aries/ws/aries/blueprint/blueprint-testbundleb/target/org.apache.aries.blueprint.testbundleb-1.0.2-SNAPSHOT.jar> to /home/hudson/hudson/jobs/Aries/modules/org.apache.aries.blueprint$org.apache.aries.blueprint.testbundleb/builds/2013-08-01_12-54-32/archive/org.apache.aries.blueprint/org.apache.aries.blueprint.testbundleb/1.0.2-SNAPSHOT/org.apache.aries.blueprint.testbundleb-1.0.2-SNAPSHOT.jar
[JENKINS] Archiving <https://builds.apache.org/job/Aries/ws/aries/blueprint/blueprint-testquiescebundle/pom.xml> to /home/hudson/hudson/jobs/Aries/modules/org.apache.aries.blueprint$org.apache.aries.blueprint.testquiescebundle/builds/2013-08-01_12-54-32/archive/org.apache.aries.blueprint/org.apache.aries.blueprint.testquiescebundle/1.0.1-SNAPSHOT/org.apache.aries.blueprint.testquiescebundle-1.0.1-SNAPSHOT.pom
[JENKINS] Archiving <https://builds.apache.org/job/Aries/ws/aries/blueprint/blueprint-testquiescebundle/target/org.apache.aries.blueprint.testquiescebundle-1.0.1-SNAPSHOT.jar> to /home/hudson/hudson/jobs/Aries/modules/org.apache.aries.blueprint$org.apache.aries.blueprint.testquiescebundle/builds/2013-08-01_12-54-32/archive/org.apache.aries.blueprint/org.apache.aries.blueprint.testquiescebundle/1.0.1-SNAPSHOT/org.apache.aries.blueprint.testquiescebundle-1.0.1-SNAPSHOT.jar
[JENKINS] Archiving <https://builds.apache.org/job/Aries/ws/aries/samples/blog/pom.xml> to /home/hudson/hudson/jobs/Aries/modules/org.apache.aries.samples.blog$blog/builds/2013-08-01_12-54-43/archive/org.apache.aries.samples.blog/blog/1.0.1-SNAPSHOT/blog-1.0.1-SNAPSHOT.pom
[JENKINS] Archiving <https://builds.apache.org/job/Aries/ws/aries/blueprint/pom.xml> to /home/hudson/hudson/jobs/Aries/modules/org.apache.aries.blueprint$blueprint/builds/2013-08-01_12-54-30/archive/org.apache.aries.blueprint/blueprint/1.0.0-SNAPSHOT/blueprint-1.0.0-SNAPSHOT.pom
[JENKINS] Archiving <https://builds.apache.org/job/Aries/ws/aries/jndi/jndi-core/pom.xml> to /home/hudson/hudson/jobs/Aries/modules/org.apache.aries.jndi$org.apache.aries.jndi.core/builds/2013-08-01_12-54-33/archive/org.apache.aries.jndi/org.apache.aries.jndi.core/1.0.1-SNAPSHOT/org.apache.aries.jndi.core-1.0.1-SNAPSHOT.pom
[JENKINS] Archiving <https://builds.apache.org/job/Aries/ws/aries/jndi/jndi-core/target/org.apache.aries.jndi.core-1.0.1-SNAPSHOT.jar> to /home/hudson/hudson/jobs/Aries/modules/org.apache.aries.jndi$org.apache.aries.jndi.core/builds/2013-08-01_12-54-33/archive/org.apache.aries.jndi/org.apache.aries.jndi.core/1.0.1-SNAPSHOT/org.apache.aries.jndi.core-1.0.1-SNAPSHOT.jar
[JENKINS] Archiving <https://builds.apache.org/job/Aries/ws/aries/subsystem/subsystem-core/pom.xml> to /home/hudson/hudson/jobs/Aries/modules/org.apache.aries.subsystem$org.apache.aries.subsystem.core/builds/2013-08-01_12-54-38/archive/org.apache.aries.subsystem/org.apache.aries.subsystem.core/1.0.1-SNAPSHOT/org.apache.aries.subsystem.core-1.0.1-SNAPSHOT.pom
[JENKINS] Archiving <https://builds.apache.org/job/Aries/ws/aries/subsystem/subsystem-core/target/org.apache.aries.subsystem.core-1.0.1-SNAPSHOT.jar> to /home/hudson/hudson/jobs/Aries/modules/org.apache.aries.subsystem$org.apache.aries.subsystem.core/builds/2013-08-01_12-54-38/archive/org.apache.aries.subsystem/org.apache.aries.subsystem.core/1.0.1-SNAPSHOT/org.apache.aries.subsystem.core-1.0.1-SNAPSHOT.jar
[JENKINS] Archiving <https://builds.apache.org/job/Aries/ws/aries/spi-fly/spi-fly-examples/spi-fly-example-resource-provider-bundle/pom.xml> to /home/hudson/hudson/jobs/Aries/modules/org.apache.aries.spifly.examples$org.apache.aries.spifly.examples.resource.provider.bundle/builds/2013-08-01_12-54-43/archive/org.apache.aries.spifly.examples/org.apache.aries.spifly.examples.resource.provider.bundle/1.0.1-SNAPSHOT/org.apache.aries.spifly.examples.resource.provider.bundle-1.0.1-SNAPSHOT.pom
[JENKINS] Archiving <https://builds.apache.org/job/Aries/ws/aries/proxy/pom.xml> to /home/hudson/hudson/jobs/Aries/modules/org.apache.aries.proxy$proxy/builds/2013-08-01_12-54-29/archive/org.apache.aries.proxy/proxy/1.0.1-SNAPSHOT/proxy-1.0.1-SNAPSHOT.pom
[JENKINS] Archiving <https://builds.apache.org/job/Aries/ws/aries/samples/ariestrader/pom.xml> to /home/hudson/hudson/jobs/Aries/modules/org.apache.aries.samples.ariestrader$ariestrader/builds/2013-08-01_12-54-45/archive/org.apache.aries.samples.ariestrader/ariestrader/1.0.1-SNAPSHOT/ariestrader-1.0.1-SNAPSHOT.pom
[JENKINS] Archiving <https://builds.apache.org/job/Aries/ws/aries/quiesce/quiesce-api/pom.xml> to /home/hudson/hudson/jobs/Aries/modules/org.apache.aries.quiesce$org.apache.aries.quiesce.api/builds/2013-08-01_12-54-30/archive/org.apache.aries.quiesce/org.apache.aries.quiesce.api/1.0.1-SNAPSHOT/org.apache.aries.quiesce.api-1.0.1-SNAPSHOT.pom
[JENKINS] Archiving <https://builds.apache.org/job/Aries/ws/aries/quiesce/quiesce-api/target/org.apache.aries.quiesce.api-1.0.1-SNAPSHOT.jar> to /home/hudson/hudson/jobs/Aries/modules/org.apache.aries.quiesce$org.apache.aries.quiesce.api/builds/2013-08-01_12-54-30/archive/org.apache.aries.quiesce/org.apache.aries.quiesce.api/1.0.1-SNAPSHOT/org.apache.aries.quiesce.api-1.0.1-SNAPSHOT.jar
[JENKINS] Archiving <https://builds.apache.org/job/Aries/ws/aries/ejb/openejb-extender-itest/pom.xml> to /home/hudson/hudson/jobs/Aries/modules/org.apache.aries.ejb$org.apache.aries.ejb.openejb.extender.itest/builds/2013-08-01_12-54-39/archive/org.apache.aries.ejb/org.apache.aries.ejb.openejb.extender.itest/1.0.1-SNAPSHOT/org.apache.aries.ejb.openejb.extender.itest-1.0.1-SNAPSHOT.pom
[JENKINS] Archiving <https://builds.apache.org/job/Aries/ws/aries/ejb/openejb-extender-itest/target/org.apache.aries.ejb.openejb.extender.itest-1.0.1-SNAPSHOT.jar> to /home/hudson/hudson/jobs/Aries/modules/org.apache.aries.ejb$org.apache.aries.ejb.openejb.extender.itest/builds/2013-08-01_12-54-39/archive/org.apache.aries.ejb/org.apache.aries.ejb.openejb.extender.itest/1.0.1-SNAPSHOT/org.apache.aries.ejb.openejb.extender.itest-1.0.1-SNAPSHOT.jar
[JENKINS] Archiving <https://builds.apache.org/job/Aries/ws/aries/spi-fly/spi-fly-examples/spi-fly-example-spi-bundle/pom.xml> to /home/hudson/hudson/jobs/Aries/modules/org.apache.aries.spifly.examples$org.apache.aries.spifly.examples.spi.bundle/builds/2013-08-01_12-54-42/archive/org.apache.aries.spifly.examples/org.apache.aries.spifly.examples.spi.bundle/1.0.1-SNAPSHOT/org.apache.aries.spifly.examples.spi.bundle-1.0.1-SNAPSHOT.pom
[JENKINS] Archiving <https://builds.apache.org/job/Aries/ws/aries/application/application-runtime-framework-management/pom.xml> to /home/hudson/hudson/jobs/Aries/modules/org.apache.aries.application$org.apache.aries.application.runtime.framework.management/builds/2013-08-01_12-54-38/archive/org.apache.aries.application/org.apache.aries.application.runtime.framework.management/1.0.1-SNAPSHOT/org.apache.aries.application.runtime.framework.management-1.0.1-SNAPSHOT.pom
[JENKINS] Archiving <https://builds.apache.org/job/Aries/ws/aries/application/application-runtime-framework-management/target/org.apache.aries.application.runtime.framework.management-1.0.1-SNAPSHOT.jar> to /home/hudson/hudson/jobs/Aries/modules/org.apache.aries.application$org.apache.aries.application.runtime.framework.management/builds/2013-08-01_12-54-38/archive/org.apache.aries.application/org.apache.aries.application.runtime.framework.management/1.0.1-SNAPSHOT/org.apache.aries.application.runtime.framework.management-1.0.1-SNAPSHOT.jar
[JENKINS] Archiving <https://builds.apache.org/job/Aries/ws/aries/blueprint/blueprint-sample/pom.xml> to /home/hudson/hudson/jobs/Aries/modules/org.apache.aries.blueprint$org.apache.aries.blueprint.sample/builds/2013-08-01_12-54-31/archive/org.apache.aries.blueprint/org.apache.aries.blueprint.sample/1.0.1-SNAPSHOT/org.apache.aries.blueprint.sample-1.0.1-SNAPSHOT.pom
[JENKINS] Archiving <https://builds.apache.org/job/Aries/ws/aries/blueprint/blueprint-sample/target/org.apache.aries.blueprint.sample-1.0.1-SNAPSHOT.jar> to /home/hudson/hudson/jobs/Aries/modules/org.apache.aries.blueprint$org.apache.aries.blueprint.sample/builds/2013-08-01_12-54-31/archive/org.apache.aries.blueprint/org.apache.aries.blueprint.sample/1.0.1-SNAPSHOT/org.apache.aries.blueprint.sample-1.0.1-SNAPSHOT.jar
[JENKINS] Archiving <https://builds.apache.org/job/Aries/ws/aries/samples/ariestrader/modules/ariestrader-api/pom.xml> to /home/hudson/hudson/jobs/Aries/modules/org.apache.aries.samples.ariestrader$org.apache.aries.samples.ariestrader.api/builds/2013-08-01_12-54-45/archive/org.apache.aries.samples.ariestrader/org.apache.aries.samples.ariestrader.api/1.0.1-SNAPSHOT/org.apache.aries.samples.ariestrader.api-1.0.1-SNAPSHOT.pom
[JENKINS] Archiving <https://builds.apache.org/job/Aries/ws/aries/spi-fly/spi-fly-examples/spi-fly-example-provider1-bundle/pom.xml> to /home/hudson/hudson/jobs/Aries/modules/org.apache.aries.spifly.examples$org.apache.aries.spifly.examples.provider1.bundle/builds/2013-08-01_12-54-42/archive/org.apache.aries.spifly.examples/org.apache.aries.spifly.examples.provider1.bundle/1.0.1-SNAPSHOT/org.apache.aries.spifly.examples.provider1.bundle-1.0.1-SNAPSHOT.pom
[JENKINS] Archiving <https://builds.apache.org/job/Aries/ws/aries/application/application-runtime-isolated/pom.xml> to /home/hudson/hudson/jobs/Aries/modules/org.apache.aries.application$org.apache.aries.application.runtime.isolated/builds/2013-08-01_12-54-37/archive/org.apache.aries.application/org.apache.aries.application.runtime.isolated/1.0.1-SNAPSHOT/org.apache.aries.application.runtime.isolated-1.0.1-SNAPSHOT.pom
[JENKINS] Archiving <https://builds.apache.org/job/Aries/ws/aries/application/application-runtime-isolated/target/org.apache.aries.application.runtime.isolated-1.0.1-SNAPSHOT.jar> to /home/hudson/hudson/jobs/Aries/modules/org.apache.aries.application$org.apache.aries.application.runtime.isolated/builds/2013-08-01_12-54-37/archive/org.apache.aries.application/org.apache.aries.application.runtime.isolated/1.0.1-SNAPSHOT/org.apache.aries.application.runtime.isolated-1.0.1-SNAPSHOT.jar
[JENKINS] Archiving <https://builds.apache.org/job/Aries/ws/aries/application/application-modeller/pom.xml> to /home/hudson/hudson/jobs/Aries/modules/org.apache.aries.application$org.apache.aries.application.modeller/builds/2013-08-01_12-54-36/archive/org.apache.aries.application/org.apache.aries.application.modeller/1.0.1-SNAPSHOT/org.apache.aries.application.modeller-1.0.1-SNAPSHOT.pom
[JENKINS] Archiving <https://builds.apache.org/job/Aries/ws/aries/application/application-modeller/target/org.apache.aries.application.modeller-1.0.1-SNAPSHOT.jar> to /home/hudson/hudson/jobs/Aries/modules/org.apache.aries.application$org.apache.aries.application.modeller/builds/2013-08-01_12-54-36/archive/org.apache.aries.application/org.apache.aries.application.modeller/1.0.1-SNAPSHOT/org.apache.aries.application.modeller-1.0.1-SNAPSHOT.jar
[JENKINS] Archiving <https://builds.apache.org/job/Aries/ws/aries/blueprint/blueprint-annotation-api/pom.xml> to /home/hudson/hudson/jobs/Aries/modules/org.apache.aries.blueprint$org.apache.aries.blueprint.annotation.api/builds/2013-08-01_12-54-31/archive/org.apache.aries.blueprint/org.apache.aries.blueprint.annotation.api/1.0.1-SNAPSHOT/org.apache.aries.blueprint.annotation.api-1.0.1-SNAPSHOT.pom
[JENKINS] Archiving <https://builds.apache.org/job/Aries/ws/aries/blueprint/blueprint-annotation-api/target/org.apache.aries.blueprint.annotation.api-1.0.1-SNAPSHOT.jar> to /home/hudson/hudson/jobs/Aries/modules/org.apache.aries.blueprint$org.apache.aries.blueprint.annotation.api/builds/2013-08-01_12-54-31/archive/org.apache.aries.blueprint/org.apache.aries.blueprint.annotation.api/1.0.1-SNAPSHOT/org.apache.aries.blueprint.annotation.api-1.0.1-SNAPSHOT.jar
[JENKINS] Archiving <https://builds.apache.org/job/Aries/ws/aries/application/application-itests/pom.xml> to /home/hudson/hudson/jobs/Aries/modules/org.apache.aries.application$org.apache.aries.application.runtime.isolated.itests/builds/2013-08-01_12-54-36/archive/org.apache.aries.application/org.apache.aries.application.runtime.isolated.itests/1.0.1-SNAPSHOT/org.apache.aries.application.runtime.isolated.itests-1.0.1-SNAPSHOT.pom
[JENKINS] Archiving <https://builds.apache.org/job/Aries/ws/aries/application/application-itests/target/org.apache.aries.application.runtime.isolated.itests-1.0.1-SNAPSHOT.jar> to /home/hudson/hudson/jobs/Aries/modules/org.apache.aries.application$org.apache.aries.application.runtime.isolated.itests/builds/2013-08-01_12-54-36/archive/org.apache.aries.application/org.apache.aries.application.runtime.isolated.itests/1.0.1-SNAPSHOT/org.apache.aries.application.runtime.isolated.itests-1.0.1-SNAPSHOT.jar
[JENKINS] Archiving <https://builds.apache.org/job/Aries/ws/aries/versioning/versioning-checker/pom.xml> to /home/hudson/hudson/jobs/Aries/modules/org.apache.aries.versioning$org.apache.aries.versioning.checker/builds/2013-08-01_12-54-29/archive/org.apache.aries.versioning/org.apache.aries.versioning.checker/0.2.0-SNAPSHOT/org.apache.aries.versioning.checker-0.2.0-SNAPSHOT.pom
[JENKINS] Archiving <https://builds.apache.org/job/Aries/ws/aries/versioning/versioning-checker/target/org.apache.aries.versioning.checker-0.2.0-SNAPSHOT.jar> to /home/hudson/hudson/jobs/Aries/modules/org.apache.aries.versioning$org.apache.aries.versioning.checker/builds/2013-08-01_12-54-29/archive/org.apache.aries.versioning/org.apache.aries.versioning.checker/0.2.0-SNAPSHOT/org.apache.aries.versioning.checker-0.2.0-SNAPSHOT.jar
[JENKINS] Archiving <https://builds.apache.org/job/Aries/ws/aries/subsystem/subsystem-itests-api-bundle/pom.xml> to /home/hudson/hudson/jobs/Aries/modules/org.apache.aries.subsystem$org.apache.aries.subsystem.itest.interfaces/builds/2013-08-01_12-54-39/archive/org.apache.aries.subsystem/org.apache.aries.subsystem.itest.interfaces/1.0.0-SNAPSHOT/org.apache.aries.subsystem.itest.interfaces-1.0.0-SNAPSHOT.pom
[JENKINS] Archiving <https://builds.apache.org/job/Aries/ws/aries/subsystem/subsystem-itests-api-bundle/target/org.apache.aries.subsystem.itest.interfaces-1.0.0-SNAPSHOT.jar> to /home/hudson/hudson/jobs/Aries/modules/org.apache.aries.subsystem$org.apache.aries.subsystem.itest.interfaces/builds/2013-08-01_12-54-39/archive/org.apache.aries.subsystem/org.apache.aries.subsystem.itest.interfaces/1.0.0-SNAPSHOT/org.apache.aries.subsystem.itest.interfaces-1.0.0-SNAPSHOT.jar
[JENKINS] Archiving <https://builds.apache.org/job/Aries/ws/aries/parent/default-parent/java5-parent/pom.xml> to /home/hudson/hudson/jobs/Aries/modules/org.apache.aries$java5-parent/builds/2013-08-01_12-54-27/archive/org.apache.aries/java5-parent/1.1.0-SNAPSHOT/java5-parent-1.1.0-SNAPSHOT.pom
[JENKINS] Archiving <https://builds.apache.org/job/Aries/ws/aries/jpa/pom.xml> to /home/hudson/hudson/jobs/Aries/modules/org.apache.aries.jpa$jpa/builds/2013-08-01_12-54-40/archive/org.apache.aries.jpa/jpa/1.0.0-SNAPSHOT/jpa-1.0.0-SNAPSHOT.pom
[JENKINS] Archiving <https://builds.apache.org/job/Aries/ws/aries/jndi/jndi-bundle/pom.xml> to /home/hudson/hudson/jobs/Aries/modules/org.apache.aries.jndi$org.apache.aries.jndi/builds/2013-08-01_12-54-34/archive/org.apache.aries.jndi/org.apache.aries.jndi/1.0.1-SNAPSHOT/org.apache.aries.jndi-1.0.1-SNAPSHOT.pom
[JENKINS] Archiving <https://builds.apache.org/job/Aries/ws/aries/jndi/jndi-bundle/target/org.apache.aries.jndi-1.0.1-SNAPSHOT.jar> to /home/hudson/hudson/jobs/Aries/modules/org.apache.aries.jndi$org.apache.aries.jndi/builds/2013-08-01_12-54-34/archive/org.apache.aries.jndi/org.apache.aries.jndi/1.0.1-SNAPSHOT/org.apache.aries.jndi-1.0.1-SNAPSHOT.jar
[JENKINS] Archiving <https://builds.apache.org/job/Aries/ws/aries/proxy/proxy-bundle/pom.xml> to /home/hudson/hudson/jobs/Aries/modules/org.apache.aries.proxy$org.apache.aries.proxy/builds/2013-08-01_12-54-29/archive/org.apache.aries.proxy/org.apache.aries.proxy/1.0.2-SNAPSHOT/org.apache.aries.proxy-1.0.2-SNAPSHOT.pom
[JENKINS] Archiving <https://builds.apache.org/job/Aries/ws/aries/proxy/proxy-bundle/target/org.apache.aries.proxy-1.0.2-SNAPSHOT.jar> to /home/hudson/hudson/jobs/Aries/modules/org.apache.aries.proxy$org.apache.aries.proxy/builds/2013-08-01_12-54-29/archive/org.apache.aries.proxy/org.apache.aries.proxy/1.0.2-SNAPSHOT/org.apache.aries.proxy-1.0.2-SNAPSHOT.jar
[JENKINS] Archiving <https://builds.apache.org/job/Aries/ws/aries/jpa/jpa-container-advancedtestbundle/pom.xml> to /home/hudson/hudson/jobs/Aries/modules/org.apache.aries.jpa$org.apache.aries.jpa.container.advanced.itest.bundle/builds/2013-08-01_12-54-41/archive/org.apache.aries.jpa/org.apache.aries.jpa.container.advanced.itest.bundle/1.0.1-SNAPSHOT/org.apache.aries.jpa.container.advanced.itest.bundle-1.0.1-SNAPSHOT.pom
[JENKINS] Archiving <https://builds.apache.org/job/Aries/ws/aries/application/application-resolve-transform-cm-itests/pom.xml> to /home/hudson/hudson/jobs/Aries/modules/org.apache.aries.application$org.apache.aries.application.resolve.transform.cm.itests/builds/2013-08-01_12-54-37/archive/org.apache.aries.application/org.apache.aries.application.resolve.transform.cm.itests/1.0.1-SNAPSHOT/org.apache.aries.application.resolve.transform.cm.itests-1.0.1-SNAPSHOT.pom
[JENKINS] Archiving <https://builds.apache.org/job/Aries/ws/aries/application/application-resolve-transform-cm-itests/target/org.apache.aries.application.resolve.transform.cm.itests-1.0.1-SNAPSHOT.jar> to /home/hudson/hudson/jobs/Aries/modules/org.apache.aries.application$org.apache.aries.application.resolve.transform.cm.itests/builds/2013-08-01_12-54-37/archive/org.apache.aries.application/org.apache.aries.application.resolve.transform.cm.itests/1.0.1-SNAPSHOT/org.apache.aries.application.resolve.transform.cm.itests-1.0.1-SNAPSHOT.jar
[JENKINS] Archiving <https://builds.apache.org/job/Aries/ws/aries/application/application-utils/pom.xml> to /home/hudson/hudson/jobs/Aries/modules/org.apache.aries.application$org.apache.aries.application.utils/builds/2013-08-01_12-54-36/archive/org.apache.aries.application/org.apache.aries.application.utils/1.0.1-SNAPSHOT/org.apache.aries.application.utils-1.0.1-SNAPSHOT.pom
[JENKINS] Archiving <https://builds.apache.org/job/Aries/ws/aries/application/application-utils/target/org.apache.aries.application.utils-1.0.1-SNAPSHOT.jar> to /home/hudson/hudson/jobs/Aries/modules/org.apache.aries.application$org.apache.aries.application.utils/builds/2013-08-01_12-54-36/archive/org.apache.aries.application/org.apache.aries.application.utils/1.0.1-SNAPSHOT/org.apache.aries.application.utils-1.0.1-SNAPSHOT.jar
[JENKINS] Archiving <https://builds.apache.org/job/Aries/ws/aries/samples/blog/blog-persistence-jdbc/pom.xml> to /home/hudson/hudson/jobs/Aries/modules/org.apache.aries.samples.blog$org.apache.aries.samples.blog.persistence.jdbc/builds/2013-08-01_12-54-44/archive/org.apache.aries.samples.blog/org.apache.aries.samples.blog.persistence.jdbc/1.0.1-SNAPSHOT/org.apache.aries.samples.blog.persistence.jdbc-1.0.1-SNAPSHOT.pom
[JENKINS] Archiving <https://builds.apache.org/job/Aries/ws/aries/application/application-converters/pom.xml> to /home/hudson/hudson/jobs/Aries/modules/org.apache.aries.application$org.apache.aries.application.converters/builds/2013-08-01_12-54-36/archive/org.apache.aries.application/org.apache.aries.application.converters/1.0.1-SNAPSHOT/org.apache.aries.application.converters-1.0.1-SNAPSHOT.pom
[JENKINS] Archiving <https://builds.apache.org/job/Aries/ws/aries/application/application-converters/target/org.apache.aries.application.converters-1.0.1-SNAPSHOT.jar> to /home/hudson/hudson/jobs/Aries/modules/org.apache.aries.application$org.apache.aries.application.converters/builds/2013-08-01_12-54-36/archive/org.apache.aries.application/org.apache.aries.application.converters/1.0.1-SNAPSHOT/org.apache.aries.application.converters-1.0.1-SNAPSHOT.jar
[JENKINS] Archiving <https://builds.apache.org/job/Aries/ws/aries/ejb/pom.xml> to /home/hudson/hudson/jobs/Aries/modules/org.apache.aries.ejb$ejb/builds/2013-08-01_12-54-39/archive/org.apache.aries.ejb/ejb/1.0.0-SNAPSHOT/ejb-1.0.0-SNAPSHOT.pom
[JENKINS] Archiving <https://builds.apache.org/job/Aries/ws/aries/subsystem/subsystem-itests/pom.xml> to /home/hudson/hudson/jobs/Aries/modules/org.apache.aries.subsystem$org.apache.aries.subsystem.itests/builds/2013-08-01_12-54-39/archive/org.apache.aries.subsystem/org.apache.aries.subsystem.itests/1.0.0-SNAPSHOT/org.apache.aries.subsystem.itests-1.0.0-SNAPSHOT.pom
[JENKINS] Archiving <https://builds.apache.org/job/Aries/ws/aries/subsystem/subsystem-itests/target/org.apache.aries.subsystem.itests-1.0.0-SNAPSHOT.jar> to /home/hudson/hudson/jobs/Aries/modules/org.apache.aries.subsystem$org.apache.aries.subsystem.itests/builds/2013-08-01_12-54-39/archive/org.apache.aries.subsystem/org.apache.aries.subsystem.itests/1.0.0-SNAPSHOT/org.apache.aries.subsystem.itests-1.0.0-SNAPSHOT.jar
[JENKINS] Archiving <https://builds.apache.org/job/Aries/ws/aries/blueprint/blueprint-itests/pom.xml> to /home/hudson/hudson/jobs/Aries/modules/org.apache.aries.blueprint$org.apache.aries.blueprint.itests/builds/2013-08-01_12-54-32/archive/org.apache.aries.blueprint/org.apache.aries.blueprint.itests/1.0.2-SNAPSHOT/org.apache.aries.blueprint.itests-1.0.2-SNAPSHOT.pom
[JENKINS] Archiving <https://builds.apache.org/job/Aries/ws/aries/blueprint/blueprint-itests/target/org.apache.aries.blueprint.itests-1.0.2-SNAPSHOT.jar> to /home/hudson/hudson/jobs/Aries/modules/org.apache.aries.blueprint$org.apache.aries.blueprint.itests/builds/2013-08-01_12-54-32/archive/org.apache.aries.blueprint/org.apache.aries.blueprint.itests/1.0.2-SNAPSHOT/org.apache.aries.blueprint.itests-1.0.2-SNAPSHOT.jar
[JENKINS] Archiving <https://builds.apache.org/job/Aries/ws/aries/samples/blueprint/helloworld/helloworld-eba/pom.xml> to /home/hudson/hudson/jobs/Aries/modules/org.apache.aries.samples.blueprint.helloworld$org.apache.aries.samples.blueprint.helloworld.eba/builds/2013-08-01_12-54-47/archive/org.apache.aries.samples.blueprint.helloworld/org.apache.aries.samples.blueprint.helloworld.eba/1.0.1-SNAPSHOT/org.apache.aries.samples.blueprint.helloworld.eba-1.0.1-SNAPSHOT.pom
[JENKINS] Archiving <https://builds.apache.org/job/Aries/ws/aries/jpa/jpa-api/pom.xml> to /home/hudson/hudson/jobs/Aries/modules/org.apache.aries.jpa$org.apache.aries.jpa.api/builds/2013-08-01_12-54-41/archive/org.apache.aries.jpa/org.apache.aries.jpa.api/1.0.1-SNAPSHOT/org.apache.aries.jpa.api-1.0.1-SNAPSHOT.pom
[JENKINS] Archiving <https://builds.apache.org/job/Aries/ws/aries/subsystem/subsystem-obr/pom.xml> to /home/hudson/hudson/jobs/Aries/modules/org.apache.aries.subsystem$org.apache.aries.subsystem.obr/builds/2013-08-01_12-54-38/archive/org.apache.aries.subsystem/org.apache.aries.subsystem.obr/1.0.1-SNAPSHOT/org.apache.aries.subsystem.obr-1.0.1-SNAPSHOT.pom
[JENKINS] Archiving <https://builds.apache.org/job/Aries/ws/aries/subsystem/subsystem-obr/target/org.apache.aries.subsystem.obr-1.0.1-SNAPSHOT.jar> to /home/hudson/hudson/jobs/Aries/modules/org.apache.aries.subsystem$org.apache.aries.subsystem.obr/builds/2013-08-01_12-54-38/archive/org.apache.aries.subsystem/org.apache.aries.subsystem.obr/1.0.1-SNAPSHOT/org.apache.aries.subsystem.obr-1.0.1-SNAPSHOT.jar
[JENKINS] Archiving <https://builds.apache.org/job/Aries/ws/aries/jmx/jmx-whiteboard/pom.xml> to /home/hudson/hudson/jobs/Aries/modules/org.apache.aries.jmx$org.apache.aries.jmx.whiteboard/builds/2013-08-01_12-54-40/archive/org.apache.aries.jmx/org.apache.aries.jmx.whiteboard/1.1.0-SNAPSHOT/org.apache.aries.jmx.whiteboard-1.1.0-SNAPSHOT.pom
[JENKINS] Archiving <https://builds.apache.org/job/Aries/ws/aries/jmx/jmx-whiteboard/target/org.apache.aries.jmx.whiteboard-1.1.0-SNAPSHOT.jar> to /home/hudson/hudson/jobs/Aries/modules/org.apache.aries.jmx$org.apache.aries.jmx.whiteboard/builds/2013-08-01_12-54-40/archive/org.apache.aries.jmx/org.apache.aries.jmx.whiteboard/1.1.0-SNAPSHOT/org.apache.aries.jmx.whiteboard-1.1.0-SNAPSHOT.jar
[JENKINS] Archiving <https://builds.apache.org/job/Aries/ws/aries/jndi/jndi-url-itest/pom.xml> to /home/hudson/hudson/jobs/Aries/modules/org.apache.aries.jndi$org.apache.aries.jndi.url.itest/builds/2013-08-01_12-54-34/archive/org.apache.aries.jndi/org.apache.aries.jndi.url.itest/1.0.1-SNAPSHOT/org.apache.aries.jndi.url.itest-1.0.1-SNAPSHOT.pom
[JENKINS] Archiving <https://builds.apache.org/job/Aries/ws/aries/jndi/jndi-url-itest/target/org.apache.aries.jndi.url.itest-1.0.1-SNAPSHOT.jar> to /home/hudson/hudson/jobs/Aries/modules/org.apache.aries.jndi$org.apache.aries.jndi.url.itest/builds/2013-08-01_12-54-34/archive/org.apache.aries.jndi/org.apache.aries.jndi.url.itest/1.0.1-SNAPSHOT/org.apache.aries.jndi.url.itest-1.0.1-SNAPSHOT.jar
[JENKINS] Archiving <https://builds.apache.org/job/Aries/ws/aries/versioning/pom.xml> to /home/hudson/hudson/jobs/Aries/modules/org.apache.aries.versioning$org.apache.aries.versioning/builds/2013-08-01_12-54-29/archive/org.apache.aries.versioning/org.apache.aries.versioning/0.1.0-SNAPSHOT/org.apache.aries.versioning-0.1.0-SNAPSHOT.pom
[JENKINS] Archiving <https://builds.apache.org/job/Aries/ws/aries/parent/default-parent/pom.xml> to /home/hudson/hudson/jobs/Aries/modules/org.apache.aries$default-parent/builds/2013-08-01_12-54-27/archive/org.apache.aries/default-parent/1.1.0-SNAPSHOT/default-parent-1.1.0-SNAPSHOT.pom
[JENKINS] Archiving <https://builds.apache.org/job/Aries/ws/aries/samples/ariestrader/modules/ariestrader-persist-jdbc/pom.xml> to /home/hudson/hudson/jobs/Aries/modules/org.apache.aries.samples.ariestrader$org.apache.aries.samples.ariestrader.persist.jdbc/builds/2013-08-01_12-54-46/archive/org.apache.aries.samples.ariestrader/org.apache.aries.samples.ariestrader.persist.jdbc/1.0.1-SNAPSHOT/org.apache.aries.samples.ariestrader.persist.jdbc-1.0.1-SNAPSHOT.pom
[JENKINS] Archiving <https://builds.apache.org/job/Aries/ws/aries/samples/twitter/twitter-itests/pom.xml> to /home/hudson/hudson/jobs/Aries/modules/org.apache.aries.samples.twitter$org.apache.aries.samples.twitter.itests/builds/2013-08-01_12-54-48/archive/org.apache.aries.samples.twitter/org.apache.aries.samples.twitter.itests/1.0.1-SNAPSHOT/org.apache.aries.samples.twitter.itests-1.0.1-SNAPSHOT.pom
[JENKINS] Archiving <https://builds.apache.org/job/Aries/ws/aries/jpa/jpa-blueprint-testbundle/pom.xml> to /home/hudson/hudson/jobs/Aries/modules/org.apache.aries.jpa$org.apache.aries.jpa.blueprint.itest.bundle/builds/2013-08-01_12-54-41/archive/org.apache.aries.jpa/org.apache.aries.jpa.blueprint.itest.bundle/1.0.1-SNAPSHOT/org.apache.aries.jpa.blueprint.itest.bundle-1.0.1-SNAPSHOT.pom
[JENKINS] Archiving <https://builds.apache.org/job/Aries/ws/aries/transaction/transaction-itests/pom.xml> to /home/hudson/hudson/jobs/Aries/modules/org.apache.aries.transaction$org.apache.aries.transaction.itests/builds/2013-08-01_12-54-35/archive/org.apache.aries.transaction/org.apache.aries.transaction.itests/1.0.1-SNAPSHOT/org.apache.aries.transaction.itests-1.0.1-SNAPSHOT.pom
[JENKINS] Archiving <https://builds.apache.org/job/Aries/ws/aries/transaction/transaction-itests/target/org.apache.aries.transaction.itests-1.0.1-SNAPSHOT.jar> to /home/hudson/hudson/jobs/Aries/modules/org.apache.aries.transaction$org.apache.aries.transaction.itests/builds/2013-08-01_12-54-35/archive/org.apache.aries.transaction/org.apache.aries.transaction.itests/1.0.1-SNAPSHOT/org.apache.aries.transaction.itests-1.0.1-SNAPSHOT.jar
[JENKINS] Archiving <https://builds.apache.org/job/Aries/ws/aries/samples/ariestrader/assemblies/ariestrader-jdbc-eba/pom.xml> to /home/hudson/hudson/jobs/Aries/modules/org.apache.aries.samples.ariestrader$org.apache.aries.samples.ariestrader.jdbc/builds/2013-08-01_12-54-46/archive/org.apache.aries.samples.ariestrader/org.apache.aries.samples.ariestrader.jdbc/1.0.1-SNAPSHOT/org.apache.aries.samples.ariestrader.jdbc-1.0.1-SNAPSHOT.pom
[JENKINS] Archiving <https://builds.apache.org/job/Aries/ws/aries/jmx/jmx-api/pom.xml> to /home/hudson/hudson/jobs/Aries/modules/org.apache.aries.jmx$org.apache.aries.jmx.api/builds/2013-08-01_12-54-40/archive/org.apache.aries.jmx/org.apache.aries.jmx.api/1.1.1-SNAPSHOT/org.apache.aries.jmx.api-1.1.1-SNAPSHOT.pom
[JENKINS] Archiving <https://builds.apache.org/job/Aries/ws/aries/jmx/jmx-api/target/org.apache.aries.jmx.api-1.1.1-SNAPSHOT.jar> to /home/hudson/hudson/jobs/Aries/modules/org.apache.aries.jmx$org.apache.aries.jmx.api/builds/2013-08-01_12-54-40/archive/org.apache.aries.jmx/org.apache.aries.jmx.api/1.1.1-SNAPSHOT/org.apache.aries.jmx.api-1.1.1-SNAPSHOT.jar
[JENKINS] Archiving <https://builds.apache.org/job/Aries/ws/aries/jmx/jmx-blueprint-bundle/dependency-reduced-pom.xml> to /home/hudson/hudson/jobs/Aries/modules/org.apache.aries.jmx$org.apache.aries.jmx.blueprint/builds/2013-08-01_12-54-40/archive/org.apache.aries.jmx/org.apache.aries.jmx.blueprint/1.1.2-SNAPSHOT/org.apache.aries.jmx.blueprint-1.1.2-SNAPSHOT.pom
[JENKINS] Archiving <https://builds.apache.org/job/Aries/ws/aries/jmx/jmx-blueprint-bundle/target/org.apache.aries.jmx.blueprint-1.1.2-SNAPSHOT.jar> to /home/hudson/hudson/jobs/Aries/modules/org.apache.aries.jmx$org.apache.aries.jmx.blueprint/builds/2013-08-01_12-54-40/archive/org.apache.aries.jmx/org.apache.aries.jmx.blueprint/1.1.2-SNAPSHOT/org.apache.aries.jmx.blueprint-1.1.2-SNAPSHOT.jar
[JENKINS] Archiving <https://builds.apache.org/job/Aries/ws/aries/blueprint/blueprint-annotation-itest/pom.xml> to /home/hudson/hudson/jobs/Aries/modules/org.apache.aries.blueprint$org.apache.aries.blueprint.annotation.itests/builds/2013-08-01_12-54-32/archive/org.apache.aries.blueprint/org.apache.aries.blueprint.annotation.itests/1.0.1-SNAPSHOT/org.apache.aries.blueprint.annotation.itests-1.0.1-SNAPSHOT.pom
[JENKINS] Archiving <https://builds.apache.org/job/Aries/ws/aries/blueprint/blueprint-annotation-itest/target/org.apache.aries.blueprint.annotation.itests-1.0.1-SNAPSHOT.jar> to /home/hudson/hudson/jobs/Aries/modules/org.apache.aries.blueprint$org.apache.aries.blueprint.annotation.itests/builds/2013-08-01_12-54-32/archive/org.apache.aries.blueprint/org.apache.aries.blueprint.annotation.itests/1.0.1-SNAPSHOT/org.apache.aries.blueprint.annotation.itests-1.0.1-SNAPSHOT.jar
[JENKINS] Archiving <https://builds.apache.org/job/Aries/ws/aries/proxy/proxy-api/pom.xml> to /home/hudson/hudson/jobs/Aries/modules/org.apache.aries.proxy$org.apache.aries.proxy.api/builds/2013-08-01_12-54-29/archive/org.apache.aries.proxy/org.apache.aries.proxy.api/1.0.1-SNAPSHOT/org.apache.aries.proxy.api-1.0.1-SNAPSHOT.pom
[JENKINS] Archiving <https://builds.apache.org/job/Aries/ws/aries/proxy/proxy-api/target/org.apache.aries.proxy.api-1.0.1-SNAPSHOT.jar> to /home/hudson/hudson/jobs/Aries/modules/org.apache.aries.proxy$org.apache.aries.proxy.api/builds/2013-08-01_12-54-29/archive/org.apache.aries.proxy/org.apache.aries.proxy.api/1.0.1-SNAPSHOT/org.apache.aries.proxy.api-1.0.1-SNAPSHOT.jar
[JENKINS] Archiving <https://builds.apache.org/job/Aries/ws/aries/application/application-noop-resolver/pom.xml> to /home/hudson/hudson/jobs/Aries/modules/org.apache.aries.application$org.apache.aries.application.resolver.noop/builds/2013-08-01_12-54-37/archive/org.apache.aries.application/org.apache.aries.application.resolver.noop/1.0.1-SNAPSHOT/org.apache.aries.application.resolver.noop-1.0.1-SNAPSHOT.pom
[JENKINS] Archiving <https://builds.apache.org/job/Aries/ws/aries/application/application-noop-resolver/target/org.apache.aries.application.resolver.noop-1.0.1-SNAPSHOT.jar> to /home/hudson/hudson/jobs/Aries/modules/org.apache.aries.application$org.apache.aries.application.resolver.noop/builds/2013-08-01_12-54-37/archive/org.apache.aries.application/org.apache.aries.application.resolver.noop/1.0.1-SNAPSHOT/org.apache.aries.application.resolver.noop-1.0.1-SNAPSHOT.jar
[JENKINS] Archiving <https://builds.apache.org/job/Aries/ws/aries/testsupport/pom.xml> to /home/hudson/hudson/jobs/Aries/modules/org.apache.aries.testsupport$testsupport/builds/2013-08-01_12-54-28/archive/org.apache.aries.testsupport/testsupport/1.0.1-SNAPSHOT/testsupport-1.0.1-SNAPSHOT.pom
[JENKINS] Archiving <https://builds.apache.org/job/Aries/ws/aries/util/pom.xml> to /home/hudson/hudson/jobs/Aries/modules/org.apache.aries$org.apache.aries.util-parent/builds/2013-08-01_12-54-28/archive/org.apache.aries/org.apache.aries.util-parent/1.1.1-SNAPSHOT/org.apache.aries.util-parent-1.1.1-SNAPSHOT.pom
[JENKINS] Archiving <https://builds.apache.org/job/Aries/ws/aries/spi-fly/pom.xml> to /home/hudson/hudson/jobs/Aries/modules/org.apache.aries.spifly$spifly/builds/2013-08-01_12-54-42/archive/org.apache.aries.spifly/spifly/1.0.0-SNAPSHOT/spifly-1.0.0-SNAPSHOT.pom
[JENKINS] Archiving <https://builds.apache.org/job/Aries/ws/aries/spi-fly/spi-fly-weaver/pom.xml> to /home/hudson/hudson/jobs/Aries/modules/org.apache.aries.spifly$org.apache.aries.spifly.weaver-internal/builds/2013-08-01_12-54-42/archive/org.apache.aries.spifly/org.apache.aries.spifly.weaver-internal/1.0.1-SNAPSHOT/org.apache.aries.spifly.weaver-internal-1.0.1-SNAPSHOT.pom
[JENKINS] Archiving <https://builds.apache.org/job/Aries/ws/aries/pom.xml> to /home/hudson/hudson/jobs/Aries/modules/org.apache.aries$aries/builds/2013-08-01_12-54-26/archive/org.apache.aries/aries/1.0.0-SNAPSHOT/aries-1.0.0-SNAPSHOT.pom
[JENKINS] Archiving <https://builds.apache.org/job/Aries/ws/aries/samples/ariestrader/modules/ariestrader-beans/pom.xml> to /home/hudson/hudson/jobs/Aries/modules/org.apache.aries.samples.ariestrader$org.apache.aries.samples.ariestrader.beans/builds/2013-08-01_12-54-45/archive/org.apache.aries.samples.ariestrader/org.apache.aries.samples.ariestrader.beans/1.0.1-SNAPSHOT/org.apache.aries.samples.ariestrader.beans-1.0.1-SNAPSHOT.pom
[JENKINS] Archiving <https://builds.apache.org/job/Aries/ws/aries/samples/ariestrader/assemblies/ariestrader-all-eba/pom.xml> to /home/hudson/hudson/jobs/Aries/modules/org.apache.aries.samples.ariestrader$org.apache.aries.samples.ariestrader.all/builds/2013-08-01_12-54-46/archive/org.apache.aries.samples.ariestrader/org.apache.aries.samples.ariestrader.all/1.0.1-SNAPSHOT/org.apache.aries.samples.ariestrader.all-1.0.1-SNAPSHOT.pom
[JENKINS] Archiving <https://builds.apache.org/job/Aries/ws/aries/samples/ariestrader/modules/ariestrader-persist-jpa-am/pom.xml> to /home/hudson/hudson/jobs/Aries/modules/org.apache.aries.samples.ariestrader$org.apache.aries.samples.ariestrader.persist.jpa.am/builds/2013-08-01_12-54-46/archive/org.apache.aries.samples.ariestrader/org.apache.aries.samples.ariestrader.persist.jpa.am/1.0.1-SNAPSHOT/org.apache.aries.samples.ariestrader.persist.jpa.am-1.0.1-SNAPSHOT.pom
[JENKINS] Archiving <https://builds.apache.org/job/Aries/ws/aries/samples/pom.xml> to /home/hudson/hudson/jobs/Aries/modules/org.apache.aries.samples$samples/builds/2013-08-01_12-54-43/archive/org.apache.aries.samples/samples/1.0.1-SNAPSHOT/samples-1.0.1-SNAPSHOT.pom
[JENKINS] Archiving <https://builds.apache.org/job/Aries/ws/aries/jpa/jpa-container/pom.xml> to /home/hudson/hudson/jobs/Aries/modules/org.apache.aries.jpa$org.apache.aries.jpa.container/builds/2013-08-01_12-54-41/archive/org.apache.aries.jpa/org.apache.aries.jpa.container/1.0.1-SNAPSHOT/org.apache.aries.jpa.container-1.0.1-SNAPSHOT.pom
[JENKINS] Archiving <https://builds.apache.org/job/Aries/ws/aries/samples/blueprint/helloworld/pom.xml> to /home/hudson/hudson/jobs/Aries/modules/org.apache.aries.samples$helloworld/builds/2013-08-01_12-54-47/archive/org.apache.aries.samples/helloworld/1.0.1-SNAPSHOT/helloworld-1.0.1-SNAPSHOT.pom
[JENKINS] Archiving <https://builds.apache.org/job/Aries/ws/aries/ejb/openejb-extender/pom.xml> to /home/hudson/hudson/jobs/Aries/modules/org.apache.aries.ejb$org.apache.aries.ejb.openejb.extender/builds/2013-08-01_12-54-39/archive/org.apache.aries.ejb/org.apache.aries.ejb.openejb.extender/1.0.1-SNAPSHOT/org.apache.aries.ejb.openejb.extender-1.0.1-SNAPSHOT.pom
[JENKINS] Archiving <https://builds.apache.org/job/Aries/ws/aries/ejb/openejb-extender/target/org.apache.aries.ejb.openejb.extender-1.0.1-SNAPSHOT.jar> to /home/hudson/hudson/jobs/Aries/modules/org.apache.aries.ejb$org.apache.aries.ejb.openejb.extender/builds/2013-08-01_12-54-39/archive/org.apache.aries.ejb/org.apache.aries.ejb.openejb.extender/1.0.1-SNAPSHOT/org.apache.aries.ejb.openejb.extender-1.0.1-SNAPSHOT.jar
[JENKINS] Archiving <https://builds.apache.org/job/Aries/ws/aries/samples/ariestrader/modules/ariestrader-util/pom.xml> to /home/hudson/hudson/jobs/Aries/modules/org.apache.aries.samples.ariestrader$org.apache.aries.samples.ariestrader.util/builds/2013-08-01_12-54-45/archive/org.apache.aries.samples.ariestrader/org.apache.aries.samples.ariestrader.util/1.0.1-SNAPSHOT/org.apache.aries.samples.ariestrader.util-1.0.1-SNAPSHOT.pom
[JENKINS] Archiving <https://builds.apache.org/job/Aries/ws/aries/application/application-runtime/pom.xml> to /home/hudson/hudson/jobs/Aries/modules/org.apache.aries.application$org.apache.aries.application.runtime/builds/2013-08-01_12-54-37/archive/org.apache.aries.application/org.apache.aries.application.runtime/1.0.1-SNAPSHOT/org.apache.aries.application.runtime-1.0.1-SNAPSHOT.pom
[JENKINS] Archiving <https://builds.apache.org/job/Aries/ws/aries/application/application-runtime/target/org.apache.aries.application.runtime-1.0.1-SNAPSHOT.jar> to /home/hudson/hudson/jobs/Aries/modules/org.apache.aries.application$org.apache.aries.application.runtime/builds/2013-08-01_12-54-37/archive/org.apache.aries.application/org.apache.aries.application.runtime/1.0.1-SNAPSHOT/org.apache.aries.application.runtime-1.0.1-SNAPSHOT.jar
[JENKINS] Archiving <https://builds.apache.org/job/Aries/ws/aries/jpa/jpa-container-itest/pom.xml> to /home/hudson/hudson/jobs/Aries/modules/org.apache.aries.jpa$org.apache.aries.jpa.container.itest/builds/2013-08-01_12-54-41/archive/org.apache.aries.jpa/org.apache.aries.jpa.container.itest/1.0.1-SNAPSHOT/org.apache.aries.jpa.container.itest-1.0.1-SNAPSHOT.pom
[JENKINS] Archiving <https://builds.apache.org/job/Aries/ws/aries/quiesce/quiesce-manager-itest/pom.xml> to /home/hudson/hudson/jobs/Aries/modules/org.apache.aries.quiesce$org.apache.aries.quiesce.manager.itest/builds/2013-08-01_12-54-30/archive/org.apache.aries.quiesce/org.apache.aries.quiesce.manager.itest/1.0.1-SNAPSHOT/org.apache.aries.quiesce.manager.itest-1.0.1-SNAPSHOT.pom
[JENKINS] Archiving <https://builds.apache.org/job/Aries/ws/aries/quiesce/quiesce-manager-itest/target/org.apache.aries.quiesce.manager.itest-1.0.1-SNAPSHOT.jar> to /home/hudson/hudson/jobs/Aries/modules/org.apache.aries.quiesce$org.apache.aries.quiesce.manager.itest/builds/2013-08-01_12-54-30/archive/org.apache.aries.quiesce/org.apache.aries.quiesce.manager.itest/1.0.1-SNAPSHOT/org.apache.aries.quiesce.manager.itest-1.0.1-SNAPSHOT.jar
[JENKINS] Archiving <https://builds.apache.org/job/Aries/ws/aries/transaction/transaction-jdbc/pom.xml> to /home/hudson/hudson/jobs/Aries/modules/org.apache.aries.transaction$org.apache.aries.transaction.jdbc/builds/2013-08-01_12-54-34/archive/org.apache.aries.transaction/org.apache.aries.transaction.jdbc/2.0.0-SNAPSHOT/org.apache.aries.transaction.jdbc-2.0.0-SNAPSHOT.pom
[JENKINS] Archiving <https://builds.apache.org/job/Aries/ws/aries/transaction/transaction-jdbc/target/org.apache.aries.transaction.jdbc-2.0.0-SNAPSHOT.jar> to /home/hudson/hudson/jobs/Aries/modules/org.apache.aries.transaction$org.apache.aries.transaction.jdbc/builds/2013-08-01_12-54-34/archive/org.apache.aries.transaction/org.apache.aries.transaction.jdbc/2.0.0-SNAPSHOT/org.apache.aries.transaction.jdbc-2.0.0-SNAPSHOT.jar
[JENKINS] Archiving <https://builds.apache.org/job/Aries/ws/aries/transaction/transaction-jdbc/target/xbean/org.apache.aries.transaction.jdbc.xsd> to /home/hudson/hudson/jobs/Aries/modules/org.apache.aries.transaction$org.apache.aries.transaction.jdbc/builds/2013-08-01_12-54-34/archive/org.apache.aries.transaction/org.apache.aries.transaction.jdbc/2.0.0-SNAPSHOT/org.apache.aries.transaction.jdbc-2.0.0-SNAPSHOT.xsd
[JENKINS] Archiving <https://builds.apache.org/job/Aries/ws/aries/transaction/transaction-jdbc/target/xbean/org.apache.aries.transaction.jdbc.xsd.html> to /home/hudson/hudson/jobs/Aries/modules/org.apache.aries.transaction$org.apache.aries.transaction.jdbc/builds/2013-08-01_12-54-34/archive/org.apache.aries.transaction/org.apache.aries.transaction.jdbc/2.0.0-SNAPSHOT/org.apache.aries.transaction.jdbc-2.0.0-SNAPSHOT-schema.html
[JENKINS] Archiving <https://builds.apache.org/job/Aries/ws/aries/samples/blueprint/idverifier/pom.xml> to /home/hudson/hudson/jobs/Aries/modules/org.apache.aries.samples.blueprint.idverifier$idverifier/builds/2013-08-01_12-54-47/archive/org.apache.aries.samples.blueprint.idverifier/idverifier/1.0.1-SNAPSHOT/idverifier-1.0.1-SNAPSHOT.pom
[JENKINS] Archiving <https://builds.apache.org/job/Aries/ws/aries/blueprint/blueprint-annotation-impl/pom.xml> to /home/hudson/hudson/jobs/Aries/modules/org.apache.aries.blueprint$org.apache.aries.blueprint.annotation.impl/builds/2013-08-01_12-54-31/archive/org.apache.aries.blueprint/org.apache.aries.blueprint.annotation.impl/1.0.1-SNAPSHOT/org.apache.aries.blueprint.annotation.impl-1.0.1-SNAPSHOT.pom
[JENKINS] Archiving <https://builds.apache.org/job/Aries/ws/aries/blueprint/blueprint-annotation-impl/target/org.apache.aries.blueprint.annotation.impl-1.0.1-SNAPSHOT.jar> to /home/hudson/hudson/jobs/Aries/modules/org.apache.aries.blueprint$org.apache.aries.blueprint.annotation.impl/builds/2013-08-01_12-54-31/archive/org.apache.aries.blueprint/org.apache.aries.blueprint.annotation.impl/1.0.1-SNAPSHOT/org.apache.aries.blueprint.annotation.impl-1.0.1-SNAPSHOT.jar
[JENKINS] Archiving <https://builds.apache.org/job/Aries/ws/aries/application/application-modeller-standalone/pom.xml> to /home/hudson/hudson/jobs/Aries/modules/org.apache.aries.application$application-modeller-standalone/builds/2013-08-01_12-54-37/archive/org.apache.aries.application/application-modeller-standalone/1.0.1-SNAPSHOT/application-modeller-standalone-1.0.1-SNAPSHOT.pom
[JENKINS] Archiving <https://builds.apache.org/job/Aries/ws/aries/application/application-modeller-standalone/target/application-modeller-standalone-1.0.1-SNAPSHOT.jar> to /home/hudson/hudson/jobs/Aries/modules/org.apache.aries.application$application-modeller-standalone/builds/2013-08-01_12-54-37/archive/org.apache.aries.application/application-modeller-standalone/1.0.1-SNAPSHOT/application-modeller-standalone-1.0.1-SNAPSHOT.jar
[JENKINS] Archiving <https://builds.apache.org/job/Aries/ws/aries/application/application-modeller-standalone/target/application-modeller-standalone-1.0.1-SNAPSHOT-jar-with-dependencies.jar> to /home/hudson/hudson/jobs/Aries/modules/org.apache.aries.application$application-modeller-standalone/builds/2013-08-01_12-54-37/archive/org.apache.aries.application/application-modeller-standalone/1.0.1-SNAPSHOT/application-modeller-standalone-1.0.1-SNAPSHOT-jar-with-dependencies.jar
[JENKINS] Archiving <https://builds.apache.org/job/Aries/ws/aries/jmx/jmx-blueprint-core/pom.xml> to /home/hudson/hudson/jobs/Aries/modules/org.apache.aries.jmx$org.apache.aries.jmx.blueprint.core/builds/2013-08-01_12-54-40/archive/org.apache.aries.jmx/org.apache.aries.jmx.blueprint.core/1.1.1-SNAPSHOT/org.apache.aries.jmx.blueprint.core-1.1.1-SNAPSHOT.pom
[JENKINS] Archiving <https://builds.apache.org/job/Aries/ws/aries/jmx/jmx-blueprint-core/target/org.apache.aries.jmx.blueprint.core-1.1.1-SNAPSHOT.jar> to /home/hudson/hudson/jobs/Aries/modules/org.apache.aries.jmx$org.apache.aries.jmx.blueprint.core/builds/2013-08-01_12-54-40/archive/org.apache.aries.jmx/org.apache.aries.jmx.blueprint.core/1.1.1-SNAPSHOT/org.apache.aries.jmx.blueprint.core-1.1.1-SNAPSHOT.jar
[JENKINS] Archiving <https://builds.apache.org/job/Aries/ws/aries/samples/blog/blog-comment-ejb/pom.xml> to /home/hudson/hudson/jobs/Aries/modules/org.apache.aries.samples.blog$org.apache.aries.samples.blog.comment.ejb/builds/2013-08-01_12-54-44/archive/org.apache.aries.samples.blog/org.apache.aries.samples.blog.comment.ejb/1.0.1-SNAPSHOT/org.apache.aries.samples.blog.comment.ejb-1.0.1-SNAPSHOT.pom
[JENKINS] Archiving <https://builds.apache.org/job/Aries/ws/aries/application/application-default-local-platform/pom.xml> to /home/hudson/hudson/jobs/Aries/modules/org.apache.aries.application$org.apache.aries.application.default.local.platform/builds/2013-08-01_12-54-36/archive/org.apache.aries.application/org.apache.aries.application.default.local.platform/1.0.1-SNAPSHOT/org.apache.aries.application.default.local.platform-1.0.1-SNAPSHOT.pom
[JENKINS] Archiving <https://builds.apache.org/job/Aries/ws/aries/application/application-default-local-platform/target/org.apache.aries.application.default.local.platform-1.0.1-SNAPSHOT.jar> to /home/hudson/hudson/jobs/Aries/modules/org.apache.aries.application$org.apache.aries.application.default.local.platform/builds/2013-08-01_12-54-36/archive/org.apache.aries.application/org.apache.aries.application.default.local.platform/1.0.1-SNAPSHOT/org.apache.aries.application.default.local.platform-1.0.1-SNAPSHOT.jar
[JENKINS] Archiving <https://builds.apache.org/job/Aries/ws/aries/blueprint/blueprint-core-compatibility/pom.xml> to /home/hudson/hudson/jobs/Aries/modules/org.apache.aries.blueprint$org.apache.aries.blueprint.core.compatibility/builds/2013-08-01_12-54-31/archive/org.apache.aries.blueprint/org.apache.aries.blueprint.core.compatibility/1.0.1-SNAPSHOT/org.apache.aries.blueprint.core.compatibility-1.0.1-SNAPSHOT.pom
[JENKINS] Archiving <https://builds.apache.org/job/Aries/ws/aries/blueprint/blueprint-core-compatibility/target/org.apache.aries.blueprint.core.compatibility-1.0.1-SNAPSHOT.jar> to /home/hudson/hudson/jobs/Aries/modules/org.apache.aries.blueprint$org.apache.aries.blueprint.core.compatibility/builds/2013-08-01_12-54-31/archive/org.apache.aries.blueprint/org.apache.aries.blueprint.core.compatibility/1.0.1-SNAPSHOT/org.apache.aries.blueprint.core.compatibility-1.0.1-SNAPSHOT.jar
[JENKINS] Archiving <https://builds.apache.org/job/Aries/ws/aries/blueprint/blueprint-core/pom.xml> to /home/hudson/hudson/jobs/Aries/modules/org.apache.aries.blueprint$org.apache.aries.blueprint.core/builds/2013-08-01_12-54-30/archive/org.apache.aries.blueprint/org.apache.aries.blueprint.core/1.2.0-SNAPSHOT/org.apache.aries.blueprint.core-1.2.0-SNAPSHOT.pom
[JENKINS] Archiving <https://builds.apache.org/job/Aries/ws/aries/blueprint/blueprint-core/target/org.apache.aries.blueprint.core-1.2.0-SNAPSHOT.jar> to /home/hudson/hudson/jobs/Aries/modules/org.apache.aries.blueprint$org.apache.aries.blueprint.core/builds/2013-08-01_12-54-30/archive/org.apache.aries.blueprint/org.apache.aries.blueprint.core/1.2.0-SNAPSHOT/org.apache.aries.blueprint.core-1.2.0-SNAPSHOT.jar
[JENKINS] Archiving <https://builds.apache.org/job/Aries/ws/aries/blueprint/blueprint-sample-annotation/pom.xml> to /home/hudson/hudson/jobs/Aries/modules/org.apache.aries.blueprint$org.apache.aries.blueprint.sample-annotation/builds/2013-08-01_12-54-32/archive/org.apache.aries.blueprint/org.apache.aries.blueprint.sample-annotation/1.0.1-SNAPSHOT/org.apache.aries.blueprint.sample-annotation-1.0.1-SNAPSHOT.pom
[JENKINS] Archiving <https://builds.apache.org/job/Aries/ws/aries/blueprint/blueprint-sample-annotation/target/org.apache.aries.blueprint.sample-annotation-1.0.1-SNAPSHOT.jar> to /home/hudson/hudson/jobs/Aries/modules/org.apache.aries.blueprint$org.apache.aries.blueprint.sample-annotation/builds/2013-08-01_12-54-32/archive/org.apache.aries.blueprint/org.apache.aries.blueprint.sample-annotation/1.0.1-SNAPSHOT/org.apache.aries.blueprint.sample-annotation-1.0.1-SNAPSHOT.jar
[JENKINS] Archiving <https://builds.apache.org/job/Aries/ws/aries/samples/ariestrader/modules/pom.xml> to /home/hudson/hudson/jobs/Aries/modules/org.apache.aries.samples.ariestrader$modules/builds/2013-08-01_12-54-45/archive/org.apache.aries.samples.ariestrader/modules/1.0.1-SNAPSHOT/modules-1.0.1-SNAPSHOT.pom
[JENKINS] Archiving <https://builds.apache.org/job/Aries/ws/aries/jndi/jndi-api/pom.xml> to /home/hudson/hudson/jobs/Aries/modules/org.apache.aries.jndi$org.apache.aries.jndi.api/builds/2013-08-01_12-54-33/archive/org.apache.aries.jndi/org.apache.aries.jndi.api/1.0.1-SNAPSHOT/org.apache.aries.jndi.api-1.0.1-SNAPSHOT.pom
[JENKINS] Archiving <https://builds.apache.org/job/Aries/ws/aries/jndi/jndi-api/target/org.apache.aries.jndi.api-1.0.1-SNAPSHOT.jar> to /home/hudson/hudson/jobs/Aries/modules/org.apache.aries.jndi$org.apache.aries.jndi.api/builds/2013-08-01_12-54-33/archive/org.apache.aries.jndi/org.apache.aries.jndi.api/1.0.1-SNAPSHOT/org.apache.aries.jndi.api-1.0.1-SNAPSHOT.jar
[JENKINS] Archiving <https://builds.apache.org/job/Aries/ws/aries/samples/blog/blog-jdbc-eba/pom.xml> to /home/hudson/hudson/jobs/Aries/modules/org.apache.aries.samples.blog$org.apache.aries.samples.blog.jdbc.eba/builds/2013-08-01_12-54-44/archive/org.apache.aries.samples.blog/org.apache.aries.samples.blog.jdbc.eba/1.0.1-SNAPSHOT/org.apache.aries.samples.blog.jdbc.eba-1.0.1-SNAPSHOT.pom
[JENKINS] Archiving <https://builds.apache.org/job/Aries/ws/aries/application/application-install/pom.xml> to /home/hudson/hudson/jobs/Aries/modules/org.apache.aries.application$org.apache.aries.application.install/builds/2013-08-01_12-54-36/archive/org.apache.aries.application/org.apache.aries.application.install/1.0.1-SNAPSHOT/org.apache.aries.application.install-1.0.1-SNAPSHOT.pom
[JENKINS] Archiving <https://builds.apache.org/job/Aries/ws/aries/application/application-install/target/org.apache.aries.application.install-1.0.1-SNAPSHOT.jar> to /home/hudson/hudson/jobs/Aries/modules/org.apache.aries.application$org.apache.aries.application.install/builds/2013-08-01_12-54-36/archive/org.apache.aries.application/org.apache.aries.application.install/1.0.1-SNAPSHOT/org.apache.aries.application.install-1.0.1-SNAPSHOT.jar
[JENKINS] Archiving <https://builds.apache.org/job/Aries/ws/aries/samples/blog/blog-assembly/pom.xml> to /home/hudson/hudson/jobs/Aries/modules/org.apache.aries.samples.blog$org.apache.aries.samples.blog.assembly/builds/2013-08-01_12-54-44/archive/org.apache.aries.samples.blog/org.apache.aries.samples.blog.assembly/1.0.1-SNAPSHOT/org.apache.aries.samples.blog.assembly-1.0.1-SNAPSHOT.pom
[JENKINS] Archiving <https://builds.apache.org/job/Aries/ws/aries/jpa/jpa-container-context/pom.xml> to /home/hudson/hudson/jobs/Aries/modules/org.apache.aries.jpa$org.apache.aries.jpa.container.context/builds/2013-08-01_12-54-41/archive/org.apache.aries.jpa/org.apache.aries.jpa.container.context/1.0.2-SNAPSHOT/org.apache.aries.jpa.container.context-1.0.2-SNAPSHOT.pom
[JENKINS] Archiving <https://builds.apache.org/job/Aries/ws/aries/blueprint/blueprint-noosgi/dependency-reduced-pom.xml> to /home/hudson/hudson/jobs/Aries/modules/org.apache.aries.blueprint$org.apache.aries.blueprint.noosgi/builds/2013-08-01_12-54-31/archive/org.apache.aries.blueprint/org.apache.aries.blueprint.noosgi/1.0.1-SNAPSHOT/org.apache.aries.blueprint.noosgi-1.0.1-SNAPSHOT.pom
[JENKINS] Archiving <https://builds.apache.org/job/Aries/ws/aries/blueprint/blueprint-noosgi/target/org.apache.aries.blueprint.noosgi-1.0.1-SNAPSHOT.jar> to /home/hudson/hudson/jobs/Aries/modules/org.apache.aries.blueprint$org.apache.aries.blueprint.noosgi/builds/2013-08-01_12-54-31/archive/org.apache.aries.blueprint/org.apache.aries.blueprint.noosgi/1.0.1-SNAPSHOT/org.apache.aries.blueprint.noosgi-1.0.1-SNAPSHOT.jar
[JENKINS] Archiving <https://builds.apache.org/job/Aries/ws/aries/parent/default-parent/java6-parent/pom.xml> to /home/hudson/hudson/jobs/Aries/modules/org.apache.aries$java6-parent/builds/2013-08-01_12-54-27/archive/org.apache.aries/java6-parent/1.1.0-SNAPSHOT/java6-parent-1.1.0-SNAPSHOT.pom
[JENKINS] Archiving <https://builds.apache.org/job/Aries/ws/aries/quiesce/quiesce-manager/pom.xml> to /home/hudson/hudson/jobs/Aries/modules/org.apache.aries.quiesce$org.apache.aries.quiesce.manager/builds/2013-08-01_12-54-30/archive/org.apache.aries.quiesce/org.apache.aries.quiesce.manager/1.0.1-SNAPSHOT/org.apache.aries.quiesce.manager-1.0.1-SNAPSHOT.pom
[JENKINS] Archiving <https://builds.apache.org/job/Aries/ws/aries/quiesce/quiesce-manager/target/org.apache.aries.quiesce.manager-1.0.1-SNAPSHOT.jar> to /home/hudson/hudson/jobs/Aries/modules/org.apache.aries.quiesce$org.apache.aries.quiesce.manager/builds/2013-08-01_12-54-30/archive/org.apache.aries.quiesce/org.apache.aries.quiesce.manager/1.0.1-SNAPSHOT/org.apache.aries.quiesce.manager-1.0.1-SNAPSHOT.jar
[JENKINS] Archiving <https://builds.apache.org/job/Aries/ws/aries/parent/pom.xml> to /home/hudson/hudson/jobs/Aries/modules/org.apache.aries$parent/builds/2013-08-01_12-54-27/archive/org.apache.aries/parent/1.0.1-SNAPSHOT/parent-1.0.1-SNAPSHOT.pom
[JENKINS] Archiving <https://builds.apache.org/job/Aries/ws/aries/spi-fly/spi-fly-examples/spi-fly-example-provider2-bundle/pom.xml> to /home/hudson/hudson/jobs/Aries/modules/org.apache.aries.spifly.examples$org.apache.aries.spifly.examples.provider2.bundle/builds/2013-08-01_12-54-43/archive/org.apache.aries.spifly.examples/org.apache.aries.spifly.examples.provider2.bundle/1.0.1-SNAPSHOT/org.apache.aries.spifly.examples.provider2.bundle-1.0.1-SNAPSHOT.pom
[JENKINS] Archiving <https://builds.apache.org/job/Aries/ws/aries/blueprint/blueprint-sample-war/pom.xml> to /home/hudson/hudson/jobs/Aries/modules/org.apache.aries.blueprint$org.apache.aries.blueprint.sample.war/builds/2013-08-01_12-54-32/archive/org.apache.aries.blueprint/org.apache.aries.blueprint.sample.war/1.0.1-SNAPSHOT/org.apache.aries.blueprint.sample.war-1.0.1-SNAPSHOT.pom
[JENKINS] Archiving <https://builds.apache.org/job/Aries/ws/aries/blueprint/blueprint-sample-war/target/org.apache.aries.blueprint.sample.war-1.0.1-SNAPSHOT.war> to /home/hudson/hudson/jobs/Aries/modules/org.apache.aries.blueprint$org.apache.aries.blueprint.sample.war/builds/2013-08-01_12-54-32/archive/org.apache.aries.blueprint/org.apache.aries.blueprint.sample.war/1.0.1-SNAPSHOT/org.apache.aries.blueprint.sample.war-1.0.1-SNAPSHOT.war
[JENKINS] Archiving <https://builds.apache.org/job/Aries/ws/aries/jndi/jndi-url-itest-biz/pom.xml> to /home/hudson/hudson/jobs/Aries/modules/org.apache.aries.jndi$org.apache.aries.jndi.url.itest.biz/builds/2013-08-01_12-54-34/archive/org.apache.aries.jndi/org.apache.aries.jndi.url.itest.biz/1.0.1-SNAPSHOT/org.apache.aries.jndi.url.itest.biz-1.0.1-SNAPSHOT.pom
[JENKINS] Archiving <https://builds.apache.org/job/Aries/ws/aries/jndi/jndi-url-itest-biz/target/org.apache.aries.jndi.url.itest.biz-1.0.1-SNAPSHOT.jar> to /home/hudson/hudson/jobs/Aries/modules/org.apache.aries.jndi$org.apache.aries.jndi.url.itest.biz/builds/2013-08-01_12-54-34/archive/org.apache.aries.jndi/org.apache.aries.jndi.url.itest.biz/1.0.1-SNAPSHOT/org.apache.aries.jndi.url.itest.biz-1.0.1-SNAPSHOT.jar
Waiting for Jenkins to finish collecting data
mavenExecutionResult exceptions not empty
message : Internal error: hudson.remoting.RemotingSystemException: java.io.UTFDataFormatException
cause : java.io.UTFDataFormatException
Stack trace : 
org.apache.maven.InternalErrorException: Internal error: hudson.remoting.RemotingSystemException: java.io.UTFDataFormatException
	at org.apache.maven.lifecycle.internal.BuilderCommon.handleBuildError(BuilderCommon.java:128)
	at org.apache.maven.lifecycle.internal.LifecycleModuleBuilder.buildProject(LifecycleModuleBuilder.java:95)
	at org.apache.maven.lifecycle.internal.LifecycleModuleBuilder.buildProject(LifecycleModuleBuilder.java:59)
	at org.apache.maven.lifecycle.internal.LifecycleStarter.singleThreadedBuild(LifecycleStarter.java:183)
	at org.apache.maven.lifecycle.internal.LifecycleStarter.execute(LifecycleStarter.java:161)
	at org.apache.maven.DefaultMaven.doExecute(DefaultMaven.java:320)
	at org.apache.maven.DefaultMaven.execute(DefaultMaven.java:156)
	at org.jvnet.hudson.maven3.launcher.Maven3Launcher.main(Maven3Launcher.java:117)
	at sun.reflect.NativeMethodAccessorImpl.invoke0(Native Method)
	at sun.reflect.NativeMethodAccessorImpl.invoke(NativeMethodAccessorImpl.java:39)
	at sun.reflect.DelegatingMethodAccessorImpl.invoke(DelegatingMethodAccessorImpl.java:25)
	at java.lang.reflect.Method.invoke(Method.java:597)
	at org.codehaus.plexus.classworlds.launcher.Launcher.launchStandard(Launcher.java:329)
	at org.codehaus.plexus.classworlds.launcher.Launcher.launch(Launcher.java:239)
	at org.jvnet.hudson.maven3.agent.Maven3Main.launch(Maven3Main.java:178)
	at sun.reflect.NativeMethodAccessorImpl.invoke0(Native Method)
	at sun.reflect.NativeMethodAccessorImpl.invoke(NativeMethodAccessorImpl.java:39)
	at sun.reflect.DelegatingMethodAccessorImpl.invoke(DelegatingMethodAccessorImpl.java:25)
	at java.lang.reflect.Method.invoke(Method.java:597)
	at hudson.maven.Maven3Builder.call(Maven3Builder.java:129)
	at hudson.maven.Maven3Builder.call(Maven3Builder.java:67)
	at hudson.remoting.UserRequest.perform(UserRequest.java:118)
	at hudson.remoting.UserRequest.perform(UserRequest.java:48)
	at hudson.remoting.Request$2.run(Request.java:326)
	at hudson.remoting.InterceptingExecutorService$1.call(InterceptingExecutorService.java:72)
	at java.util.concurrent.FutureTask$Sync.innerRun(FutureTask.java:303)
	at java.util.concurrent.FutureTask.run(FutureTask.java:138)
	at java.util.concurrent.ThreadPoolExecutor$Worker.runTask(ThreadPoolExecutor.java:895)
	at java.util.concurrent.ThreadPoolExecutor$Worker.run(ThreadPoolExecutor.java:918)
	at java.lang.Thread.run(Thread.java:662)
Caused by: hudson.remoting.RemotingSystemException: java.io.UTFDataFormatException
	at hudson.remoting.RemoteInvocationHandler.invoke(RemoteInvocationHandler.java:183)
	at com.sun.proxy.$Proxy7.setExecutedMojos(Unknown Source)
	at hudson.maven.MavenBuildProxy$Filter.setExecutedMojos(MavenBuildProxy.java:243)
	at hudson.maven.Maven3Builder$MavenExecutionListener.recordMojoEnded(Maven3Builder.java:574)
	at hudson.maven.Maven3Builder$MavenExecutionListener.mojoSucceeded(Maven3Builder.java:560)
	at org.apache.maven.lifecycle.internal.DefaultExecutionEventCatapult.fire(DefaultExecutionEventCatapult.java:87)
	at org.apache.maven.lifecycle.internal.DefaultExecutionEventCatapult.fire(DefaultExecutionEventCatapult.java:42)
	at org.apache.maven.lifecycle.internal.MojoExecutor.execute(MojoExecutor.java:228)
	at org.apache.maven.lifecycle.internal.MojoExecutor.execute(MojoExecutor.java:153)
	at org.apache.maven.lifecycle.internal.MojoExecutor.execute(MojoExecutor.java:145)
	at org.apache.maven.lifecycle.internal.LifecycleModuleBuilder.buildProject(LifecycleModuleBuilder.java:84)
	... 28 more
Caused by: java.io.UTFDataFormatException
	at java.io.ObjectInputStream$BlockDataInputStream.readUTFSpan(ObjectInputStream.java:3105)
	at java.io.ObjectInputStream$BlockDataInputStream.readUTFBody(ObjectInputStream.java:3049)
	at java.io.ObjectInputStream$BlockDataInputStream.readUTF(ObjectInputStream.java:2862)
	at java.io.ObjectInputStream.readString(ObjectInputStream.java:1636)
	at java.io.ObjectInputStream.readObject0(ObjectInputStream.java:1339)
	at java.io.ObjectInputStream.defaultReadFields(ObjectInputStream.java:1989)
	at java.io.ObjectInputStream.readSerialData(ObjectInputStream.java:1913)
	at java.io.ObjectInputStream.readOrdinaryObject(ObjectInputStream.java:1796)
	at java.io.ObjectInputStream.readObject0(ObjectInputStream.java:1348)
	at java.io.ObjectInputStream.readArray(ObjectInputStream.java:1704)
	at java.io.ObjectInputStream.readObject0(ObjectInputStream.java:1342)
	at java.io.ObjectInputStream.defaultReadFields(ObjectInputStream.java:1989)
	at java.io.ObjectInputStream.defaultReadObject(ObjectInputStream.java:499)
	at java.lang.Throwable.readObject(Throwable.java:913)
	at sun.reflect.GeneratedMethodAccessor129.invoke(Unknown Source)
	at sun.reflect.DelegatingMethodAccessorImpl.invoke(DelegatingMethodAccessorImpl.java:43)
	at java.lang.reflect.Method.invoke(Method.java:606)
	at java.io.ObjectStreamClass.invokeReadObject(ObjectStreamClass.java:1017)
	at java.io.ObjectInputStream.readSerialData(ObjectInputStream.java:1891)
	at java.io.ObjectInputStream.readOrdinaryObject(ObjectInputStream.java:1796)
	at java.io.ObjectInputStream.readObject0(ObjectInputStream.java:1348)
	at java.io.ObjectInputStream.defaultReadFields(ObjectInputStream.java:1989)
	at java.io.ObjectInputStream.readSerialData(ObjectInputStream.java:1913)
	at java.io.ObjectInputStream.readOrdinaryObject(ObjectInputStream.java:1796)
	at java.io.ObjectInputStream.readObject0(ObjectInputStream.java:1348)
	at java.io.ObjectInputStream.readObject(ObjectInputStream.java:370)
	at hudson.remoting.UserRequest.deserialize(UserRequest.java:182)
	at hudson.remoting.UserRequest.perform(UserRequest.java:98)
	at hudson.remoting.UserRequest.perform(UserRequest.java:48)
	at hudson.remoting.Request$2.run(Request.java:326)
	at hudson.remoting.InterceptingExecutorService$1.call(InterceptingExecutorService.java:72)
	at java.util.concurrent.FutureTask$Sync.innerRun(FutureTask.java:334)
	at java.util.concurrent.FutureTask.run(FutureTask.java:166)
	at java.util.concurrent.ThreadPoolExecutor.runWorker(ThreadPoolExecutor.java:1145)
	at java.util.concurrent.ThreadPoolExecutor$Worker.run(ThreadPoolExecutor.java:615)
	at java.lang.Thread.run(Thread.java:724)
Sending e-mails to: dev@aries.apache.org
channel stopped

Jenkins build is back to normal : Aries #1881

Posted by Apache Jenkins Server <je...@builds.apache.org>.
See <https://builds.apache.org/job/Aries/1881/changes>