You are viewing a plain text version of this content. The canonical link for it is here.
Posted to mapreduce-dev@hadoop.apache.org by Apache Jenkins Server <je...@builds.apache.org> on 2016/05/11 05:14:16 UTC

Hadoop-Mapreduce-trunk - Build # 3303 - Still Failing

See https://builds.apache.org/job/Hadoop-Mapreduce-trunk/3303/

###################################################################################
########################## LAST 60 LINES OF THE CONSOLE ###########################
[...truncated 32648 lines...]
[INFO] --- maven-antrun-plugin:1.7:run (create-testdirs) @ hadoop-mapreduce ---
[INFO] Executing tasks

main:
[INFO] Executed tasks
[INFO] 
[INFO] --- maven-antrun-plugin:1.7:run (tar) @ hadoop-mapreduce ---
[INFO] Executing tasks

main:
[INFO] Executed tasks
[INFO] 
[INFO] --- maven-site-plugin:3.5:attach-descriptor (attach-descriptor) @ hadoop-mapreduce ---
[INFO] 
[INFO] --- maven-enforcer-plugin:1.3.1:enforce (depcheck) @ hadoop-mapreduce ---
[INFO] 
[INFO] --- maven-install-plugin:2.5.1:install (default-install) @ hadoop-mapreduce ---
[INFO] Installing /home/jenkins/jenkins-slave/workspace/Hadoop-Mapreduce-trunk/hadoop-mapreduce-project/pom.xml to /home/jenkins/.m2/repository/org/apache/hadoop/hadoop-mapreduce/3.0.0-SNAPSHOT/hadoop-mapreduce-3.0.0-SNAPSHOT.pom
[INFO] ------------------------------------------------------------------------
[INFO] Reactor Summary:
[INFO] 
[INFO] Apache Hadoop MapReduce Client .................... SUCCESS [  3.875 s]
[INFO] Apache Hadoop MapReduce Core ...................... SUCCESS [02:23 min]
[INFO] Apache Hadoop MapReduce Common .................... SUCCESS [ 36.018 s]
[INFO] Apache Hadoop MapReduce Shuffle ................... SUCCESS [  7.066 s]
[INFO] Apache Hadoop MapReduce App ....................... SUCCESS [09:59 min]
[INFO] Apache Hadoop MapReduce HistoryServer ............. SUCCESS [06:43 min]
[INFO] Apache Hadoop MapReduce JobClient ................. FAILURE [  02:02 h]
[INFO] Apache Hadoop MapReduce HistoryServer Plugins ..... SUCCESS [  1.920 s]
[INFO] Apache Hadoop MapReduce NativeTask ................ SUCCESS [11:04 min]
[INFO] Apache Hadoop MapReduce Examples .................. SKIPPED
[INFO] Apache Hadoop MapReduce ........................... SUCCESS [  0.297 s]
[INFO] ------------------------------------------------------------------------
[INFO] BUILD FAILURE
[INFO] ------------------------------------------------------------------------
[INFO] Total time: 02:33 h
[INFO] Finished at: 2016-05-11T05:14:06+00:00
[INFO] Final Memory: 36M/720M
[INFO] ------------------------------------------------------------------------
[WARNING] The requested profile "parallel-tests" could not be activated because it does not exist.
[ERROR] Failed to execute goal org.apache.maven.plugins:maven-surefire-plugin:2.17:test (default-test) on project hadoop-mapreduce-client-jobclient: There are test failures.
[ERROR] 
[ERROR] Please refer to /home/jenkins/jenkins-slave/workspace/Hadoop-Mapreduce-trunk/hadoop-mapreduce-project/hadoop-mapreduce-client/hadoop-mapreduce-client-jobclient/target/surefire-reports for the individual test results.
[ERROR] -> [Help 1]
[ERROR] 
[ERROR] To see the full stack trace of the errors, re-run Maven with the -e switch.
[ERROR] Re-run Maven using the -X switch to enable full debug logging.
[ERROR] 
[ERROR] For more information about the errors and possible solutions, please read the following articles:
[ERROR] [Help 1] http://cwiki.apache.org/confluence/display/MAVEN/MojoFailureException
[ERROR] 
[ERROR] After correcting the problems, you can resume the build with the command
[ERROR]   mvn <goals> -rf :hadoop-mapreduce-client-jobclient
Build step 'Execute shell' marked build as failure
[FINDBUGS] Skipping publisher since build result is FAILURE
Archiving artifacts
Recording test results
Email was triggered for: Failure - Any
Sending email for trigger: Failure - Any



###################################################################################
############################## FAILED TESTS (if any) ##############################
2 tests failed.
FAILED:  org.apache.hadoop.mapred.TestMiniMRChildTask.testTaskEnv

Error Message:
The environment checker job failed.

Stack Trace:
java.lang.AssertionError: The environment checker job failed.
	at org.junit.Assert.fail(Assert.java:88)
	at org.junit.Assert.assertTrue(Assert.java:41)
	at org.apache.hadoop.mapred.TestMiniMRChildTask.runTestTaskEnv(TestMiniMRChildTask.java:550)
	at org.apache.hadoop.mapred.TestMiniMRChildTask.testTaskEnv(TestMiniMRChildTask.java:472)


FAILED:  org.apache.hadoop.mapred.TestMiniMRChildTask.testTaskOldEnv

Error Message:
The environment checker job failed.

Stack Trace:
java.lang.AssertionError: The environment checker job failed.
	at org.junit.Assert.fail(Assert.java:88)
	at org.junit.Assert.assertTrue(Assert.java:41)
	at org.apache.hadoop.mapred.TestMiniMRChildTask.runTestTaskEnv(TestMiniMRChildTask.java:550)
	at org.apache.hadoop.mapred.TestMiniMRChildTask.testTaskOldEnv(TestMiniMRChildTask.java:496)




Hadoop-Mapreduce-trunk - Build # 3328 - Still Failing

Posted by Apache Jenkins Server <je...@builds.apache.org>.
See https://builds.apache.org/job/Hadoop-Mapreduce-trunk/3328/

###################################################################################
########################## LAST 60 LINES OF THE CONSOLE ###########################
[...truncated 315 lines...]
[INFO] ------------------------------------------------------------------------
[INFO] Building Apache Hadoop MapReduce 3.0.0-alpha1-SNAPSHOT
[INFO] ------------------------------------------------------------------------
[INFO] 
[INFO] --- maven-antrun-plugin:1.7:run (create-testdirs) @ hadoop-mapreduce ---
[INFO] Executing tasks

main:
    [mkdir] Created dir: /home/jenkins/jenkins-slave/workspace/Hadoop-Mapreduce-trunk/hadoop-mapreduce-project/target/test-dir
[INFO] Executed tasks
[INFO] 
[INFO] --- maven-antrun-plugin:1.7:run (tar) @ hadoop-mapreduce ---
[INFO] Executing tasks

main:
[INFO] Executed tasks
[INFO] 
[INFO] --- maven-site-plugin:3.5:attach-descriptor (attach-descriptor) @ hadoop-mapreduce ---
[INFO] 
[INFO] --- maven-enforcer-plugin:1.3.1:enforce (depcheck) @ hadoop-mapreduce ---
[INFO] 
[INFO] --- maven-install-plugin:2.5.1:install (default-install) @ hadoop-mapreduce ---
[INFO] Installing /home/jenkins/jenkins-slave/workspace/Hadoop-Mapreduce-trunk/hadoop-mapreduce-project/pom.xml to /home/jenkins/.m2/repository/org/apache/hadoop/hadoop-mapreduce/3.0.0-alpha1-SNAPSHOT/hadoop-mapreduce-3.0.0-alpha1-SNAPSHOT.pom
[INFO] ------------------------------------------------------------------------
[INFO] Reactor Summary:
[INFO] 
[INFO] Apache Hadoop MapReduce Client .................... FAILURE [  2.955 s]
[INFO] Apache Hadoop MapReduce Core ...................... SKIPPED
[INFO] Apache Hadoop MapReduce Common .................... SKIPPED
[INFO] Apache Hadoop MapReduce Shuffle ................... SKIPPED
[INFO] Apache Hadoop MapReduce App ....................... SKIPPED
[INFO] Apache Hadoop MapReduce HistoryServer ............. SKIPPED
[INFO] Apache Hadoop MapReduce JobClient ................. SKIPPED
[INFO] Apache Hadoop MapReduce HistoryServer Plugins ..... SKIPPED
[INFO] Apache Hadoop MapReduce NativeTask ................ SKIPPED
[INFO] Apache Hadoop MapReduce Examples .................. SKIPPED
[INFO] Apache Hadoop MapReduce ........................... SUCCESS [  0.522 s]
[INFO] ------------------------------------------------------------------------
[INFO] BUILD FAILURE
[INFO] ------------------------------------------------------------------------
[INFO] Total time: 4.921 s
[INFO] Finished at: 2016-05-17T01:30:54+00:00
[INFO] Final Memory: 23M/723M
[INFO] ------------------------------------------------------------------------
[WARNING] The requested profile "parallel-tests" could not be activated because it does not exist.
[ERROR] Failed to execute goal org.apache.maven.plugins:maven-enforcer-plugin:1.3.1:enforce (depcheck) on project hadoop-mapreduce-client: Some Enforcer rules have failed. Look above for specific messages explaining why the rule failed. -> [Help 1]
[ERROR] 
[ERROR] To see the full stack trace of the errors, re-run Maven with the -e switch.
[ERROR] Re-run Maven using the -X switch to enable full debug logging.
[ERROR] 
[ERROR] For more information about the errors and possible solutions, please read the following articles:
[ERROR] [Help 1] http://cwiki.apache.org/confluence/display/MAVEN/MojoExecutionException
Build step 'Execute shell' marked build as failure
[FINDBUGS] Skipping publisher since build result is FAILURE
Archiving artifacts
Recording test results
ERROR: Step ?Publish JUnit test result report? failed: No test report files were found. Configuration error?
Email was triggered for: Failure - Any
Sending email for trigger: Failure - Any



###################################################################################
############################## FAILED TESTS (if any) ##############################
No tests ran.

Hadoop-Mapreduce-trunk - Build # 3327 - Still Failing

Posted by Apache Jenkins Server <je...@builds.apache.org>.
See https://builds.apache.org/job/Hadoop-Mapreduce-trunk/3327/

###################################################################################
########################## LAST 60 LINES OF THE CONSOLE ###########################
[...truncated 6054 lines...]
and
+-org.apache.hadoop:hadoop-mapreduce:3.0.0-alpha1-SNAPSHOT
  +-org.apache.hadoop:hadoop-annotations:3.0.0-alpha1-20160516.224859-15
and
+-org.apache.hadoop:hadoop-mapreduce:3.0.0-alpha1-SNAPSHOT
  +-org.apache.hadoop:hadoop-common:3.0.0-alpha1-20160516.224934-10
    +-org.apache.hadoop:hadoop-annotations:3.0.0-alpha1-SNAPSHOT

[WARNING] Rule 0: org.apache.maven.plugins.enforcer.DependencyConvergence failed with message:
Failed while enforcing releasability the error(s) are [
Dependency convergence error for org.apache.hadoop:hadoop-annotations:3.0.0-alpha1-SNAPSHOT paths to dependency are:
+-org.apache.hadoop:hadoop-mapreduce:3.0.0-alpha1-SNAPSHOT
  +-org.apache.hadoop:hadoop-common:3.0.0-alpha1-20160516.224934-10
    +-org.apache.hadoop:hadoop-annotations:3.0.0-alpha1-SNAPSHOT
and
+-org.apache.hadoop:hadoop-mapreduce:3.0.0-alpha1-SNAPSHOT
  +-org.apache.hadoop:hadoop-annotations:3.0.0-alpha1-20160516.224859-15
and
+-org.apache.hadoop:hadoop-mapreduce:3.0.0-alpha1-SNAPSHOT
  +-org.apache.hadoop:hadoop-common:3.0.0-alpha1-20160516.224934-10
    +-org.apache.hadoop:hadoop-annotations:3.0.0-alpha1-SNAPSHOT
]
[INFO] ------------------------------------------------------------------------
[INFO] Reactor Summary:
[INFO] 
[INFO] Apache Hadoop MapReduce Client .................... FAILURE [  8.146 s]
[INFO] Apache Hadoop MapReduce Core ...................... SKIPPED
[INFO] Apache Hadoop MapReduce Common .................... SKIPPED
[INFO] Apache Hadoop MapReduce Shuffle ................... SKIPPED
[INFO] Apache Hadoop MapReduce App ....................... SKIPPED
[INFO] Apache Hadoop MapReduce HistoryServer ............. SKIPPED
[INFO] Apache Hadoop MapReduce JobClient ................. SKIPPED
[INFO] Apache Hadoop MapReduce HistoryServer Plugins ..... SKIPPED
[INFO] Apache Hadoop MapReduce NativeTask ................ SKIPPED
[INFO] Apache Hadoop MapReduce Examples .................. SKIPPED
[INFO] Apache Hadoop MapReduce ........................... FAILURE [  0.516 s]
[INFO] ------------------------------------------------------------------------
[INFO] BUILD FAILURE
[INFO] ------------------------------------------------------------------------
[INFO] Total time: 10.439 s
[INFO] Finished at: 2016-05-17T00:33:29+00:00
[INFO] Final Memory: 29M/913M
[INFO] ------------------------------------------------------------------------
[WARNING] The requested profile "parallel-tests" could not be activated because it does not exist.
[ERROR] Failed to execute goal org.apache.maven.plugins:maven-enforcer-plugin:1.3.1:enforce (depcheck) on project hadoop-mapreduce-client: Some Enforcer rules have failed. Look above for specific messages explaining why the rule failed. -> [Help 1]
[ERROR] Failed to execute goal org.apache.maven.plugins:maven-enforcer-plugin:1.3.1:enforce (depcheck) on project hadoop-mapreduce: Some Enforcer rules have failed. Look above for specific messages explaining why the rule failed. -> [Help 1]
[ERROR] 
[ERROR] To see the full stack trace of the errors, re-run Maven with the -e switch.
[ERROR] Re-run Maven using the -X switch to enable full debug logging.
[ERROR] 
[ERROR] For more information about the errors and possible solutions, please read the following articles:
[ERROR] [Help 1] http://cwiki.apache.org/confluence/display/MAVEN/MojoExecutionException
Build step 'Execute shell' marked build as failure
[FINDBUGS] Skipping publisher since build result is FAILURE
Archiving artifacts
Recording test results
ERROR: Step ?Publish JUnit test result report? failed: No test report files were found. Configuration error?
Email was triggered for: Failure - Any
Sending email for trigger: Failure - Any



###################################################################################
############################## FAILED TESTS (if any) ##############################
No tests ran.

Hadoop-Mapreduce-trunk - Build # 3326 - Still Failing

Posted by Apache Jenkins Server <je...@builds.apache.org>.
See https://builds.apache.org/job/Hadoop-Mapreduce-trunk/3326/

###################################################################################
########################## LAST 60 LINES OF THE CONSOLE ###########################
[...truncated 316 lines...]
[INFO] ------------------------------------------------------------------------
[INFO] Building Apache Hadoop MapReduce 3.0.0-alpha1-SNAPSHOT
[INFO] ------------------------------------------------------------------------
[INFO] 
[INFO] --- maven-antrun-plugin:1.7:run (create-testdirs) @ hadoop-mapreduce ---
[INFO] Executing tasks

main:
    [mkdir] Created dir: /home/jenkins/jenkins-slave/workspace/Hadoop-Mapreduce-trunk/hadoop-mapreduce-project/target/test-dir
[INFO] Executed tasks
[INFO] 
[INFO] --- maven-antrun-plugin:1.7:run (tar) @ hadoop-mapreduce ---
[INFO] Executing tasks

main:
[INFO] Executed tasks
[INFO] 
[INFO] --- maven-site-plugin:3.5:attach-descriptor (attach-descriptor) @ hadoop-mapreduce ---
[INFO] 
[INFO] --- maven-enforcer-plugin:1.3.1:enforce (depcheck) @ hadoop-mapreduce ---
[INFO] 
[INFO] --- maven-install-plugin:2.5.1:install (default-install) @ hadoop-mapreduce ---
[INFO] Installing /home/jenkins/jenkins-slave/workspace/Hadoop-Mapreduce-trunk/hadoop-mapreduce-project/pom.xml to /home/jenkins/.m2/repository/org/apache/hadoop/hadoop-mapreduce/3.0.0-alpha1-SNAPSHOT/hadoop-mapreduce-3.0.0-alpha1-SNAPSHOT.pom
[INFO] ------------------------------------------------------------------------
[INFO] Reactor Summary:
[INFO] 
[INFO] Apache Hadoop MapReduce Client .................... FAILURE [  3.147 s]
[INFO] Apache Hadoop MapReduce Core ...................... SKIPPED
[INFO] Apache Hadoop MapReduce Common .................... SKIPPED
[INFO] Apache Hadoop MapReduce Shuffle ................... SKIPPED
[INFO] Apache Hadoop MapReduce App ....................... SKIPPED
[INFO] Apache Hadoop MapReduce HistoryServer ............. SKIPPED
[INFO] Apache Hadoop MapReduce JobClient ................. SKIPPED
[INFO] Apache Hadoop MapReduce HistoryServer Plugins ..... SKIPPED
[INFO] Apache Hadoop MapReduce NativeTask ................ SKIPPED
[INFO] Apache Hadoop MapReduce Examples .................. SKIPPED
[INFO] Apache Hadoop MapReduce ........................... SUCCESS [  0.486 s]
[INFO] ------------------------------------------------------------------------
[INFO] BUILD FAILURE
[INFO] ------------------------------------------------------------------------
[INFO] Total time: 5.196 s
[INFO] Finished at: 2016-05-16T23:06:31+00:00
[INFO] Final Memory: 23M/723M
[INFO] ------------------------------------------------------------------------
[WARNING] The requested profile "parallel-tests" could not be activated because it does not exist.
[ERROR] Failed to execute goal org.apache.maven.plugins:maven-enforcer-plugin:1.3.1:enforce (depcheck) on project hadoop-mapreduce-client: Some Enforcer rules have failed. Look above for specific messages explaining why the rule failed. -> [Help 1]
[ERROR] 
[ERROR] To see the full stack trace of the errors, re-run Maven with the -e switch.
[ERROR] Re-run Maven using the -X switch to enable full debug logging.
[ERROR] 
[ERROR] For more information about the errors and possible solutions, please read the following articles:
[ERROR] [Help 1] http://cwiki.apache.org/confluence/display/MAVEN/MojoExecutionException
Build step 'Execute shell' marked build as failure
[FINDBUGS] Skipping publisher since build result is FAILURE
Archiving artifacts
Recording test results
ERROR: Step ?Publish JUnit test result report? failed: No test report files were found. Configuration error?
Email was triggered for: Failure - Any
Sending email for trigger: Failure - Any



###################################################################################
############################## FAILED TESTS (if any) ##############################
No tests ran.

Hadoop-Mapreduce-trunk - Build # 3325 - Still Failing

Posted by Apache Jenkins Server <je...@builds.apache.org>.
See https://builds.apache.org/job/Hadoop-Mapreduce-trunk/3325/

###################################################################################
########################## LAST 60 LINES OF THE CONSOLE ###########################
[...truncated 32703 lines...]
[INFO] --- maven-antrun-plugin:1.7:run (create-testdirs) @ hadoop-mapreduce ---
[INFO] Executing tasks

main:
[INFO] Executed tasks
[INFO] 
[INFO] --- maven-antrun-plugin:1.7:run (tar) @ hadoop-mapreduce ---
[INFO] Executing tasks

main:
[INFO] Executed tasks
[INFO] 
[INFO] --- maven-site-plugin:3.5:attach-descriptor (attach-descriptor) @ hadoop-mapreduce ---
[INFO] 
[INFO] --- maven-enforcer-plugin:1.3.1:enforce (depcheck) @ hadoop-mapreduce ---
[INFO] 
[INFO] --- maven-install-plugin:2.5.1:install (default-install) @ hadoop-mapreduce ---
[INFO] Installing /home/jenkins/jenkins-slave/workspace/Hadoop-Mapreduce-trunk/hadoop-mapreduce-project/pom.xml to /home/jenkins/.m2/repository/org/apache/hadoop/hadoop-mapreduce/3.0.0-alpha1-SNAPSHOT/hadoop-mapreduce-3.0.0-alpha1-SNAPSHOT.pom
[INFO] ------------------------------------------------------------------------
[INFO] Reactor Summary:
[INFO] 
[INFO] Apache Hadoop MapReduce Client .................... SUCCESS [  3.458 s]
[INFO] Apache Hadoop MapReduce Core ...................... SUCCESS [02:09 min]
[INFO] Apache Hadoop MapReduce Common .................... SUCCESS [ 31.947 s]
[INFO] Apache Hadoop MapReduce Shuffle ................... SUCCESS [  6.675 s]
[INFO] Apache Hadoop MapReduce App ....................... SUCCESS [08:45 min]
[INFO] Apache Hadoop MapReduce HistoryServer ............. SUCCESS [06:04 min]
[INFO] Apache Hadoop MapReduce JobClient ................. FAILURE [  01:48 h]
[INFO] Apache Hadoop MapReduce HistoryServer Plugins ..... SUCCESS [  1.653 s]
[INFO] Apache Hadoop MapReduce NativeTask ................ SUCCESS [12:08 min]
[INFO] Apache Hadoop MapReduce Examples .................. SKIPPED
[INFO] Apache Hadoop MapReduce ........................... SUCCESS [  0.302 s]
[INFO] ------------------------------------------------------------------------
[INFO] BUILD FAILURE
[INFO] ------------------------------------------------------------------------
[INFO] Total time: 02:18 h
[INFO] Finished at: 2016-05-16T22:40:51+00:00
[INFO] Final Memory: 35M/599M
[INFO] ------------------------------------------------------------------------
[WARNING] The requested profile "parallel-tests" could not be activated because it does not exist.
[ERROR] Failed to execute goal org.apache.maven.plugins:maven-surefire-plugin:2.17:test (default-test) on project hadoop-mapreduce-client-jobclient: There are test failures.
[ERROR] 
[ERROR] Please refer to /home/jenkins/jenkins-slave/workspace/Hadoop-Mapreduce-trunk/hadoop-mapreduce-project/hadoop-mapreduce-client/hadoop-mapreduce-client-jobclient/target/surefire-reports for the individual test results.
[ERROR] -> [Help 1]
[ERROR] 
[ERROR] To see the full stack trace of the errors, re-run Maven with the -e switch.
[ERROR] Re-run Maven using the -X switch to enable full debug logging.
[ERROR] 
[ERROR] For more information about the errors and possible solutions, please read the following articles:
[ERROR] [Help 1] http://cwiki.apache.org/confluence/display/MAVEN/MojoFailureException
[ERROR] 
[ERROR] After correcting the problems, you can resume the build with the command
[ERROR]   mvn <goals> -rf :hadoop-mapreduce-client-jobclient
Build step 'Execute shell' marked build as failure
[FINDBUGS] Skipping publisher since build result is FAILURE
Archiving artifacts
Recording test results
Email was triggered for: Failure - Any
Sending email for trigger: Failure - Any



###################################################################################
############################## FAILED TESTS (if any) ##############################
3 tests failed.
FAILED:  org.apache.hadoop.mapred.TestMRCJCFileOutputCommitter.testAbort

Error Message:
Output directory not empty expected:<0> but was:<4>

Stack Trace:
java.lang.AssertionError: Output directory not empty expected:<0> but was:<4>
	at org.junit.Assert.fail(Assert.java:88)
	at org.junit.Assert.failNotEquals(Assert.java:743)
	at org.junit.Assert.assertEquals(Assert.java:118)
	at org.junit.Assert.assertEquals(Assert.java:555)
	at org.apache.hadoop.mapred.TestMRCJCFileOutputCommitter.testAbort(TestMRCJCFileOutputCommitter.java:153)


FAILED:  org.apache.hadoop.mapred.TestMiniMRChildTask.testTaskEnv

Error Message:
The environment checker job failed.

Stack Trace:
java.lang.AssertionError: The environment checker job failed.
	at org.junit.Assert.fail(Assert.java:88)
	at org.junit.Assert.assertTrue(Assert.java:41)
	at org.apache.hadoop.mapred.TestMiniMRChildTask.runTestTaskEnv(TestMiniMRChildTask.java:550)
	at org.apache.hadoop.mapred.TestMiniMRChildTask.testTaskEnv(TestMiniMRChildTask.java:472)


FAILED:  org.apache.hadoop.mapred.TestMiniMRChildTask.testTaskOldEnv

Error Message:
The environment checker job failed.

Stack Trace:
java.lang.AssertionError: The environment checker job failed.
	at org.junit.Assert.fail(Assert.java:88)
	at org.junit.Assert.assertTrue(Assert.java:41)
	at org.apache.hadoop.mapred.TestMiniMRChildTask.runTestTaskEnv(TestMiniMRChildTask.java:550)
	at org.apache.hadoop.mapred.TestMiniMRChildTask.testTaskOldEnv(TestMiniMRChildTask.java:496)




Hadoop-Mapreduce-trunk - Build # 3324 - Still Failing

Posted by Apache Jenkins Server <je...@builds.apache.org>.
See https://builds.apache.org/job/Hadoop-Mapreduce-trunk/3324/

###################################################################################
########################## LAST 60 LINES OF THE CONSOLE ###########################
[...truncated 32686 lines...]
[INFO] --- maven-antrun-plugin:1.7:run (create-testdirs) @ hadoop-mapreduce ---
[INFO] Executing tasks

main:
[INFO] Executed tasks
[INFO] 
[INFO] --- maven-antrun-plugin:1.7:run (tar) @ hadoop-mapreduce ---
[INFO] Executing tasks

main:
[INFO] Executed tasks
[INFO] 
[INFO] --- maven-site-plugin:3.5:attach-descriptor (attach-descriptor) @ hadoop-mapreduce ---
[INFO] 
[INFO] --- maven-enforcer-plugin:1.3.1:enforce (depcheck) @ hadoop-mapreduce ---
[INFO] 
[INFO] --- maven-install-plugin:2.5.1:install (default-install) @ hadoop-mapreduce ---
[INFO] Installing /home/jenkins/jenkins-slave/workspace/Hadoop-Mapreduce-trunk/hadoop-mapreduce-project/pom.xml to /home/jenkins/.m2/repository/org/apache/hadoop/hadoop-mapreduce/3.0.0-alpha1-SNAPSHOT/hadoop-mapreduce-3.0.0-alpha1-SNAPSHOT.pom
[INFO] ------------------------------------------------------------------------
[INFO] Reactor Summary:
[INFO] 
[INFO] Apache Hadoop MapReduce Client .................... SUCCESS [  2.861 s]
[INFO] Apache Hadoop MapReduce Core ...................... SUCCESS [01:51 min]
[INFO] Apache Hadoop MapReduce Common .................... SUCCESS [ 28.769 s]
[INFO] Apache Hadoop MapReduce Shuffle ................... SUCCESS [  5.031 s]
[INFO] Apache Hadoop MapReduce App ....................... SUCCESS [08:32 min]
[INFO] Apache Hadoop MapReduce HistoryServer ............. SUCCESS [05:51 min]
[INFO] Apache Hadoop MapReduce JobClient ................. FAILURE [  01:42 h]
[INFO] Apache Hadoop MapReduce HistoryServer Plugins ..... SUCCESS [  1.461 s]
[INFO] Apache Hadoop MapReduce NativeTask ................ SUCCESS [08:48 min]
[INFO] Apache Hadoop MapReduce Examples .................. SKIPPED
[INFO] Apache Hadoop MapReduce ........................... SUCCESS [  0.244 s]
[INFO] ------------------------------------------------------------------------
[INFO] BUILD FAILURE
[INFO] ------------------------------------------------------------------------
[INFO] Total time: 02:08 h
[INFO] Finished at: 2016-05-16T19:05:38+00:00
[INFO] Final Memory: 36M/603M
[INFO] ------------------------------------------------------------------------
[WARNING] The requested profile "parallel-tests" could not be activated because it does not exist.
[ERROR] Failed to execute goal org.apache.maven.plugins:maven-surefire-plugin:2.17:test (default-test) on project hadoop-mapreduce-client-jobclient: There are test failures.
[ERROR] 
[ERROR] Please refer to /home/jenkins/jenkins-slave/workspace/Hadoop-Mapreduce-trunk/hadoop-mapreduce-project/hadoop-mapreduce-client/hadoop-mapreduce-client-jobclient/target/surefire-reports for the individual test results.
[ERROR] -> [Help 1]
[ERROR] 
[ERROR] To see the full stack trace of the errors, re-run Maven with the -e switch.
[ERROR] Re-run Maven using the -X switch to enable full debug logging.
[ERROR] 
[ERROR] For more information about the errors and possible solutions, please read the following articles:
[ERROR] [Help 1] http://cwiki.apache.org/confluence/display/MAVEN/MojoFailureException
[ERROR] 
[ERROR] After correcting the problems, you can resume the build with the command
[ERROR]   mvn <goals> -rf :hadoop-mapreduce-client-jobclient
Build step 'Execute shell' marked build as failure
[FINDBUGS] Skipping publisher since build result is FAILURE
Archiving artifacts
Recording test results
Email was triggered for: Failure - Any
Sending email for trigger: Failure - Any



###################################################################################
############################## FAILED TESTS (if any) ##############################
2 tests failed.
FAILED:  org.apache.hadoop.mapred.TestMiniMRChildTask.testTaskEnv

Error Message:
The environment checker job failed.

Stack Trace:
java.lang.AssertionError: The environment checker job failed.
	at org.junit.Assert.fail(Assert.java:88)
	at org.junit.Assert.assertTrue(Assert.java:41)
	at org.apache.hadoop.mapred.TestMiniMRChildTask.runTestTaskEnv(TestMiniMRChildTask.java:550)
	at org.apache.hadoop.mapred.TestMiniMRChildTask.testTaskEnv(TestMiniMRChildTask.java:472)


FAILED:  org.apache.hadoop.mapred.TestMiniMRChildTask.testTaskOldEnv

Error Message:
The environment checker job failed.

Stack Trace:
java.lang.AssertionError: The environment checker job failed.
	at org.junit.Assert.fail(Assert.java:88)
	at org.junit.Assert.assertTrue(Assert.java:41)
	at org.apache.hadoop.mapred.TestMiniMRChildTask.runTestTaskEnv(TestMiniMRChildTask.java:550)
	at org.apache.hadoop.mapred.TestMiniMRChildTask.testTaskOldEnv(TestMiniMRChildTask.java:496)




Hadoop-Mapreduce-trunk - Build # 3323 - Still Failing

Posted by Apache Jenkins Server <je...@builds.apache.org>.
See https://builds.apache.org/job/Hadoop-Mapreduce-trunk/3323/

###################################################################################
########################## LAST 60 LINES OF THE CONSOLE ###########################
[...truncated 32691 lines...]
[INFO] --- maven-antrun-plugin:1.7:run (create-testdirs) @ hadoop-mapreduce ---
[INFO] Executing tasks

main:
[INFO] Executed tasks
[INFO] 
[INFO] --- maven-antrun-plugin:1.7:run (tar) @ hadoop-mapreduce ---
[INFO] Executing tasks

main:
[INFO] Executed tasks
[INFO] 
[INFO] --- maven-site-plugin:3.5:attach-descriptor (attach-descriptor) @ hadoop-mapreduce ---
[INFO] 
[INFO] --- maven-enforcer-plugin:1.3.1:enforce (depcheck) @ hadoop-mapreduce ---
[INFO] 
[INFO] --- maven-install-plugin:2.5.1:install (default-install) @ hadoop-mapreduce ---
[INFO] Installing /home/jenkins/jenkins-slave/workspace/Hadoop-Mapreduce-trunk/hadoop-mapreduce-project/pom.xml to /home/jenkins/.m2/repository/org/apache/hadoop/hadoop-mapreduce/3.0.0-alpha1-SNAPSHOT/hadoop-mapreduce-3.0.0-alpha1-SNAPSHOT.pom
[INFO] ------------------------------------------------------------------------
[INFO] Reactor Summary:
[INFO] 
[INFO] Apache Hadoop MapReduce Client .................... SUCCESS [  2.902 s]
[INFO] Apache Hadoop MapReduce Core ...................... SUCCESS [01:58 min]
[INFO] Apache Hadoop MapReduce Common .................... SUCCESS [ 30.022 s]
[INFO] Apache Hadoop MapReduce Shuffle ................... SUCCESS [  5.271 s]
[INFO] Apache Hadoop MapReduce App ....................... SUCCESS [08:49 min]
[INFO] Apache Hadoop MapReduce HistoryServer ............. SUCCESS [05:59 min]
[INFO] Apache Hadoop MapReduce JobClient ................. FAILURE [  01:46 h]
[INFO] Apache Hadoop MapReduce HistoryServer Plugins ..... SUCCESS [  1.398 s]
[INFO] Apache Hadoop MapReduce NativeTask ................ SUCCESS [08:48 min]
[INFO] Apache Hadoop MapReduce Examples .................. SKIPPED
[INFO] Apache Hadoop MapReduce ........................... SUCCESS [  0.245 s]
[INFO] ------------------------------------------------------------------------
[INFO] BUILD FAILURE
[INFO] ------------------------------------------------------------------------
[INFO] Total time: 02:12 h
[INFO] Finished at: 2016-05-16T10:54:13+00:00
[INFO] Final Memory: 35M/592M
[INFO] ------------------------------------------------------------------------
[WARNING] The requested profile "parallel-tests" could not be activated because it does not exist.
[ERROR] Failed to execute goal org.apache.maven.plugins:maven-surefire-plugin:2.17:test (default-test) on project hadoop-mapreduce-client-jobclient: There are test failures.
[ERROR] 
[ERROR] Please refer to /home/jenkins/jenkins-slave/workspace/Hadoop-Mapreduce-trunk/hadoop-mapreduce-project/hadoop-mapreduce-client/hadoop-mapreduce-client-jobclient/target/surefire-reports for the individual test results.
[ERROR] -> [Help 1]
[ERROR] 
[ERROR] To see the full stack trace of the errors, re-run Maven with the -e switch.
[ERROR] Re-run Maven using the -X switch to enable full debug logging.
[ERROR] 
[ERROR] For more information about the errors and possible solutions, please read the following articles:
[ERROR] [Help 1] http://cwiki.apache.org/confluence/display/MAVEN/MojoFailureException
[ERROR] 
[ERROR] After correcting the problems, you can resume the build with the command
[ERROR]   mvn <goals> -rf :hadoop-mapreduce-client-jobclient
Build step 'Execute shell' marked build as failure
[FINDBUGS] Skipping publisher since build result is FAILURE
Archiving artifacts
Recording test results
Email was triggered for: Failure - Any
Sending email for trigger: Failure - Any



###################################################################################
############################## FAILED TESTS (if any) ##############################
2 tests failed.
FAILED:  org.apache.hadoop.mapred.TestMiniMRChildTask.testTaskEnv

Error Message:
The environment checker job failed.

Stack Trace:
java.lang.AssertionError: The environment checker job failed.
	at org.junit.Assert.fail(Assert.java:88)
	at org.junit.Assert.assertTrue(Assert.java:41)
	at org.apache.hadoop.mapred.TestMiniMRChildTask.runTestTaskEnv(TestMiniMRChildTask.java:550)
	at org.apache.hadoop.mapred.TestMiniMRChildTask.testTaskEnv(TestMiniMRChildTask.java:472)


FAILED:  org.apache.hadoop.mapred.TestMiniMRChildTask.testTaskOldEnv

Error Message:
The environment checker job failed.

Stack Trace:
java.lang.AssertionError: The environment checker job failed.
	at org.junit.Assert.fail(Assert.java:88)
	at org.junit.Assert.assertTrue(Assert.java:41)
	at org.apache.hadoop.mapred.TestMiniMRChildTask.runTestTaskEnv(TestMiniMRChildTask.java:550)
	at org.apache.hadoop.mapred.TestMiniMRChildTask.testTaskOldEnv(TestMiniMRChildTask.java:496)




Hadoop-Mapreduce-trunk - Build # 3322 - Still Failing

Posted by Apache Jenkins Server <je...@builds.apache.org>.
See https://builds.apache.org/job/Hadoop-Mapreduce-trunk/3322/

###################################################################################
########################## LAST 60 LINES OF THE CONSOLE ###########################
[...truncated 32687 lines...]
[INFO] --- maven-antrun-plugin:1.7:run (create-testdirs) @ hadoop-mapreduce ---
[INFO] Executing tasks

main:
[INFO] Executed tasks
[INFO] 
[INFO] --- maven-antrun-plugin:1.7:run (tar) @ hadoop-mapreduce ---
[INFO] Executing tasks

main:
[INFO] Executed tasks
[INFO] 
[INFO] --- maven-site-plugin:3.5:attach-descriptor (attach-descriptor) @ hadoop-mapreduce ---
[INFO] 
[INFO] --- maven-enforcer-plugin:1.3.1:enforce (depcheck) @ hadoop-mapreduce ---
[INFO] 
[INFO] --- maven-install-plugin:2.5.1:install (default-install) @ hadoop-mapreduce ---
[INFO] Installing /home/jenkins/jenkins-slave/workspace/Hadoop-Mapreduce-trunk/hadoop-mapreduce-project/pom.xml to /home/jenkins/.m2/repository/org/apache/hadoop/hadoop-mapreduce/3.0.0-alpha1-SNAPSHOT/hadoop-mapreduce-3.0.0-alpha1-SNAPSHOT.pom
[INFO] ------------------------------------------------------------------------
[INFO] Reactor Summary:
[INFO] 
[INFO] Apache Hadoop MapReduce Client .................... SUCCESS [  3.245 s]
[INFO] Apache Hadoop MapReduce Core ...................... SUCCESS [02:03 min]
[INFO] Apache Hadoop MapReduce Common .................... SUCCESS [ 30.970 s]
[INFO] Apache Hadoop MapReduce Shuffle ................... SUCCESS [  5.216 s]
[INFO] Apache Hadoop MapReduce App ....................... SUCCESS [08:34 min]
[INFO] Apache Hadoop MapReduce HistoryServer ............. SUCCESS [05:48 min]
[INFO] Apache Hadoop MapReduce JobClient ................. FAILURE [  01:46 h]
[INFO] Apache Hadoop MapReduce HistoryServer Plugins ..... SUCCESS [  1.430 s]
[INFO] Apache Hadoop MapReduce NativeTask ................ SUCCESS [09:14 min]
[INFO] Apache Hadoop MapReduce Examples .................. SKIPPED
[INFO] Apache Hadoop MapReduce ........................... SUCCESS [  0.247 s]
[INFO] ------------------------------------------------------------------------
[INFO] BUILD FAILURE
[INFO] ------------------------------------------------------------------------
[INFO] Total time: 02:13 h
[INFO] Finished at: 2016-05-16T08:13:12+00:00
[INFO] Final Memory: 36M/595M
[INFO] ------------------------------------------------------------------------
[WARNING] The requested profile "parallel-tests" could not be activated because it does not exist.
[ERROR] Failed to execute goal org.apache.maven.plugins:maven-surefire-plugin:2.17:test (default-test) on project hadoop-mapreduce-client-jobclient: There are test failures.
[ERROR] 
[ERROR] Please refer to /home/jenkins/jenkins-slave/workspace/Hadoop-Mapreduce-trunk/hadoop-mapreduce-project/hadoop-mapreduce-client/hadoop-mapreduce-client-jobclient/target/surefire-reports for the individual test results.
[ERROR] -> [Help 1]
[ERROR] 
[ERROR] To see the full stack trace of the errors, re-run Maven with the -e switch.
[ERROR] Re-run Maven using the -X switch to enable full debug logging.
[ERROR] 
[ERROR] For more information about the errors and possible solutions, please read the following articles:
[ERROR] [Help 1] http://cwiki.apache.org/confluence/display/MAVEN/MojoFailureException
[ERROR] 
[ERROR] After correcting the problems, you can resume the build with the command
[ERROR]   mvn <goals> -rf :hadoop-mapreduce-client-jobclient
Build step 'Execute shell' marked build as failure
[FINDBUGS] Skipping publisher since build result is FAILURE
Archiving artifacts
Recording test results
Email was triggered for: Failure - Any
Sending email for trigger: Failure - Any



###################################################################################
############################## FAILED TESTS (if any) ##############################
2 tests failed.
FAILED:  org.apache.hadoop.mapred.TestMiniMRChildTask.testTaskEnv

Error Message:
The environment checker job failed.

Stack Trace:
java.lang.AssertionError: The environment checker job failed.
	at org.junit.Assert.fail(Assert.java:88)
	at org.junit.Assert.assertTrue(Assert.java:41)
	at org.apache.hadoop.mapred.TestMiniMRChildTask.runTestTaskEnv(TestMiniMRChildTask.java:550)
	at org.apache.hadoop.mapred.TestMiniMRChildTask.testTaskEnv(TestMiniMRChildTask.java:472)


FAILED:  org.apache.hadoop.mapred.TestMiniMRChildTask.testTaskOldEnv

Error Message:
The environment checker job failed.

Stack Trace:
java.lang.AssertionError: The environment checker job failed.
	at org.junit.Assert.fail(Assert.java:88)
	at org.junit.Assert.assertTrue(Assert.java:41)
	at org.apache.hadoop.mapred.TestMiniMRChildTask.runTestTaskEnv(TestMiniMRChildTask.java:550)
	at org.apache.hadoop.mapred.TestMiniMRChildTask.testTaskOldEnv(TestMiniMRChildTask.java:496)




Hadoop-Mapreduce-trunk - Build # 3321 - Still Failing

Posted by Apache Jenkins Server <je...@builds.apache.org>.
See https://builds.apache.org/job/Hadoop-Mapreduce-trunk/3321/

###################################################################################
########################## LAST 60 LINES OF THE CONSOLE ###########################
[...truncated 32684 lines...]
[INFO] --- maven-antrun-plugin:1.7:run (create-testdirs) @ hadoop-mapreduce ---
[INFO] Executing tasks

main:
[INFO] Executed tasks
[INFO] 
[INFO] --- maven-antrun-plugin:1.7:run (tar) @ hadoop-mapreduce ---
[INFO] Executing tasks

main:
[INFO] Executed tasks
[INFO] 
[INFO] --- maven-site-plugin:3.5:attach-descriptor (attach-descriptor) @ hadoop-mapreduce ---
[INFO] 
[INFO] --- maven-enforcer-plugin:1.3.1:enforce (depcheck) @ hadoop-mapreduce ---
[INFO] 
[INFO] --- maven-install-plugin:2.5.1:install (default-install) @ hadoop-mapreduce ---
[INFO] Installing /home/jenkins/jenkins-slave/workspace/Hadoop-Mapreduce-trunk/hadoop-mapreduce-project/pom.xml to /home/jenkins/.m2/repository/org/apache/hadoop/hadoop-mapreduce/3.0.0-alpha1-SNAPSHOT/hadoop-mapreduce-3.0.0-alpha1-SNAPSHOT.pom
[INFO] ------------------------------------------------------------------------
[INFO] Reactor Summary:
[INFO] 
[INFO] Apache Hadoop MapReduce Client .................... SUCCESS [  2.864 s]
[INFO] Apache Hadoop MapReduce Core ...................... SUCCESS [01:50 min]
[INFO] Apache Hadoop MapReduce Common .................... SUCCESS [ 27.981 s]
[INFO] Apache Hadoop MapReduce Shuffle ................... SUCCESS [  5.057 s]
[INFO] Apache Hadoop MapReduce App ....................... SUCCESS [08:27 min]
[INFO] Apache Hadoop MapReduce HistoryServer ............. SUCCESS [05:49 min]
[INFO] Apache Hadoop MapReduce JobClient ................. FAILURE [  01:44 h]
[INFO] Apache Hadoop MapReduce HistoryServer Plugins ..... SUCCESS [  1.424 s]
[INFO] Apache Hadoop MapReduce NativeTask ................ SUCCESS [09:33 min]
[INFO] Apache Hadoop MapReduce Examples .................. SKIPPED
[INFO] Apache Hadoop MapReduce ........................... SUCCESS [  0.316 s]
[INFO] ------------------------------------------------------------------------
[INFO] BUILD FAILURE
[INFO] ------------------------------------------------------------------------
[INFO] Total time: 02:11 h
[INFO] Finished at: 2016-05-16T04:08:23+00:00
[INFO] Final Memory: 35M/598M
[INFO] ------------------------------------------------------------------------
[WARNING] The requested profile "parallel-tests" could not be activated because it does not exist.
[ERROR] Failed to execute goal org.apache.maven.plugins:maven-surefire-plugin:2.17:test (default-test) on project hadoop-mapreduce-client-jobclient: There are test failures.
[ERROR] 
[ERROR] Please refer to /home/jenkins/jenkins-slave/workspace/Hadoop-Mapreduce-trunk/hadoop-mapreduce-project/hadoop-mapreduce-client/hadoop-mapreduce-client-jobclient/target/surefire-reports for the individual test results.
[ERROR] -> [Help 1]
[ERROR] 
[ERROR] To see the full stack trace of the errors, re-run Maven with the -e switch.
[ERROR] Re-run Maven using the -X switch to enable full debug logging.
[ERROR] 
[ERROR] For more information about the errors and possible solutions, please read the following articles:
[ERROR] [Help 1] http://cwiki.apache.org/confluence/display/MAVEN/MojoFailureException
[ERROR] 
[ERROR] After correcting the problems, you can resume the build with the command
[ERROR]   mvn <goals> -rf :hadoop-mapreduce-client-jobclient
Build step 'Execute shell' marked build as failure
[FINDBUGS] Skipping publisher since build result is FAILURE
Archiving artifacts
Recording test results
Email was triggered for: Failure - Any
Sending email for trigger: Failure - Any



###################################################################################
############################## FAILED TESTS (if any) ##############################
2 tests failed.
FAILED:  org.apache.hadoop.mapred.TestMiniMRChildTask.testTaskEnv

Error Message:
The environment checker job failed.

Stack Trace:
java.lang.AssertionError: The environment checker job failed.
	at org.junit.Assert.fail(Assert.java:88)
	at org.junit.Assert.assertTrue(Assert.java:41)
	at org.apache.hadoop.mapred.TestMiniMRChildTask.runTestTaskEnv(TestMiniMRChildTask.java:550)
	at org.apache.hadoop.mapred.TestMiniMRChildTask.testTaskEnv(TestMiniMRChildTask.java:472)


FAILED:  org.apache.hadoop.mapred.TestMiniMRChildTask.testTaskOldEnv

Error Message:
The environment checker job failed.

Stack Trace:
java.lang.AssertionError: The environment checker job failed.
	at org.junit.Assert.fail(Assert.java:88)
	at org.junit.Assert.assertTrue(Assert.java:41)
	at org.apache.hadoop.mapred.TestMiniMRChildTask.runTestTaskEnv(TestMiniMRChildTask.java:550)
	at org.apache.hadoop.mapred.TestMiniMRChildTask.testTaskOldEnv(TestMiniMRChildTask.java:496)




Hadoop-Mapreduce-trunk - Build # 3320 - Still Failing

Posted by Apache Jenkins Server <je...@builds.apache.org>.
See https://builds.apache.org/job/Hadoop-Mapreduce-trunk/3320/

###################################################################################
########################## LAST 60 LINES OF THE CONSOLE ###########################
[...truncated 31450 lines...]
[INFO] --- maven-antrun-plugin:1.7:run (create-testdirs) @ hadoop-mapreduce ---
[INFO] Executing tasks

main:
[INFO] Executed tasks
[INFO] 
[INFO] --- maven-antrun-plugin:1.7:run (tar) @ hadoop-mapreduce ---
[INFO] Executing tasks

main:
[INFO] Executed tasks
[INFO] 
[INFO] --- maven-site-plugin:3.5:attach-descriptor (attach-descriptor) @ hadoop-mapreduce ---
[INFO] 
[INFO] --- maven-enforcer-plugin:1.3.1:enforce (depcheck) @ hadoop-mapreduce ---
[INFO] 
[INFO] --- maven-install-plugin:2.5.1:install (default-install) @ hadoop-mapreduce ---
[INFO] Installing /home/jenkins/jenkins-slave/workspace/Hadoop-Mapreduce-trunk/hadoop-mapreduce-project/pom.xml to /home/jenkins/.m2/repository/org/apache/hadoop/hadoop-mapreduce/3.0.0-alpha1-SNAPSHOT/hadoop-mapreduce-3.0.0-alpha1-SNAPSHOT.pom
[INFO] ------------------------------------------------------------------------
[INFO] Reactor Summary:
[INFO] 
[INFO] Apache Hadoop MapReduce Client .................... SUCCESS [  2.783 s]
[INFO] Apache Hadoop MapReduce Core ...................... FAILURE [01:49 min]
[INFO] Apache Hadoop MapReduce Common .................... SKIPPED
[INFO] Apache Hadoop MapReduce Shuffle ................... SKIPPED
[INFO] Apache Hadoop MapReduce App ....................... SKIPPED
[INFO] Apache Hadoop MapReduce HistoryServer ............. SKIPPED
[INFO] Apache Hadoop MapReduce JobClient ................. SKIPPED
[INFO] Apache Hadoop MapReduce HistoryServer Plugins ..... SKIPPED
[INFO] Apache Hadoop MapReduce NativeTask ................ SKIPPED
[INFO] Apache Hadoop MapReduce Examples .................. SKIPPED
[INFO] Apache Hadoop MapReduce ........................... SUCCESS [  0.388 s]
[INFO] ------------------------------------------------------------------------
[INFO] BUILD FAILURE
[INFO] ------------------------------------------------------------------------
[INFO] Total time: 01:53 min
[INFO] Finished at: 2016-05-14T19:58:39+00:00
[INFO] Final Memory: 31M/697M
[INFO] ------------------------------------------------------------------------
[WARNING] The requested profile "parallel-tests" could not be activated because it does not exist.
[ERROR] Failed to execute goal org.apache.maven.plugins:maven-surefire-plugin:2.17:test (default-test) on project hadoop-mapreduce-client-core: There are test failures.
[ERROR] 
[ERROR] Please refer to /home/jenkins/jenkins-slave/workspace/Hadoop-Mapreduce-trunk/hadoop-mapreduce-project/hadoop-mapreduce-client/hadoop-mapreduce-client-core/target/surefire-reports for the individual test results.
[ERROR] -> [Help 1]
[ERROR] 
[ERROR] To see the full stack trace of the errors, re-run Maven with the -e switch.
[ERROR] Re-run Maven using the -X switch to enable full debug logging.
[ERROR] 
[ERROR] For more information about the errors and possible solutions, please read the following articles:
[ERROR] [Help 1] http://cwiki.apache.org/confluence/display/MAVEN/MojoFailureException
[ERROR] 
[ERROR] After correcting the problems, you can resume the build with the command
[ERROR]   mvn <goals> -rf :hadoop-mapreduce-client-core
Build step 'Execute shell' marked build as failure
[FINDBUGS] Skipping publisher since build result is FAILURE
Archiving artifacts
Recording test results
Email was triggered for: Failure - Any
Sending email for trigger: Failure - Any



###################################################################################
############################## FAILED TESTS (if any) ##############################
1 tests failed.
FAILED:  org.apache.hadoop.mapreduce.tools.TestCLI.testGetJob

Error Message:
null

Stack Trace:
java.lang.AssertionError: null
	at org.junit.Assert.fail(Assert.java:86)
	at org.junit.Assert.assertTrue(Assert.java:41)
	at org.junit.Assert.assertTrue(Assert.java:52)
	at org.apache.hadoop.mapreduce.tools.TestCLI.testGetJob(TestCLI.java:181)




Hadoop-Mapreduce-trunk - Build # 3319 - Still Failing

Posted by Apache Jenkins Server <je...@builds.apache.org>.
See https://builds.apache.org/job/Hadoop-Mapreduce-trunk/3319/

###################################################################################
########################## LAST 60 LINES OF THE CONSOLE ###########################
[...truncated 31450 lines...]
[INFO] --- maven-antrun-plugin:1.7:run (create-testdirs) @ hadoop-mapreduce ---
[INFO] Executing tasks

main:
[INFO] Executed tasks
[INFO] 
[INFO] --- maven-antrun-plugin:1.7:run (tar) @ hadoop-mapreduce ---
[INFO] Executing tasks

main:
[INFO] Executed tasks
[INFO] 
[INFO] --- maven-site-plugin:3.5:attach-descriptor (attach-descriptor) @ hadoop-mapreduce ---
[INFO] 
[INFO] --- maven-enforcer-plugin:1.3.1:enforce (depcheck) @ hadoop-mapreduce ---
[INFO] 
[INFO] --- maven-install-plugin:2.5.1:install (default-install) @ hadoop-mapreduce ---
[INFO] Installing /home/jenkins/jenkins-slave/workspace/Hadoop-Mapreduce-trunk/hadoop-mapreduce-project/pom.xml to /home/jenkins/.m2/repository/org/apache/hadoop/hadoop-mapreduce/3.0.0-alpha1-SNAPSHOT/hadoop-mapreduce-3.0.0-alpha1-SNAPSHOT.pom
[INFO] ------------------------------------------------------------------------
[INFO] Reactor Summary:
[INFO] 
[INFO] Apache Hadoop MapReduce Client .................... SUCCESS [  2.849 s]
[INFO] Apache Hadoop MapReduce Core ...................... FAILURE [01:49 min]
[INFO] Apache Hadoop MapReduce Common .................... SKIPPED
[INFO] Apache Hadoop MapReduce Shuffle ................... SKIPPED
[INFO] Apache Hadoop MapReduce App ....................... SKIPPED
[INFO] Apache Hadoop MapReduce HistoryServer ............. SKIPPED
[INFO] Apache Hadoop MapReduce JobClient ................. SKIPPED
[INFO] Apache Hadoop MapReduce HistoryServer Plugins ..... SKIPPED
[INFO] Apache Hadoop MapReduce NativeTask ................ SKIPPED
[INFO] Apache Hadoop MapReduce Examples .................. SKIPPED
[INFO] Apache Hadoop MapReduce ........................... SUCCESS [  0.394 s]
[INFO] ------------------------------------------------------------------------
[INFO] BUILD FAILURE
[INFO] ------------------------------------------------------------------------
[INFO] Total time: 01:54 min
[INFO] Finished at: 2016-05-13T21:58:52+00:00
[INFO] Final Memory: 31M/697M
[INFO] ------------------------------------------------------------------------
[WARNING] The requested profile "parallel-tests" could not be activated because it does not exist.
[ERROR] Failed to execute goal org.apache.maven.plugins:maven-surefire-plugin:2.17:test (default-test) on project hadoop-mapreduce-client-core: There are test failures.
[ERROR] 
[ERROR] Please refer to /home/jenkins/jenkins-slave/workspace/Hadoop-Mapreduce-trunk/hadoop-mapreduce-project/hadoop-mapreduce-client/hadoop-mapreduce-client-core/target/surefire-reports for the individual test results.
[ERROR] -> [Help 1]
[ERROR] 
[ERROR] To see the full stack trace of the errors, re-run Maven with the -e switch.
[ERROR] Re-run Maven using the -X switch to enable full debug logging.
[ERROR] 
[ERROR] For more information about the errors and possible solutions, please read the following articles:
[ERROR] [Help 1] http://cwiki.apache.org/confluence/display/MAVEN/MojoFailureException
[ERROR] 
[ERROR] After correcting the problems, you can resume the build with the command
[ERROR]   mvn <goals> -rf :hadoop-mapreduce-client-core
Build step 'Execute shell' marked build as failure
[FINDBUGS] Skipping publisher since build result is FAILURE
Archiving artifacts
Recording test results
Email was triggered for: Failure - Any
Sending email for trigger: Failure - Any



###################################################################################
############################## FAILED TESTS (if any) ##############################
1 tests failed.
FAILED:  org.apache.hadoop.mapreduce.tools.TestCLI.testGetJob

Error Message:
null

Stack Trace:
java.lang.AssertionError: null
	at org.junit.Assert.fail(Assert.java:86)
	at org.junit.Assert.assertTrue(Assert.java:41)
	at org.junit.Assert.assertTrue(Assert.java:52)
	at org.apache.hadoop.mapreduce.tools.TestCLI.testGetJob(TestCLI.java:181)




Hadoop-Mapreduce-trunk - Build # 3318 - Still Failing

Posted by Apache Jenkins Server <je...@builds.apache.org>.
See https://builds.apache.org/job/Hadoop-Mapreduce-trunk/3318/

###################################################################################
########################## LAST 60 LINES OF THE CONSOLE ###########################
[...truncated 32654 lines...]
[INFO] Building Apache Hadoop MapReduce 3.0.0-alpha1-SNAPSHOT
[INFO] ------------------------------------------------------------------------
[INFO] 
[INFO] --- maven-antrun-plugin:1.7:run (create-testdirs) @ hadoop-mapreduce ---
[INFO] Executing tasks

main:
[INFO] Executed tasks
[INFO] 
[INFO] --- maven-antrun-plugin:1.7:run (tar) @ hadoop-mapreduce ---
[INFO] Executing tasks

main:
[INFO] Executed tasks
[INFO] 
[INFO] --- maven-site-plugin:3.5:attach-descriptor (attach-descriptor) @ hadoop-mapreduce ---
[INFO] 
[INFO] --- maven-enforcer-plugin:1.3.1:enforce (depcheck) @ hadoop-mapreduce ---
[INFO] 
[INFO] --- maven-install-plugin:2.5.1:install (default-install) @ hadoop-mapreduce ---
[INFO] Installing /home/jenkins/jenkins-slave/workspace/Hadoop-Mapreduce-trunk/hadoop-mapreduce-project/pom.xml to /home/jenkins/.m2/repository/org/apache/hadoop/hadoop-mapreduce/3.0.0-alpha1-SNAPSHOT/hadoop-mapreduce-3.0.0-alpha1-SNAPSHOT.pom
[INFO] ------------------------------------------------------------------------
[INFO] Reactor Summary:
[INFO] 
[INFO] Apache Hadoop MapReduce Client .................... SUCCESS [  3.345 s]
[INFO] Apache Hadoop MapReduce Core ...................... SUCCESS [02:02 min]
[INFO] Apache Hadoop MapReduce Common .................... SUCCESS [ 30.964 s]
[INFO] Apache Hadoop MapReduce Shuffle ................... SUCCESS [  6.463 s]
[INFO] Apache Hadoop MapReduce App ....................... SUCCESS [08:53 min]
[INFO] Apache Hadoop MapReduce HistoryServer ............. SUCCESS [06:06 min]
[INFO] Apache Hadoop MapReduce JobClient ................. FAILURE [  02:00 h]
[INFO] Apache Hadoop MapReduce HistoryServer Plugins ..... SUCCESS [  1.748 s]
[INFO] Apache Hadoop MapReduce NativeTask ................ SUCCESS [11:17 min]
[INFO] Apache Hadoop MapReduce Examples .................. SKIPPED
[INFO] Apache Hadoop MapReduce ........................... SUCCESS [  0.267 s]
[INFO] ------------------------------------------------------------------------
[INFO] BUILD FAILURE
[INFO] ------------------------------------------------------------------------
[INFO] Total time: 02:29 h
[INFO] Finished at: 2016-05-13T21:10:05+00:00
[INFO] Final Memory: 39M/592M
[INFO] ------------------------------------------------------------------------
[WARNING] The requested profile "parallel-tests" could not be activated because it does not exist.
[ERROR] Failed to execute goal org.apache.maven.plugins:maven-surefire-plugin:2.17:test (default-test) on project hadoop-mapreduce-client-jobclient: There was a timeout or other error in the fork -> [Help 1]
[ERROR] 
[ERROR] To see the full stack trace of the errors, re-run Maven with the -e switch.
[ERROR] Re-run Maven using the -X switch to enable full debug logging.
[ERROR] 
[ERROR] For more information about the errors and possible solutions, please read the following articles:
[ERROR] [Help 1] http://cwiki.apache.org/confluence/display/MAVEN/MojoFailureException
[ERROR] 
[ERROR] After correcting the problems, you can resume the build with the command
[ERROR]   mvn <goals> -rf :hadoop-mapreduce-client-jobclient
Build step 'Execute shell' marked build as failure
[FINDBUGS] Skipping publisher since build result is FAILURE
Archiving artifacts
Recording test results
Email was triggered for: Failure - Any
Sending email for trigger: Failure - Any



###################################################################################
############################## FAILED TESTS (if any) ##############################
2 tests failed.
FAILED:  org.apache.hadoop.mapred.TestMiniMRChildTask.testTaskEnv

Error Message:
The environment checker job failed.

Stack Trace:
java.lang.AssertionError: The environment checker job failed.
	at org.junit.Assert.fail(Assert.java:88)
	at org.junit.Assert.assertTrue(Assert.java:41)
	at org.apache.hadoop.mapred.TestMiniMRChildTask.runTestTaskEnv(TestMiniMRChildTask.java:550)
	at org.apache.hadoop.mapred.TestMiniMRChildTask.testTaskEnv(TestMiniMRChildTask.java:472)


FAILED:  org.apache.hadoop.mapred.TestMiniMRChildTask.testTaskOldEnv

Error Message:
The environment checker job failed.

Stack Trace:
java.lang.AssertionError: The environment checker job failed.
	at org.junit.Assert.fail(Assert.java:88)
	at org.junit.Assert.assertTrue(Assert.java:41)
	at org.apache.hadoop.mapred.TestMiniMRChildTask.runTestTaskEnv(TestMiniMRChildTask.java:550)
	at org.apache.hadoop.mapred.TestMiniMRChildTask.testTaskOldEnv(TestMiniMRChildTask.java:496)




Hadoop-Mapreduce-trunk - Build # 3317 - Still Failing

Posted by Apache Jenkins Server <je...@builds.apache.org>.
See https://builds.apache.org/job/Hadoop-Mapreduce-trunk/3317/

###################################################################################
########################## LAST 60 LINES OF THE CONSOLE ###########################
[...truncated 32659 lines...]
[INFO] --- maven-antrun-plugin:1.7:run (create-testdirs) @ hadoop-mapreduce ---
[INFO] Executing tasks

main:
[INFO] Executed tasks
[INFO] 
[INFO] --- maven-antrun-plugin:1.7:run (tar) @ hadoop-mapreduce ---
[INFO] Executing tasks

main:
[INFO] Executed tasks
[INFO] 
[INFO] --- maven-site-plugin:3.5:attach-descriptor (attach-descriptor) @ hadoop-mapreduce ---
[INFO] 
[INFO] --- maven-enforcer-plugin:1.3.1:enforce (depcheck) @ hadoop-mapreduce ---
[INFO] 
[INFO] --- maven-install-plugin:2.5.1:install (default-install) @ hadoop-mapreduce ---
[INFO] Installing /home/jenkins/jenkins-slave/workspace/Hadoop-Mapreduce-trunk/hadoop-mapreduce-project/pom.xml to /home/jenkins/.m2/repository/org/apache/hadoop/hadoop-mapreduce/3.0.0-alpha1-SNAPSHOT/hadoop-mapreduce-3.0.0-alpha1-SNAPSHOT.pom
[INFO] ------------------------------------------------------------------------
[INFO] Reactor Summary:
[INFO] 
[INFO] Apache Hadoop MapReduce Client .................... SUCCESS [  2.874 s]
[INFO] Apache Hadoop MapReduce Core ...................... SUCCESS [01:50 min]
[INFO] Apache Hadoop MapReduce Common .................... SUCCESS [ 28.028 s]
[INFO] Apache Hadoop MapReduce Shuffle ................... SUCCESS [  5.025 s]
[INFO] Apache Hadoop MapReduce App ....................... SUCCESS [08:26 min]
[INFO] Apache Hadoop MapReduce HistoryServer ............. SUCCESS [05:49 min]
[INFO] Apache Hadoop MapReduce JobClient ................. FAILURE [  01:43 h]
[INFO] Apache Hadoop MapReduce HistoryServer Plugins ..... SUCCESS [  1.439 s]
[INFO] Apache Hadoop MapReduce NativeTask ................ SUCCESS [09:02 min]
[INFO] Apache Hadoop MapReduce Examples .................. SKIPPED
[INFO] Apache Hadoop MapReduce ........................... SUCCESS [  0.249 s]
[INFO] ------------------------------------------------------------------------
[INFO] BUILD FAILURE
[INFO] ------------------------------------------------------------------------
[INFO] Total time: 02:09 h
[INFO] Finished at: 2016-05-13T18:06:36+00:00
[INFO] Final Memory: 36M/595M
[INFO] ------------------------------------------------------------------------
[WARNING] The requested profile "parallel-tests" could not be activated because it does not exist.
[ERROR] Failed to execute goal org.apache.maven.plugins:maven-surefire-plugin:2.17:test (default-test) on project hadoop-mapreduce-client-jobclient: There are test failures.
[ERROR] 
[ERROR] Please refer to /home/jenkins/jenkins-slave/workspace/Hadoop-Mapreduce-trunk/hadoop-mapreduce-project/hadoop-mapreduce-client/hadoop-mapreduce-client-jobclient/target/surefire-reports for the individual test results.
[ERROR] -> [Help 1]
[ERROR] 
[ERROR] To see the full stack trace of the errors, re-run Maven with the -e switch.
[ERROR] Re-run Maven using the -X switch to enable full debug logging.
[ERROR] 
[ERROR] For more information about the errors and possible solutions, please read the following articles:
[ERROR] [Help 1] http://cwiki.apache.org/confluence/display/MAVEN/MojoFailureException
[ERROR] 
[ERROR] After correcting the problems, you can resume the build with the command
[ERROR]   mvn <goals> -rf :hadoop-mapreduce-client-jobclient
Build step 'Execute shell' marked build as failure
[FINDBUGS] Skipping publisher since build result is FAILURE
Archiving artifacts
Recording test results
Email was triggered for: Failure - Any
Sending email for trigger: Failure - Any



###################################################################################
############################## FAILED TESTS (if any) ##############################
2 tests failed.
FAILED:  org.apache.hadoop.mapred.TestMiniMRChildTask.testTaskEnv

Error Message:
The environment checker job failed.

Stack Trace:
java.lang.AssertionError: The environment checker job failed.
	at org.junit.Assert.fail(Assert.java:88)
	at org.junit.Assert.assertTrue(Assert.java:41)
	at org.apache.hadoop.mapred.TestMiniMRChildTask.runTestTaskEnv(TestMiniMRChildTask.java:550)
	at org.apache.hadoop.mapred.TestMiniMRChildTask.testTaskEnv(TestMiniMRChildTask.java:472)


FAILED:  org.apache.hadoop.mapred.TestMiniMRChildTask.testTaskOldEnv

Error Message:
The environment checker job failed.

Stack Trace:
java.lang.AssertionError: The environment checker job failed.
	at org.junit.Assert.fail(Assert.java:88)
	at org.junit.Assert.assertTrue(Assert.java:41)
	at org.apache.hadoop.mapred.TestMiniMRChildTask.runTestTaskEnv(TestMiniMRChildTask.java:550)
	at org.apache.hadoop.mapred.TestMiniMRChildTask.testTaskOldEnv(TestMiniMRChildTask.java:496)




Hadoop-Mapreduce-trunk - Build # 3316 - Still Failing

Posted by Apache Jenkins Server <je...@builds.apache.org>.
See https://builds.apache.org/job/Hadoop-Mapreduce-trunk/3316/

###################################################################################
########################## LAST 60 LINES OF THE CONSOLE ###########################
[...truncated 32662 lines...]
[INFO] --- maven-antrun-plugin:1.7:run (create-testdirs) @ hadoop-mapreduce ---
[INFO] Executing tasks

main:
[INFO] Executed tasks
[INFO] 
[INFO] --- maven-antrun-plugin:1.7:run (tar) @ hadoop-mapreduce ---
[INFO] Executing tasks

main:
[INFO] Executed tasks
[INFO] 
[INFO] --- maven-site-plugin:3.5:attach-descriptor (attach-descriptor) @ hadoop-mapreduce ---
[INFO] 
[INFO] --- maven-enforcer-plugin:1.3.1:enforce (depcheck) @ hadoop-mapreduce ---
[INFO] 
[INFO] --- maven-install-plugin:2.5.1:install (default-install) @ hadoop-mapreduce ---
[INFO] Installing /home/jenkins/jenkins-slave/workspace/Hadoop-Mapreduce-trunk/hadoop-mapreduce-project/pom.xml to /home/jenkins/.m2/repository/org/apache/hadoop/hadoop-mapreduce/3.0.0-alpha1-SNAPSHOT/hadoop-mapreduce-3.0.0-alpha1-SNAPSHOT.pom
[INFO] ------------------------------------------------------------------------
[INFO] Reactor Summary:
[INFO] 
[INFO] Apache Hadoop MapReduce Client .................... SUCCESS [  2.783 s]
[INFO] Apache Hadoop MapReduce Core ...................... SUCCESS [01:49 min]
[INFO] Apache Hadoop MapReduce Common .................... SUCCESS [ 28.236 s]
[INFO] Apache Hadoop MapReduce Shuffle ................... SUCCESS [  4.977 s]
[INFO] Apache Hadoop MapReduce App ....................... SUCCESS [08:25 min]
[INFO] Apache Hadoop MapReduce HistoryServer ............. SUCCESS [05:49 min]
[INFO] Apache Hadoop MapReduce JobClient ................. FAILURE [  01:44 h]
[INFO] Apache Hadoop MapReduce HistoryServer Plugins ..... SUCCESS [  1.417 s]
[INFO] Apache Hadoop MapReduce NativeTask ................ SUCCESS [09:02 min]
[INFO] Apache Hadoop MapReduce Examples .................. SKIPPED
[INFO] Apache Hadoop MapReduce ........................... SUCCESS [  0.241 s]
[INFO] ------------------------------------------------------------------------
[INFO] BUILD FAILURE
[INFO] ------------------------------------------------------------------------
[INFO] Total time: 02:10 h
[INFO] Finished at: 2016-05-13T13:07:42+00:00
[INFO] Final Memory: 35M/595M
[INFO] ------------------------------------------------------------------------
[WARNING] The requested profile "parallel-tests" could not be activated because it does not exist.
[ERROR] Failed to execute goal org.apache.maven.plugins:maven-surefire-plugin:2.17:test (default-test) on project hadoop-mapreduce-client-jobclient: There are test failures.
[ERROR] 
[ERROR] Please refer to /home/jenkins/jenkins-slave/workspace/Hadoop-Mapreduce-trunk/hadoop-mapreduce-project/hadoop-mapreduce-client/hadoop-mapreduce-client-jobclient/target/surefire-reports for the individual test results.
[ERROR] -> [Help 1]
[ERROR] 
[ERROR] To see the full stack trace of the errors, re-run Maven with the -e switch.
[ERROR] Re-run Maven using the -X switch to enable full debug logging.
[ERROR] 
[ERROR] For more information about the errors and possible solutions, please read the following articles:
[ERROR] [Help 1] http://cwiki.apache.org/confluence/display/MAVEN/MojoFailureException
[ERROR] 
[ERROR] After correcting the problems, you can resume the build with the command
[ERROR]   mvn <goals> -rf :hadoop-mapreduce-client-jobclient
Build step 'Execute shell' marked build as failure
[FINDBUGS] Skipping publisher since build result is FAILURE
Archiving artifacts
Recording test results
Email was triggered for: Failure - Any
Sending email for trigger: Failure - Any



###################################################################################
############################## FAILED TESTS (if any) ##############################
2 tests failed.
FAILED:  org.apache.hadoop.mapred.TestMiniMRChildTask.testTaskEnv

Error Message:
The environment checker job failed.

Stack Trace:
java.lang.AssertionError: The environment checker job failed.
	at org.junit.Assert.fail(Assert.java:88)
	at org.junit.Assert.assertTrue(Assert.java:41)
	at org.apache.hadoop.mapred.TestMiniMRChildTask.runTestTaskEnv(TestMiniMRChildTask.java:550)
	at org.apache.hadoop.mapred.TestMiniMRChildTask.testTaskEnv(TestMiniMRChildTask.java:472)


FAILED:  org.apache.hadoop.mapred.TestMiniMRChildTask.testTaskOldEnv

Error Message:
The environment checker job failed.

Stack Trace:
java.lang.AssertionError: The environment checker job failed.
	at org.junit.Assert.fail(Assert.java:88)
	at org.junit.Assert.assertTrue(Assert.java:41)
	at org.apache.hadoop.mapred.TestMiniMRChildTask.runTestTaskEnv(TestMiniMRChildTask.java:550)
	at org.apache.hadoop.mapred.TestMiniMRChildTask.testTaskOldEnv(TestMiniMRChildTask.java:496)




Hadoop-Mapreduce-trunk - Build # 3315 - Still Failing

Posted by Apache Jenkins Server <je...@builds.apache.org>.
See https://builds.apache.org/job/Hadoop-Mapreduce-trunk/3315/

###################################################################################
########################## LAST 60 LINES OF THE CONSOLE ###########################
[...truncated 32657 lines...]
[INFO] --- maven-antrun-plugin:1.7:run (create-testdirs) @ hadoop-mapreduce ---
[INFO] Executing tasks

main:
[INFO] Executed tasks
[INFO] 
[INFO] --- maven-antrun-plugin:1.7:run (tar) @ hadoop-mapreduce ---
[INFO] Executing tasks

main:
[INFO] Executed tasks
[INFO] 
[INFO] --- maven-site-plugin:3.5:attach-descriptor (attach-descriptor) @ hadoop-mapreduce ---
[INFO] 
[INFO] --- maven-enforcer-plugin:1.3.1:enforce (depcheck) @ hadoop-mapreduce ---
[INFO] 
[INFO] --- maven-install-plugin:2.5.1:install (default-install) @ hadoop-mapreduce ---
[INFO] Installing /home/jenkins/jenkins-slave/workspace/Hadoop-Mapreduce-trunk/hadoop-mapreduce-project/pom.xml to /home/jenkins/.m2/repository/org/apache/hadoop/hadoop-mapreduce/3.0.0-alpha1-SNAPSHOT/hadoop-mapreduce-3.0.0-alpha1-SNAPSHOT.pom
[INFO] ------------------------------------------------------------------------
[INFO] Reactor Summary:
[INFO] 
[INFO] Apache Hadoop MapReduce Client .................... SUCCESS [  2.865 s]
[INFO] Apache Hadoop MapReduce Core ...................... SUCCESS [01:56 min]
[INFO] Apache Hadoop MapReduce Common .................... SUCCESS [ 29.563 s]
[INFO] Apache Hadoop MapReduce Shuffle ................... SUCCESS [  5.237 s]
[INFO] Apache Hadoop MapReduce App ....................... SUCCESS [08:39 min]
[INFO] Apache Hadoop MapReduce HistoryServer ............. SUCCESS [05:49 min]
[INFO] Apache Hadoop MapReduce JobClient ................. FAILURE [  01:45 h]
[INFO] Apache Hadoop MapReduce HistoryServer Plugins ..... SUCCESS [  1.409 s]
[INFO] Apache Hadoop MapReduce NativeTask ................ SUCCESS [08:46 min]
[INFO] Apache Hadoop MapReduce Examples .................. SKIPPED
[INFO] Apache Hadoop MapReduce ........................... SUCCESS [  0.250 s]
[INFO] ------------------------------------------------------------------------
[INFO] BUILD FAILURE
[INFO] ------------------------------------------------------------------------
[INFO] Total time: 02:11 h
[INFO] Finished at: 2016-05-13T10:11:28+00:00
[INFO] Final Memory: 35M/592M
[INFO] ------------------------------------------------------------------------
[WARNING] The requested profile "parallel-tests" could not be activated because it does not exist.
[ERROR] Failed to execute goal org.apache.maven.plugins:maven-surefire-plugin:2.17:test (default-test) on project hadoop-mapreduce-client-jobclient: There are test failures.
[ERROR] 
[ERROR] Please refer to /home/jenkins/jenkins-slave/workspace/Hadoop-Mapreduce-trunk/hadoop-mapreduce-project/hadoop-mapreduce-client/hadoop-mapreduce-client-jobclient/target/surefire-reports for the individual test results.
[ERROR] -> [Help 1]
[ERROR] 
[ERROR] To see the full stack trace of the errors, re-run Maven with the -e switch.
[ERROR] Re-run Maven using the -X switch to enable full debug logging.
[ERROR] 
[ERROR] For more information about the errors and possible solutions, please read the following articles:
[ERROR] [Help 1] http://cwiki.apache.org/confluence/display/MAVEN/MojoFailureException
[ERROR] 
[ERROR] After correcting the problems, you can resume the build with the command
[ERROR]   mvn <goals> -rf :hadoop-mapreduce-client-jobclient
Build step 'Execute shell' marked build as failure
[FINDBUGS] Skipping publisher since build result is FAILURE
Archiving artifacts
Recording test results
Email was triggered for: Failure - Any
Sending email for trigger: Failure - Any



###################################################################################
############################## FAILED TESTS (if any) ##############################
2 tests failed.
FAILED:  org.apache.hadoop.mapred.TestMiniMRChildTask.testTaskEnv

Error Message:
The environment checker job failed.

Stack Trace:
java.lang.AssertionError: The environment checker job failed.
	at org.junit.Assert.fail(Assert.java:88)
	at org.junit.Assert.assertTrue(Assert.java:41)
	at org.apache.hadoop.mapred.TestMiniMRChildTask.runTestTaskEnv(TestMiniMRChildTask.java:550)
	at org.apache.hadoop.mapred.TestMiniMRChildTask.testTaskEnv(TestMiniMRChildTask.java:472)


FAILED:  org.apache.hadoop.mapred.TestMiniMRChildTask.testTaskOldEnv

Error Message:
The environment checker job failed.

Stack Trace:
java.lang.AssertionError: The environment checker job failed.
	at org.junit.Assert.fail(Assert.java:88)
	at org.junit.Assert.assertTrue(Assert.java:41)
	at org.apache.hadoop.mapred.TestMiniMRChildTask.runTestTaskEnv(TestMiniMRChildTask.java:550)
	at org.apache.hadoop.mapred.TestMiniMRChildTask.testTaskOldEnv(TestMiniMRChildTask.java:496)




Hadoop-Mapreduce-trunk - Build # 3314 - Still Failing

Posted by Apache Jenkins Server <je...@builds.apache.org>.
See https://builds.apache.org/job/Hadoop-Mapreduce-trunk/3314/

###################################################################################
########################## LAST 60 LINES OF THE CONSOLE ###########################
[...truncated 31426 lines...]
[INFO] --- maven-antrun-plugin:1.7:run (create-testdirs) @ hadoop-mapreduce ---
[INFO] Executing tasks

main:
[INFO] Executed tasks
[INFO] 
[INFO] --- maven-antrun-plugin:1.7:run (tar) @ hadoop-mapreduce ---
[INFO] Executing tasks

main:
[INFO] Executed tasks
[INFO] 
[INFO] --- maven-site-plugin:3.5:attach-descriptor (attach-descriptor) @ hadoop-mapreduce ---
[INFO] 
[INFO] --- maven-enforcer-plugin:1.3.1:enforce (depcheck) @ hadoop-mapreduce ---
[INFO] 
[INFO] --- maven-install-plugin:2.5.1:install (default-install) @ hadoop-mapreduce ---
[INFO] Installing /home/jenkins/jenkins-slave/workspace/Hadoop-Mapreduce-trunk/hadoop-mapreduce-project/pom.xml to /home/jenkins/.m2/repository/org/apache/hadoop/hadoop-mapreduce/3.0.0-alpha1-SNAPSHOT/hadoop-mapreduce-3.0.0-alpha1-SNAPSHOT.pom
[INFO] ------------------------------------------------------------------------
[INFO] Reactor Summary:
[INFO] 
[INFO] Apache Hadoop MapReduce Client .................... SUCCESS [  2.882 s]
[INFO] Apache Hadoop MapReduce Core ...................... FAILURE [01:49 min]
[INFO] Apache Hadoop MapReduce Common .................... SKIPPED
[INFO] Apache Hadoop MapReduce Shuffle ................... SKIPPED
[INFO] Apache Hadoop MapReduce App ....................... SKIPPED
[INFO] Apache Hadoop MapReduce HistoryServer ............. SKIPPED
[INFO] Apache Hadoop MapReduce JobClient ................. SKIPPED
[INFO] Apache Hadoop MapReduce HistoryServer Plugins ..... SKIPPED
[INFO] Apache Hadoop MapReduce NativeTask ................ SKIPPED
[INFO] Apache Hadoop MapReduce Examples .................. SKIPPED
[INFO] Apache Hadoop MapReduce ........................... SUCCESS [  0.360 s]
[INFO] ------------------------------------------------------------------------
[INFO] BUILD FAILURE
[INFO] ------------------------------------------------------------------------
[INFO] Total time: 01:53 min
[INFO] Finished at: 2016-05-13T02:57:26+00:00
[INFO] Final Memory: 35M/899M
[INFO] ------------------------------------------------------------------------
[WARNING] The requested profile "parallel-tests" could not be activated because it does not exist.
[ERROR] Failed to execute goal org.apache.maven.plugins:maven-surefire-plugin:2.17:test (default-test) on project hadoop-mapreduce-client-core: There are test failures.
[ERROR] 
[ERROR] Please refer to /home/jenkins/jenkins-slave/workspace/Hadoop-Mapreduce-trunk/hadoop-mapreduce-project/hadoop-mapreduce-client/hadoop-mapreduce-client-core/target/surefire-reports for the individual test results.
[ERROR] -> [Help 1]
[ERROR] 
[ERROR] To see the full stack trace of the errors, re-run Maven with the -e switch.
[ERROR] Re-run Maven using the -X switch to enable full debug logging.
[ERROR] 
[ERROR] For more information about the errors and possible solutions, please read the following articles:
[ERROR] [Help 1] http://cwiki.apache.org/confluence/display/MAVEN/MojoFailureException
[ERROR] 
[ERROR] After correcting the problems, you can resume the build with the command
[ERROR]   mvn <goals> -rf :hadoop-mapreduce-client-core
Build step 'Execute shell' marked build as failure
[FINDBUGS] Skipping publisher since build result is FAILURE
Archiving artifacts
Recording test results
Email was triggered for: Failure - Any
Sending email for trigger: Failure - Any



###################################################################################
############################## FAILED TESTS (if any) ##############################
1 tests failed.
FAILED:  org.apache.hadoop.mapreduce.tools.TestCLI.testGetJob

Error Message:
null

Stack Trace:
java.lang.AssertionError: null
	at org.junit.Assert.fail(Assert.java:86)
	at org.junit.Assert.assertTrue(Assert.java:41)
	at org.junit.Assert.assertTrue(Assert.java:52)
	at org.apache.hadoop.mapreduce.tools.TestCLI.testGetJob(TestCLI.java:181)




Hadoop-Mapreduce-trunk - Build # 3313 - Still Failing

Posted by Apache Jenkins Server <je...@builds.apache.org>.
See https://builds.apache.org/job/Hadoop-Mapreduce-trunk/3313/

###################################################################################
########################## LAST 60 LINES OF THE CONSOLE ###########################
[...truncated 32698 lines...]
[INFO] --- maven-antrun-plugin:1.7:run (create-testdirs) @ hadoop-mapreduce ---
[INFO] Executing tasks

main:
[INFO] Executed tasks
[INFO] 
[INFO] --- maven-antrun-plugin:1.7:run (tar) @ hadoop-mapreduce ---
[INFO] Executing tasks

main:
[INFO] Executed tasks
[INFO] 
[INFO] --- maven-site-plugin:3.5:attach-descriptor (attach-descriptor) @ hadoop-mapreduce ---
[INFO] 
[INFO] --- maven-enforcer-plugin:1.3.1:enforce (depcheck) @ hadoop-mapreduce ---
[INFO] 
[INFO] --- maven-install-plugin:2.5.1:install (default-install) @ hadoop-mapreduce ---
[INFO] Installing /home/jenkins/jenkins-slave/workspace/Hadoop-Mapreduce-trunk/hadoop-mapreduce-project/pom.xml to /home/jenkins/.m2/repository/org/apache/hadoop/hadoop-mapreduce/3.0.0-SNAPSHOT/hadoop-mapreduce-3.0.0-SNAPSHOT.pom
[INFO] ------------------------------------------------------------------------
[INFO] Reactor Summary:
[INFO] 
[INFO] Apache Hadoop MapReduce Client .................... SUCCESS [  4.852 s]
[INFO] Apache Hadoop MapReduce Core ...................... SUCCESS [01:49 min]
[INFO] Apache Hadoop MapReduce Common .................... SUCCESS [ 28.105 s]
[INFO] Apache Hadoop MapReduce Shuffle ................... SUCCESS [  6.141 s]
[INFO] Apache Hadoop MapReduce App ....................... SUCCESS [08:27 min]
[INFO] Apache Hadoop MapReduce HistoryServer ............. SUCCESS [05:51 min]
[INFO] Apache Hadoop MapReduce JobClient ................. FAILURE [  01:46 h]
[INFO] Apache Hadoop MapReduce HistoryServer Plugins ..... SUCCESS [  1.407 s]
[INFO] Apache Hadoop MapReduce NativeTask ................ SUCCESS [09:45 min]
[INFO] Apache Hadoop MapReduce Examples .................. SKIPPED
[INFO] Apache Hadoop MapReduce ........................... SUCCESS [  0.251 s]
[INFO] ------------------------------------------------------------------------
[INFO] BUILD FAILURE
[INFO] ------------------------------------------------------------------------
[INFO] Total time: 02:13 h
[INFO] Finished at: 2016-05-13T02:28:07+00:00
[INFO] Final Memory: 37M/703M
[INFO] ------------------------------------------------------------------------
[WARNING] The requested profile "parallel-tests" could not be activated because it does not exist.
[ERROR] Failed to execute goal org.apache.maven.plugins:maven-surefire-plugin:2.17:test (default-test) on project hadoop-mapreduce-client-jobclient: There are test failures.
[ERROR] 
[ERROR] Please refer to /home/jenkins/jenkins-slave/workspace/Hadoop-Mapreduce-trunk/hadoop-mapreduce-project/hadoop-mapreduce-client/hadoop-mapreduce-client-jobclient/target/surefire-reports for the individual test results.
[ERROR] -> [Help 1]
[ERROR] 
[ERROR] To see the full stack trace of the errors, re-run Maven with the -e switch.
[ERROR] Re-run Maven using the -X switch to enable full debug logging.
[ERROR] 
[ERROR] For more information about the errors and possible solutions, please read the following articles:
[ERROR] [Help 1] http://cwiki.apache.org/confluence/display/MAVEN/MojoFailureException
[ERROR] 
[ERROR] After correcting the problems, you can resume the build with the command
[ERROR]   mvn <goals> -rf :hadoop-mapreduce-client-jobclient
Build step 'Execute shell' marked build as failure
[FINDBUGS] Skipping publisher since build result is FAILURE
Archiving artifacts
Recording test results
Email was triggered for: Failure - Any
Sending email for trigger: Failure - Any



###################################################################################
############################## FAILED TESTS (if any) ##############################
2 tests failed.
FAILED:  org.apache.hadoop.mapred.TestMiniMRChildTask.testTaskEnv

Error Message:
The environment checker job failed.

Stack Trace:
java.lang.AssertionError: The environment checker job failed.
	at org.junit.Assert.fail(Assert.java:88)
	at org.junit.Assert.assertTrue(Assert.java:41)
	at org.apache.hadoop.mapred.TestMiniMRChildTask.runTestTaskEnv(TestMiniMRChildTask.java:550)
	at org.apache.hadoop.mapred.TestMiniMRChildTask.testTaskEnv(TestMiniMRChildTask.java:472)


FAILED:  org.apache.hadoop.mapred.TestMiniMRChildTask.testTaskOldEnv

Error Message:
The environment checker job failed.

Stack Trace:
java.lang.AssertionError: The environment checker job failed.
	at org.junit.Assert.fail(Assert.java:88)
	at org.junit.Assert.assertTrue(Assert.java:41)
	at org.apache.hadoop.mapred.TestMiniMRChildTask.runTestTaskEnv(TestMiniMRChildTask.java:550)
	at org.apache.hadoop.mapred.TestMiniMRChildTask.testTaskOldEnv(TestMiniMRChildTask.java:496)




Hadoop-Mapreduce-trunk - Build # 3312 - Still Failing

Posted by Apache Jenkins Server <je...@builds.apache.org>.
See https://builds.apache.org/job/Hadoop-Mapreduce-trunk/3312/

###################################################################################
########################## LAST 60 LINES OF THE CONSOLE ###########################
[...truncated 32157 lines...]
[INFO] --- maven-antrun-plugin:1.7:run (create-testdirs) @ hadoop-mapreduce ---
[INFO] Executing tasks

main:
[INFO] Executed tasks
[INFO] 
[INFO] --- maven-antrun-plugin:1.7:run (tar) @ hadoop-mapreduce ---
[INFO] Executing tasks

main:
[INFO] Executed tasks
[INFO] 
[INFO] --- maven-site-plugin:3.5:attach-descriptor (attach-descriptor) @ hadoop-mapreduce ---
[INFO] 
[INFO] --- maven-enforcer-plugin:1.3.1:enforce (depcheck) @ hadoop-mapreduce ---
[INFO] 
[INFO] --- maven-install-plugin:2.5.1:install (default-install) @ hadoop-mapreduce ---
[INFO] Installing /home/jenkins/jenkins-slave/workspace/Hadoop-Mapreduce-trunk/hadoop-mapreduce-project/pom.xml to /home/jenkins/.m2/repository/org/apache/hadoop/hadoop-mapreduce/3.0.0-alpha1-SNAPSHOT/hadoop-mapreduce-3.0.0-alpha1-SNAPSHOT.pom
[INFO] ------------------------------------------------------------------------
[INFO] Reactor Summary:
[INFO] 
[INFO] Apache Hadoop MapReduce Client .................... SUCCESS [  2.901 s]
[INFO] Apache Hadoop MapReduce Core ...................... SUCCESS [01:53 min]
[INFO] Apache Hadoop MapReduce Common .................... SUCCESS [ 28.824 s]
[INFO] Apache Hadoop MapReduce Shuffle ................... SUCCESS [  5.305 s]
[INFO] Apache Hadoop MapReduce App ....................... FAILURE [08:27 min]
[INFO] Apache Hadoop MapReduce HistoryServer ............. SKIPPED
[INFO] Apache Hadoop MapReduce JobClient ................. SKIPPED
[INFO] Apache Hadoop MapReduce HistoryServer Plugins ..... SUCCESS [  1.561 s]
[INFO] Apache Hadoop MapReduce NativeTask ................ SUCCESS [09:22 min]
[INFO] Apache Hadoop MapReduce Examples .................. SKIPPED
[INFO] Apache Hadoop MapReduce ........................... SUCCESS [  0.252 s]
[INFO] ------------------------------------------------------------------------
[INFO] BUILD FAILURE
[INFO] ------------------------------------------------------------------------
[INFO] Total time: 20:23 min
[INFO] Finished at: 2016-05-12T23:12:50+00:00
[INFO] Final Memory: 36M/691M
[INFO] ------------------------------------------------------------------------
[WARNING] The requested profile "parallel-tests" could not be activated because it does not exist.
[ERROR] Failed to execute goal org.apache.maven.plugins:maven-surefire-plugin:2.17:test (default-test) on project hadoop-mapreduce-client-app: There are test failures.
[ERROR] 
[ERROR] Please refer to /home/jenkins/jenkins-slave/workspace/Hadoop-Mapreduce-trunk/hadoop-mapreduce-project/hadoop-mapreduce-client/hadoop-mapreduce-client-app/target/surefire-reports for the individual test results.
[ERROR] -> [Help 1]
[ERROR] 
[ERROR] To see the full stack trace of the errors, re-run Maven with the -e switch.
[ERROR] Re-run Maven using the -X switch to enable full debug logging.
[ERROR] 
[ERROR] For more information about the errors and possible solutions, please read the following articles:
[ERROR] [Help 1] http://cwiki.apache.org/confluence/display/MAVEN/MojoFailureException
[ERROR] 
[ERROR] After correcting the problems, you can resume the build with the command
[ERROR]   mvn <goals> -rf :hadoop-mapreduce-client-app
Build step 'Execute shell' marked build as failure
[FINDBUGS] Skipping publisher since build result is FAILURE
Archiving artifacts
Recording test results
Email was triggered for: Failure - Any
Sending email for trigger: Failure - Any



###################################################################################
############################## FAILED TESTS (if any) ##############################
2 tests failed.
FAILED:  org.apache.hadoop.mapreduce.jobhistory.TestJobHistoryEventHandler.org.apache.hadoop.mapreduce.jobhistory.TestJobHistoryEventHandler

Error Message:
Timed out waiting for Mini HDFS Cluster to start

Stack Trace:
java.io.IOException: Timed out waiting for Mini HDFS Cluster to start
	at org.apache.hadoop.hdfs.MiniDFSCluster.waitClusterUp(MiniDFSCluster.java:1345)
	at org.apache.hadoop.hdfs.MiniDFSCluster.initMiniDFSCluster(MiniDFSCluster.java:848)
	at org.apache.hadoop.hdfs.MiniDFSCluster.<init>(MiniDFSCluster.java:482)
	at org.apache.hadoop.hdfs.MiniDFSCluster$Builder.build(MiniDFSCluster.java:441)
	at org.apache.hadoop.mapreduce.jobhistory.TestJobHistoryEventHandler.setUpClass(TestJobHistoryEventHandler.java:93)


FAILED:  org.apache.hadoop.mapreduce.jobhistory.TestJobHistoryEventHandler.org.apache.hadoop.mapreduce.jobhistory.TestJobHistoryEventHandler

Error Message:
null

Stack Trace:
java.lang.NullPointerException: null
	at org.apache.hadoop.mapreduce.jobhistory.TestJobHistoryEventHandler.cleanUpClass(TestJobHistoryEventHandler.java:98)




Hadoop-Mapreduce-trunk - Build # 3311 - Still Failing

Posted by Apache Jenkins Server <je...@builds.apache.org>.
See https://builds.apache.org/job/Hadoop-Mapreduce-trunk/3311/

###################################################################################
########################## LAST 60 LINES OF THE CONSOLE ###########################
[...truncated 32661 lines...]
[INFO] --- maven-antrun-plugin:1.7:run (create-testdirs) @ hadoop-mapreduce ---
[INFO] Executing tasks

main:
[INFO] Executed tasks
[INFO] 
[INFO] --- maven-antrun-plugin:1.7:run (tar) @ hadoop-mapreduce ---
[INFO] Executing tasks

main:
[INFO] Executed tasks
[INFO] 
[INFO] --- maven-site-plugin:3.5:attach-descriptor (attach-descriptor) @ hadoop-mapreduce ---
[INFO] 
[INFO] --- maven-enforcer-plugin:1.3.1:enforce (depcheck) @ hadoop-mapreduce ---
[INFO] 
[INFO] --- maven-install-plugin:2.5.1:install (default-install) @ hadoop-mapreduce ---
[INFO] Installing /home/jenkins/jenkins-slave/workspace/Hadoop-Mapreduce-trunk/hadoop-mapreduce-project/pom.xml to /home/jenkins/.m2/repository/org/apache/hadoop/hadoop-mapreduce/3.0.0-SNAPSHOT/hadoop-mapreduce-3.0.0-SNAPSHOT.pom
[INFO] ------------------------------------------------------------------------
[INFO] Reactor Summary:
[INFO] 
[INFO] Apache Hadoop MapReduce Client .................... SUCCESS [  3.923 s]
[INFO] Apache Hadoop MapReduce Core ...................... SUCCESS [02:29 min]
[INFO] Apache Hadoop MapReduce Common .................... SUCCESS [ 36.372 s]
[INFO] Apache Hadoop MapReduce Shuffle ................... SUCCESS [  6.938 s]
[INFO] Apache Hadoop MapReduce App ....................... SUCCESS [10:13 min]
[INFO] Apache Hadoop MapReduce HistoryServer ............. SUCCESS [06:39 min]
[INFO] Apache Hadoop MapReduce JobClient ................. FAILURE [  02:08 h]
[INFO] Apache Hadoop MapReduce HistoryServer Plugins ..... SUCCESS [  2.456 s]
[INFO] Apache Hadoop MapReduce NativeTask ................ SUCCESS [13:59 min]
[INFO] Apache Hadoop MapReduce Examples .................. SKIPPED
[INFO] Apache Hadoop MapReduce ........................... SUCCESS [  0.540 s]
[INFO] ------------------------------------------------------------------------
[INFO] BUILD FAILURE
[INFO] ------------------------------------------------------------------------
[INFO] Total time: 02:42 h
[INFO] Finished at: 2016-05-12T21:23:23+00:00
[INFO] Final Memory: 35M/603M
[INFO] ------------------------------------------------------------------------
[WARNING] The requested profile "parallel-tests" could not be activated because it does not exist.
[ERROR] Failed to execute goal org.apache.maven.plugins:maven-surefire-plugin:2.17:test (default-test) on project hadoop-mapreduce-client-jobclient: There are test failures.
[ERROR] 
[ERROR] Please refer to /home/jenkins/jenkins-slave/workspace/Hadoop-Mapreduce-trunk/hadoop-mapreduce-project/hadoop-mapreduce-client/hadoop-mapreduce-client-jobclient/target/surefire-reports for the individual test results.
[ERROR] -> [Help 1]
[ERROR] 
[ERROR] To see the full stack trace of the errors, re-run Maven with the -e switch.
[ERROR] Re-run Maven using the -X switch to enable full debug logging.
[ERROR] 
[ERROR] For more information about the errors and possible solutions, please read the following articles:
[ERROR] [Help 1] http://cwiki.apache.org/confluence/display/MAVEN/MojoFailureException
[ERROR] 
[ERROR] After correcting the problems, you can resume the build with the command
[ERROR]   mvn <goals> -rf :hadoop-mapreduce-client-jobclient
Build step 'Execute shell' marked build as failure
[FINDBUGS] Skipping publisher since build result is FAILURE
Archiving artifacts
Recording test results
Email was triggered for: Failure - Any
Sending email for trigger: Failure - Any



###################################################################################
############################## FAILED TESTS (if any) ##############################
3 tests failed.
FAILED:  org.apache.hadoop.hdfs.TestNNBench.testNNBenchCreateReadAndDelete

Error Message:
create_write should create the file

Stack Trace:
java.lang.AssertionError: create_write should create the file
	at org.junit.Assert.fail(Assert.java:88)
	at org.junit.Assert.assertTrue(Assert.java:41)
	at org.apache.hadoop.hdfs.TestNNBench.testNNBenchCreateReadAndDelete(TestNNBench.java:55)


FAILED:  org.apache.hadoop.mapred.TestMiniMRChildTask.testTaskEnv

Error Message:
The environment checker job failed.

Stack Trace:
java.lang.AssertionError: The environment checker job failed.
	at org.junit.Assert.fail(Assert.java:88)
	at org.junit.Assert.assertTrue(Assert.java:41)
	at org.apache.hadoop.mapred.TestMiniMRChildTask.runTestTaskEnv(TestMiniMRChildTask.java:550)
	at org.apache.hadoop.mapred.TestMiniMRChildTask.testTaskEnv(TestMiniMRChildTask.java:472)


FAILED:  org.apache.hadoop.mapred.TestMiniMRChildTask.testTaskOldEnv

Error Message:
The environment checker job failed.

Stack Trace:
java.lang.AssertionError: The environment checker job failed.
	at org.junit.Assert.fail(Assert.java:88)
	at org.junit.Assert.assertTrue(Assert.java:41)
	at org.apache.hadoop.mapred.TestMiniMRChildTask.runTestTaskEnv(TestMiniMRChildTask.java:550)
	at org.apache.hadoop.mapred.TestMiniMRChildTask.testTaskOldEnv(TestMiniMRChildTask.java:496)




Hadoop-Mapreduce-trunk - Build # 3310 - Still Failing

Posted by Apache Jenkins Server <je...@builds.apache.org>.
See https://builds.apache.org/job/Hadoop-Mapreduce-trunk/3310/

###################################################################################
########################## LAST 60 LINES OF THE CONSOLE ###########################
[...truncated 32661 lines...]
[INFO] --- maven-antrun-plugin:1.7:run (create-testdirs) @ hadoop-mapreduce ---
[INFO] Executing tasks

main:
[INFO] Executed tasks
[INFO] 
[INFO] --- maven-antrun-plugin:1.7:run (tar) @ hadoop-mapreduce ---
[INFO] Executing tasks

main:
[INFO] Executed tasks
[INFO] 
[INFO] --- maven-site-plugin:3.5:attach-descriptor (attach-descriptor) @ hadoop-mapreduce ---
[INFO] 
[INFO] --- maven-enforcer-plugin:1.3.1:enforce (depcheck) @ hadoop-mapreduce ---
[INFO] 
[INFO] --- maven-install-plugin:2.5.1:install (default-install) @ hadoop-mapreduce ---
[INFO] Installing /home/jenkins/jenkins-slave/workspace/Hadoop-Mapreduce-trunk/hadoop-mapreduce-project/pom.xml to /home/jenkins/.m2/repository/org/apache/hadoop/hadoop-mapreduce/3.0.0-SNAPSHOT/hadoop-mapreduce-3.0.0-SNAPSHOT.pom
[INFO] ------------------------------------------------------------------------
[INFO] Reactor Summary:
[INFO] 
[INFO] Apache Hadoop MapReduce Client .................... SUCCESS [  2.824 s]
[INFO] Apache Hadoop MapReduce Core ...................... SUCCESS [01:53 min]
[INFO] Apache Hadoop MapReduce Common .................... SUCCESS [ 28.702 s]
[INFO] Apache Hadoop MapReduce Shuffle ................... SUCCESS [  5.307 s]
[INFO] Apache Hadoop MapReduce App ....................... SUCCESS [08:44 min]
[INFO] Apache Hadoop MapReduce HistoryServer ............. SUCCESS [05:50 min]
[INFO] Apache Hadoop MapReduce JobClient ................. FAILURE [  01:44 h]
[INFO] Apache Hadoop MapReduce HistoryServer Plugins ..... SUCCESS [  1.608 s]
[INFO] Apache Hadoop MapReduce NativeTask ................ SUCCESS [09:39 min]
[INFO] Apache Hadoop MapReduce Examples .................. SKIPPED
[INFO] Apache Hadoop MapReduce ........................... SUCCESS [  0.238 s]
[INFO] ------------------------------------------------------------------------
[INFO] BUILD FAILURE
[INFO] ------------------------------------------------------------------------
[INFO] Total time: 02:11 h
[INFO] Finished at: 2016-05-12T16:26:47+00:00
[INFO] Final Memory: 35M/598M
[INFO] ------------------------------------------------------------------------
[WARNING] The requested profile "parallel-tests" could not be activated because it does not exist.
[ERROR] Failed to execute goal org.apache.maven.plugins:maven-surefire-plugin:2.17:test (default-test) on project hadoop-mapreduce-client-jobclient: There are test failures.
[ERROR] 
[ERROR] Please refer to /home/jenkins/jenkins-slave/workspace/Hadoop-Mapreduce-trunk/hadoop-mapreduce-project/hadoop-mapreduce-client/hadoop-mapreduce-client-jobclient/target/surefire-reports for the individual test results.
[ERROR] -> [Help 1]
[ERROR] 
[ERROR] To see the full stack trace of the errors, re-run Maven with the -e switch.
[ERROR] Re-run Maven using the -X switch to enable full debug logging.
[ERROR] 
[ERROR] For more information about the errors and possible solutions, please read the following articles:
[ERROR] [Help 1] http://cwiki.apache.org/confluence/display/MAVEN/MojoFailureException
[ERROR] 
[ERROR] After correcting the problems, you can resume the build with the command
[ERROR]   mvn <goals> -rf :hadoop-mapreduce-client-jobclient
Build step 'Execute shell' marked build as failure
[FINDBUGS] Skipping publisher since build result is FAILURE
Archiving artifacts
Recording test results
Email was triggered for: Failure - Any
Sending email for trigger: Failure - Any



###################################################################################
############################## FAILED TESTS (if any) ##############################
3 tests failed.
FAILED:  org.apache.hadoop.mapred.TestMRCJCFileOutputCommitter.testAbort

Error Message:
Output directory not empty expected:<0> but was:<4>

Stack Trace:
java.lang.AssertionError: Output directory not empty expected:<0> but was:<4>
	at org.junit.Assert.fail(Assert.java:88)
	at org.junit.Assert.failNotEquals(Assert.java:743)
	at org.junit.Assert.assertEquals(Assert.java:118)
	at org.junit.Assert.assertEquals(Assert.java:555)
	at org.apache.hadoop.mapred.TestMRCJCFileOutputCommitter.testAbort(TestMRCJCFileOutputCommitter.java:153)


FAILED:  org.apache.hadoop.mapred.TestMiniMRChildTask.testTaskEnv

Error Message:
The environment checker job failed.

Stack Trace:
java.lang.AssertionError: The environment checker job failed.
	at org.junit.Assert.fail(Assert.java:88)
	at org.junit.Assert.assertTrue(Assert.java:41)
	at org.apache.hadoop.mapred.TestMiniMRChildTask.runTestTaskEnv(TestMiniMRChildTask.java:550)
	at org.apache.hadoop.mapred.TestMiniMRChildTask.testTaskEnv(TestMiniMRChildTask.java:472)


FAILED:  org.apache.hadoop.mapred.TestMiniMRChildTask.testTaskOldEnv

Error Message:
The environment checker job failed.

Stack Trace:
java.lang.AssertionError: The environment checker job failed.
	at org.junit.Assert.fail(Assert.java:88)
	at org.junit.Assert.assertTrue(Assert.java:41)
	at org.apache.hadoop.mapred.TestMiniMRChildTask.runTestTaskEnv(TestMiniMRChildTask.java:550)
	at org.apache.hadoop.mapred.TestMiniMRChildTask.testTaskOldEnv(TestMiniMRChildTask.java:496)




Hadoop-Mapreduce-trunk - Build # 3309 - Still Failing

Posted by Apache Jenkins Server <je...@builds.apache.org>.
See https://builds.apache.org/job/Hadoop-Mapreduce-trunk/3309/

###################################################################################
########################## LAST 60 LINES OF THE CONSOLE ###########################
[...truncated 32664 lines...]
[INFO] --- maven-antrun-plugin:1.7:run (create-testdirs) @ hadoop-mapreduce ---
[INFO] Executing tasks

main:
[INFO] Executed tasks
[INFO] 
[INFO] --- maven-antrun-plugin:1.7:run (tar) @ hadoop-mapreduce ---
[INFO] Executing tasks

main:
[INFO] Executed tasks
[INFO] 
[INFO] --- maven-site-plugin:3.5:attach-descriptor (attach-descriptor) @ hadoop-mapreduce ---
[INFO] 
[INFO] --- maven-enforcer-plugin:1.3.1:enforce (depcheck) @ hadoop-mapreduce ---
[INFO] 
[INFO] --- maven-install-plugin:2.5.1:install (default-install) @ hadoop-mapreduce ---
[INFO] Installing /home/jenkins/jenkins-slave/workspace/Hadoop-Mapreduce-trunk/hadoop-mapreduce-project/pom.xml to /home/jenkins/.m2/repository/org/apache/hadoop/hadoop-mapreduce/3.0.0-SNAPSHOT/hadoop-mapreduce-3.0.0-SNAPSHOT.pom
[INFO] ------------------------------------------------------------------------
[INFO] Reactor Summary:
[INFO] 
[INFO] Apache Hadoop MapReduce Client .................... SUCCESS [  3.198 s]
[INFO] Apache Hadoop MapReduce Core ...................... SUCCESS [01:55 min]
[INFO] Apache Hadoop MapReduce Common .................... SUCCESS [ 30.688 s]
[INFO] Apache Hadoop MapReduce Shuffle ................... SUCCESS [  5.738 s]
[INFO] Apache Hadoop MapReduce App ....................... SUCCESS [08:43 min]
[INFO] Apache Hadoop MapReduce HistoryServer ............. SUCCESS [05:49 min]
[INFO] Apache Hadoop MapReduce JobClient ................. FAILURE [  01:46 h]
[INFO] Apache Hadoop MapReduce HistoryServer Plugins ..... SUCCESS [  1.460 s]
[INFO] Apache Hadoop MapReduce NativeTask ................ SUCCESS [09:50 min]
[INFO] Apache Hadoop MapReduce Examples .................. SKIPPED
[INFO] Apache Hadoop MapReduce ........................... SUCCESS [  0.251 s]
[INFO] ------------------------------------------------------------------------
[INFO] BUILD FAILURE
[INFO] ------------------------------------------------------------------------
[INFO] Total time: 02:13 h
[INFO] Finished at: 2016-05-12T13:25:13+00:00
[INFO] Final Memory: 36M/733M
[INFO] ------------------------------------------------------------------------
[WARNING] The requested profile "parallel-tests" could not be activated because it does not exist.
[ERROR] Failed to execute goal org.apache.maven.plugins:maven-surefire-plugin:2.17:test (default-test) on project hadoop-mapreduce-client-jobclient: There are test failures.
[ERROR] 
[ERROR] Please refer to /home/jenkins/jenkins-slave/workspace/Hadoop-Mapreduce-trunk/hadoop-mapreduce-project/hadoop-mapreduce-client/hadoop-mapreduce-client-jobclient/target/surefire-reports for the individual test results.
[ERROR] -> [Help 1]
[ERROR] 
[ERROR] To see the full stack trace of the errors, re-run Maven with the -e switch.
[ERROR] Re-run Maven using the -X switch to enable full debug logging.
[ERROR] 
[ERROR] For more information about the errors and possible solutions, please read the following articles:
[ERROR] [Help 1] http://cwiki.apache.org/confluence/display/MAVEN/MojoFailureException
[ERROR] 
[ERROR] After correcting the problems, you can resume the build with the command
[ERROR]   mvn <goals> -rf :hadoop-mapreduce-client-jobclient
Build step 'Execute shell' marked build as failure
[FINDBUGS] Skipping publisher since build result is FAILURE
Archiving artifacts
Recording test results
Email was triggered for: Failure - Any
Sending email for trigger: Failure - Any



###################################################################################
############################## FAILED TESTS (if any) ##############################
3 tests failed.
FAILED:  org.apache.hadoop.mapred.TestMRCJCFileOutputCommitter.testAbort

Error Message:
Output directory not empty expected:<0> but was:<4>

Stack Trace:
java.lang.AssertionError: Output directory not empty expected:<0> but was:<4>
	at org.junit.Assert.fail(Assert.java:88)
	at org.junit.Assert.failNotEquals(Assert.java:743)
	at org.junit.Assert.assertEquals(Assert.java:118)
	at org.junit.Assert.assertEquals(Assert.java:555)
	at org.apache.hadoop.mapred.TestMRCJCFileOutputCommitter.testAbort(TestMRCJCFileOutputCommitter.java:153)


FAILED:  org.apache.hadoop.mapred.TestMiniMRChildTask.testTaskEnv

Error Message:
The environment checker job failed.

Stack Trace:
java.lang.AssertionError: The environment checker job failed.
	at org.junit.Assert.fail(Assert.java:88)
	at org.junit.Assert.assertTrue(Assert.java:41)
	at org.apache.hadoop.mapred.TestMiniMRChildTask.runTestTaskEnv(TestMiniMRChildTask.java:550)
	at org.apache.hadoop.mapred.TestMiniMRChildTask.testTaskEnv(TestMiniMRChildTask.java:472)


FAILED:  org.apache.hadoop.mapred.TestMiniMRChildTask.testTaskOldEnv

Error Message:
The environment checker job failed.

Stack Trace:
java.lang.AssertionError: The environment checker job failed.
	at org.junit.Assert.fail(Assert.java:88)
	at org.junit.Assert.assertTrue(Assert.java:41)
	at org.apache.hadoop.mapred.TestMiniMRChildTask.runTestTaskEnv(TestMiniMRChildTask.java:550)
	at org.apache.hadoop.mapred.TestMiniMRChildTask.testTaskOldEnv(TestMiniMRChildTask.java:496)




Hadoop-Mapreduce-trunk - Build # 3308 - Still Failing

Posted by Apache Jenkins Server <je...@builds.apache.org>.
See https://builds.apache.org/job/Hadoop-Mapreduce-trunk/3308/

###################################################################################
########################## LAST 60 LINES OF THE CONSOLE ###########################
[...truncated 32654 lines...]
[INFO] --- maven-antrun-plugin:1.7:run (create-testdirs) @ hadoop-mapreduce ---
[INFO] Executing tasks

main:
[INFO] Executed tasks
[INFO] 
[INFO] --- maven-antrun-plugin:1.7:run (tar) @ hadoop-mapreduce ---
[INFO] Executing tasks

main:
[INFO] Executed tasks
[INFO] 
[INFO] --- maven-site-plugin:3.5:attach-descriptor (attach-descriptor) @ hadoop-mapreduce ---
[INFO] 
[INFO] --- maven-enforcer-plugin:1.3.1:enforce (depcheck) @ hadoop-mapreduce ---
[INFO] 
[INFO] --- maven-install-plugin:2.5.1:install (default-install) @ hadoop-mapreduce ---
[INFO] Installing /home/jenkins/jenkins-slave/workspace/Hadoop-Mapreduce-trunk/hadoop-mapreduce-project/pom.xml to /home/jenkins/.m2/repository/org/apache/hadoop/hadoop-mapreduce/3.0.0-SNAPSHOT/hadoop-mapreduce-3.0.0-SNAPSHOT.pom
[INFO] ------------------------------------------------------------------------
[INFO] Reactor Summary:
[INFO] 
[INFO] Apache Hadoop MapReduce Client .................... SUCCESS [  3.735 s]
[INFO] Apache Hadoop MapReduce Core ...................... SUCCESS [02:03 min]
[INFO] Apache Hadoop MapReduce Common .................... SUCCESS [ 31.280 s]
[INFO] Apache Hadoop MapReduce Shuffle ................... SUCCESS [  5.176 s]
[INFO] Apache Hadoop MapReduce App ....................... SUCCESS [09:10 min]
[INFO] Apache Hadoop MapReduce HistoryServer ............. SUCCESS [06:10 min]
[INFO] Apache Hadoop MapReduce JobClient ................. FAILURE [  01:46 h]
[INFO] Apache Hadoop MapReduce HistoryServer Plugins ..... SUCCESS [  1.490 s]
[INFO] Apache Hadoop MapReduce NativeTask ................ SUCCESS [09:41 min]
[INFO] Apache Hadoop MapReduce Examples .................. SKIPPED
[INFO] Apache Hadoop MapReduce ........................... SUCCESS [  0.260 s]
[INFO] ------------------------------------------------------------------------
[INFO] BUILD FAILURE
[INFO] ------------------------------------------------------------------------
[INFO] Total time: 02:14 h
[INFO] Finished at: 2016-05-12T06:01:13+00:00
[INFO] Final Memory: 35M/594M
[INFO] ------------------------------------------------------------------------
[WARNING] The requested profile "parallel-tests" could not be activated because it does not exist.
[ERROR] Failed to execute goal org.apache.maven.plugins:maven-surefire-plugin:2.17:test (default-test) on project hadoop-mapreduce-client-jobclient: There are test failures.
[ERROR] 
[ERROR] Please refer to /home/jenkins/jenkins-slave/workspace/Hadoop-Mapreduce-trunk/hadoop-mapreduce-project/hadoop-mapreduce-client/hadoop-mapreduce-client-jobclient/target/surefire-reports for the individual test results.
[ERROR] -> [Help 1]
[ERROR] 
[ERROR] To see the full stack trace of the errors, re-run Maven with the -e switch.
[ERROR] Re-run Maven using the -X switch to enable full debug logging.
[ERROR] 
[ERROR] For more information about the errors and possible solutions, please read the following articles:
[ERROR] [Help 1] http://cwiki.apache.org/confluence/display/MAVEN/MojoFailureException
[ERROR] 
[ERROR] After correcting the problems, you can resume the build with the command
[ERROR]   mvn <goals> -rf :hadoop-mapreduce-client-jobclient
Build step 'Execute shell' marked build as failure
[FINDBUGS] Skipping publisher since build result is FAILURE
Archiving artifacts
Recording test results
Email was triggered for: Failure - Any
Sending email for trigger: Failure - Any



###################################################################################
############################## FAILED TESTS (if any) ##############################
2 tests failed.
FAILED:  org.apache.hadoop.mapred.TestMiniMRChildTask.testTaskEnv

Error Message:
The environment checker job failed.

Stack Trace:
java.lang.AssertionError: The environment checker job failed.
	at org.junit.Assert.fail(Assert.java:88)
	at org.junit.Assert.assertTrue(Assert.java:41)
	at org.apache.hadoop.mapred.TestMiniMRChildTask.runTestTaskEnv(TestMiniMRChildTask.java:550)
	at org.apache.hadoop.mapred.TestMiniMRChildTask.testTaskEnv(TestMiniMRChildTask.java:472)


FAILED:  org.apache.hadoop.mapred.TestMiniMRChildTask.testTaskOldEnv

Error Message:
The environment checker job failed.

Stack Trace:
java.lang.AssertionError: The environment checker job failed.
	at org.junit.Assert.fail(Assert.java:88)
	at org.junit.Assert.assertTrue(Assert.java:41)
	at org.apache.hadoop.mapred.TestMiniMRChildTask.runTestTaskEnv(TestMiniMRChildTask.java:550)
	at org.apache.hadoop.mapred.TestMiniMRChildTask.testTaskOldEnv(TestMiniMRChildTask.java:496)




Hadoop-Mapreduce-trunk - Build # 3307 - Still Failing

Posted by Apache Jenkins Server <je...@builds.apache.org>.
See https://builds.apache.org/job/Hadoop-Mapreduce-trunk/3307/

###################################################################################
########################## LAST 60 LINES OF THE CONSOLE ###########################
[...truncated 32738 lines...]
[INFO] --- maven-antrun-plugin:1.7:run (create-testdirs) @ hadoop-mapreduce ---
[INFO] Executing tasks

main:
[INFO] Executed tasks
[INFO] 
[INFO] --- maven-antrun-plugin:1.7:run (tar) @ hadoop-mapreduce ---
[INFO] Executing tasks

main:
[INFO] Executed tasks
[INFO] 
[INFO] --- maven-site-plugin:3.5:attach-descriptor (attach-descriptor) @ hadoop-mapreduce ---
[INFO] 
[INFO] --- maven-enforcer-plugin:1.3.1:enforce (depcheck) @ hadoop-mapreduce ---
[INFO] 
[INFO] --- maven-install-plugin:2.5.1:install (default-install) @ hadoop-mapreduce ---
[INFO] Installing /home/jenkins/jenkins-slave/workspace/Hadoop-Mapreduce-trunk/hadoop-mapreduce-project/pom.xml to /home/jenkins/.m2/repository/org/apache/hadoop/hadoop-mapreduce/3.0.0-SNAPSHOT/hadoop-mapreduce-3.0.0-SNAPSHOT.pom
[INFO] ------------------------------------------------------------------------
[INFO] Reactor Summary:
[INFO] 
[INFO] Apache Hadoop MapReduce Client .................... SUCCESS [  4.447 s]
[INFO] Apache Hadoop MapReduce Core ...................... SUCCESS [01:53 min]
[INFO] Apache Hadoop MapReduce Common .................... SUCCESS [ 30.379 s]
[INFO] Apache Hadoop MapReduce Shuffle ................... SUCCESS [  5.534 s]
[INFO] Apache Hadoop MapReduce App ....................... SUCCESS [08:37 min]
[INFO] Apache Hadoop MapReduce HistoryServer ............. SUCCESS [05:50 min]
[INFO] Apache Hadoop MapReduce JobClient ................. FAILURE [  01:47 h]
[INFO] Apache Hadoop MapReduce HistoryServer Plugins ..... SUCCESS [  1.503 s]
[INFO] Apache Hadoop MapReduce NativeTask ................ SUCCESS [09:00 min]
[INFO] Apache Hadoop MapReduce Examples .................. SKIPPED
[INFO] Apache Hadoop MapReduce ........................... SUCCESS [  0.259 s]
[INFO] ------------------------------------------------------------------------
[INFO] BUILD FAILURE
[INFO] ------------------------------------------------------------------------
[INFO] Total time: 02:13 h
[INFO] Finished at: 2016-05-12T02:16:16+00:00
[INFO] Final Memory: 37M/595M
[INFO] ------------------------------------------------------------------------
[WARNING] The requested profile "parallel-tests" could not be activated because it does not exist.
[ERROR] Failed to execute goal org.apache.maven.plugins:maven-surefire-plugin:2.17:test (default-test) on project hadoop-mapreduce-client-jobclient: There are test failures.
[ERROR] 
[ERROR] Please refer to /home/jenkins/jenkins-slave/workspace/Hadoop-Mapreduce-trunk/hadoop-mapreduce-project/hadoop-mapreduce-client/hadoop-mapreduce-client-jobclient/target/surefire-reports for the individual test results.
[ERROR] -> [Help 1]
[ERROR] 
[ERROR] To see the full stack trace of the errors, re-run Maven with the -e switch.
[ERROR] Re-run Maven using the -X switch to enable full debug logging.
[ERROR] 
[ERROR] For more information about the errors and possible solutions, please read the following articles:
[ERROR] [Help 1] http://cwiki.apache.org/confluence/display/MAVEN/MojoFailureException
[ERROR] 
[ERROR] After correcting the problems, you can resume the build with the command
[ERROR]   mvn <goals> -rf :hadoop-mapreduce-client-jobclient
Build step 'Execute shell' marked build as failure
[FINDBUGS] Skipping publisher since build result is FAILURE
Archiving artifacts
Recording test results
Email was triggered for: Failure - Any
Sending email for trigger: Failure - Any



###################################################################################
############################## FAILED TESTS (if any) ##############################
3 tests failed.
FAILED:  org.apache.hadoop.mapred.TestMRCJCFileOutputCommitter.testAbort

Error Message:
Output directory not empty expected:<0> but was:<4>

Stack Trace:
java.lang.AssertionError: Output directory not empty expected:<0> but was:<4>
	at org.junit.Assert.fail(Assert.java:88)
	at org.junit.Assert.failNotEquals(Assert.java:743)
	at org.junit.Assert.assertEquals(Assert.java:118)
	at org.junit.Assert.assertEquals(Assert.java:555)
	at org.apache.hadoop.mapred.TestMRCJCFileOutputCommitter.testAbort(TestMRCJCFileOutputCommitter.java:153)


FAILED:  org.apache.hadoop.mapred.TestMiniMRChildTask.testTaskEnv

Error Message:
The environment checker job failed.

Stack Trace:
java.lang.AssertionError: The environment checker job failed.
	at org.junit.Assert.fail(Assert.java:88)
	at org.junit.Assert.assertTrue(Assert.java:41)
	at org.apache.hadoop.mapred.TestMiniMRChildTask.runTestTaskEnv(TestMiniMRChildTask.java:550)
	at org.apache.hadoop.mapred.TestMiniMRChildTask.testTaskEnv(TestMiniMRChildTask.java:472)


FAILED:  org.apache.hadoop.mapred.TestMiniMRChildTask.testTaskOldEnv

Error Message:
The environment checker job failed.

Stack Trace:
java.lang.AssertionError: The environment checker job failed.
	at org.junit.Assert.fail(Assert.java:88)
	at org.junit.Assert.assertTrue(Assert.java:41)
	at org.apache.hadoop.mapred.TestMiniMRChildTask.runTestTaskEnv(TestMiniMRChildTask.java:550)
	at org.apache.hadoop.mapred.TestMiniMRChildTask.testTaskOldEnv(TestMiniMRChildTask.java:496)




Hadoop-Mapreduce-trunk - Build # 3306 - Still Failing

Posted by Apache Jenkins Server <je...@builds.apache.org>.
See https://builds.apache.org/job/Hadoop-Mapreduce-trunk/3306/

###################################################################################
########################## LAST 60 LINES OF THE CONSOLE ###########################
[...truncated 32405 lines...]
[INFO] --- maven-antrun-plugin:1.7:run (create-testdirs) @ hadoop-mapreduce ---
[INFO] Executing tasks

main:
[INFO] Executed tasks
[INFO] 
[INFO] --- maven-antrun-plugin:1.7:run (tar) @ hadoop-mapreduce ---
[INFO] Executing tasks

main:
[INFO] Executed tasks
[INFO] 
[INFO] --- maven-site-plugin:3.5:attach-descriptor (attach-descriptor) @ hadoop-mapreduce ---
[INFO] 
[INFO] --- maven-enforcer-plugin:1.3.1:enforce (depcheck) @ hadoop-mapreduce ---
[INFO] 
[INFO] --- maven-install-plugin:2.5.1:install (default-install) @ hadoop-mapreduce ---
[INFO] Installing /home/jenkins/jenkins-slave/workspace/Hadoop-Mapreduce-trunk/hadoop-mapreduce-project/pom.xml to /home/jenkins/.m2/repository/org/apache/hadoop/hadoop-mapreduce/3.0.0-SNAPSHOT/hadoop-mapreduce-3.0.0-SNAPSHOT.pom
[INFO] ------------------------------------------------------------------------
[INFO] Reactor Summary:
[INFO] 
[INFO] Apache Hadoop MapReduce Client .................... SUCCESS [  4.006 s]
[INFO] Apache Hadoop MapReduce Core ...................... SUCCESS [02:21 min]
[INFO] Apache Hadoop MapReduce Common .................... SUCCESS [ 35.601 s]
[INFO] Apache Hadoop MapReduce Shuffle ................... SUCCESS [  7.376 s]
[INFO] Apache Hadoop MapReduce App ....................... FAILURE [09:55 min]
[INFO] Apache Hadoop MapReduce HistoryServer ............. SKIPPED
[INFO] Apache Hadoop MapReduce JobClient ................. SKIPPED
[INFO] Apache Hadoop MapReduce HistoryServer Plugins ..... SUCCESS [  2.068 s]
[INFO] Apache Hadoop MapReduce NativeTask ................ SUCCESS [11:40 min]
[INFO] Apache Hadoop MapReduce Examples .................. SKIPPED
[INFO] Apache Hadoop MapReduce ........................... SUCCESS [  0.329 s]
[INFO] ------------------------------------------------------------------------
[INFO] BUILD FAILURE
[INFO] ------------------------------------------------------------------------
[INFO] Total time: 24:48 min
[INFO] Finished at: 2016-05-11T20:25:20+00:00
[INFO] Final Memory: 37M/827M
[INFO] ------------------------------------------------------------------------
[WARNING] The requested profile "parallel-tests" could not be activated because it does not exist.
[ERROR] Failed to execute goal org.apache.maven.plugins:maven-surefire-plugin:2.17:test (default-test) on project hadoop-mapreduce-client-app: There are test failures.
[ERROR] 
[ERROR] Please refer to /home/jenkins/jenkins-slave/workspace/Hadoop-Mapreduce-trunk/hadoop-mapreduce-project/hadoop-mapreduce-client/hadoop-mapreduce-client-app/target/surefire-reports for the individual test results.
[ERROR] -> [Help 1]
[ERROR] 
[ERROR] To see the full stack trace of the errors, re-run Maven with the -e switch.
[ERROR] Re-run Maven using the -X switch to enable full debug logging.
[ERROR] 
[ERROR] For more information about the errors and possible solutions, please read the following articles:
[ERROR] [Help 1] http://cwiki.apache.org/confluence/display/MAVEN/MojoFailureException
[ERROR] 
[ERROR] After correcting the problems, you can resume the build with the command
[ERROR]   mvn <goals> -rf :hadoop-mapreduce-client-app
Build step 'Execute shell' marked build as failure
[FINDBUGS] Skipping publisher since build result is FAILURE
Archiving artifacts
Recording test results
Email was triggered for: Failure - Any
Sending email for trigger: Failure - Any



###################################################################################
############################## FAILED TESTS (if any) ##############################
16 tests failed.
FAILED:  org.apache.hadoop.mapreduce.v2.app.job.impl.TestMapReduceChildJVM.testCommandLine

Error Message:
org/apache/hadoop/security/authentication/server/AuthenticationFilter

Stack Trace:
java.lang.NoClassDefFoundError: org/apache/hadoop/security/authentication/server/AuthenticationFilter
	at java.net.URLClassLoader$1.run(URLClassLoader.java:366)
	at java.net.URLClassLoader$1.run(URLClassLoader.java:355)
	at java.security.AccessController.doPrivileged(Native Method)
	at java.net.URLClassLoader.findClass(URLClassLoader.java:354)
	at java.lang.ClassLoader.loadClass(ClassLoader.java:425)
	at sun.misc.Launcher$AppClassLoader.loadClass(Launcher.java:308)
	at java.lang.ClassLoader.loadClass(ClassLoader.java:358)
	at org.apache.hadoop.http.HttpServer2.constructSecretProvider(HttpServer2.java:454)
	at org.apache.hadoop.http.HttpServer2.<init>(HttpServer2.java:346)
	at org.apache.hadoop.http.HttpServer2.<init>(HttpServer2.java:109)
	at org.apache.hadoop.http.HttpServer2$Builder.build(HttpServer2.java:291)
	at org.apache.hadoop.yarn.webapp.WebApps$Builder.build(WebApps.java:276)
	at org.apache.hadoop.yarn.webapp.WebApps$Builder.start(WebApps.java:345)
	at org.apache.hadoop.mapreduce.v2.app.client.MRClientService.serviceStart(MRClientService.java:143)
	at org.apache.hadoop.service.AbstractService.start(AbstractService.java:193)
	at org.apache.hadoop.mapreduce.v2.app.MRAppMaster.serviceStart(MRAppMaster.java:1223)
	at org.apache.hadoop.service.AbstractService.start(AbstractService.java:193)
	at org.apache.hadoop.mapreduce.v2.app.MRApp.submit(MRApp.java:301)
	at org.apache.hadoop.mapreduce.v2.app.MRApp.submit(MRApp.java:285)
	at org.apache.hadoop.mapreduce.v2.app.job.impl.TestMapReduceChildJVM.testCommandLine(TestMapReduceChildJVM.java:54)


FAILED:  org.apache.hadoop.mapreduce.v2.app.job.impl.TestMapReduceChildJVM.testReduceCommandLineWithSeparateShuffle

Error Message:
Metrics source MRAppMetrics already exists!

Stack Trace:
org.apache.hadoop.metrics2.MetricsException: Metrics source MRAppMetrics already exists!
	at org.apache.hadoop.metrics2.lib.DefaultMetricsSystem.newSourceName(DefaultMetricsSystem.java:143)
	at org.apache.hadoop.metrics2.lib.DefaultMetricsSystem.sourceName(DefaultMetricsSystem.java:120)
	at org.apache.hadoop.metrics2.impl.MetricsSystemImpl.register(MetricsSystemImpl.java:229)
	at org.apache.hadoop.metrics2.MetricsSystem.register(MetricsSystem.java:71)
	at org.apache.hadoop.mapreduce.v2.app.metrics.MRAppMetrics.create(MRAppMetrics.java:59)
	at org.apache.hadoop.mapreduce.v2.app.metrics.MRAppMetrics.create(MRAppMetrics.java:54)
	at org.apache.hadoop.mapreduce.v2.app.MRAppMaster.<init>(MRAppMaster.java:263)
	at org.apache.hadoop.mapreduce.v2.app.MRApp.<init>(MRApp.java:235)
	at org.apache.hadoop.mapreduce.v2.app.MRApp.<init>(MRApp.java:212)
	at org.apache.hadoop.mapreduce.v2.app.MRApp.<init>(MRApp.java:193)
	at org.apache.hadoop.mapreduce.v2.app.MRApp.<init>(MRApp.java:154)
	at org.apache.hadoop.mapreduce.v2.app.job.impl.TestMapReduceChildJVM$MyMRApp.<init>(TestMapReduceChildJVM.java:256)
	at org.apache.hadoop.mapreduce.v2.app.job.impl.TestMapReduceChildJVM.testReduceCommandLine(TestMapReduceChildJVM.java:108)
	at org.apache.hadoop.mapreduce.v2.app.job.impl.TestMapReduceChildJVM.testReduceCommandLineWithSeparateShuffle(TestMapReduceChildJVM.java:87)


FAILED:  org.apache.hadoop.mapreduce.v2.app.job.impl.TestMapReduceChildJVM.testCommandLineWithLog4JConifg

Error Message:
Metrics source MRAppMetrics already exists!

Stack Trace:
org.apache.hadoop.metrics2.MetricsException: Metrics source MRAppMetrics already exists!
	at org.apache.hadoop.metrics2.lib.DefaultMetricsSystem.newSourceName(DefaultMetricsSystem.java:143)
	at org.apache.hadoop.metrics2.lib.DefaultMetricsSystem.sourceName(DefaultMetricsSystem.java:120)
	at org.apache.hadoop.metrics2.impl.MetricsSystemImpl.register(MetricsSystemImpl.java:229)
	at org.apache.hadoop.metrics2.MetricsSystem.register(MetricsSystem.java:71)
	at org.apache.hadoop.mapreduce.v2.app.metrics.MRAppMetrics.create(MRAppMetrics.java:59)
	at org.apache.hadoop.mapreduce.v2.app.metrics.MRAppMetrics.create(MRAppMetrics.java:54)
	at org.apache.hadoop.mapreduce.v2.app.MRAppMaster.<init>(MRAppMaster.java:263)
	at org.apache.hadoop.mapreduce.v2.app.MRApp.<init>(MRApp.java:235)
	at org.apache.hadoop.mapreduce.v2.app.MRApp.<init>(MRApp.java:212)
	at org.apache.hadoop.mapreduce.v2.app.MRApp.<init>(MRApp.java:193)
	at org.apache.hadoop.mapreduce.v2.app.MRApp.<init>(MRApp.java:154)
	at org.apache.hadoop.mapreduce.v2.app.job.impl.TestMapReduceChildJVM$MyMRApp.<init>(TestMapReduceChildJVM.java:256)
	at org.apache.hadoop.mapreduce.v2.app.job.impl.TestMapReduceChildJVM.testCommandLineWithLog4JConifg(TestMapReduceChildJVM.java:153)


FAILED:  org.apache.hadoop.mapreduce.v2.app.job.impl.TestMapReduceChildJVM.testReduceCommandLine

Error Message:
Metrics source MRAppMetrics already exists!

Stack Trace:
org.apache.hadoop.metrics2.MetricsException: Metrics source MRAppMetrics already exists!
	at org.apache.hadoop.metrics2.lib.DefaultMetricsSystem.newSourceName(DefaultMetricsSystem.java:143)
	at org.apache.hadoop.metrics2.lib.DefaultMetricsSystem.sourceName(DefaultMetricsSystem.java:120)
	at org.apache.hadoop.metrics2.impl.MetricsSystemImpl.register(MetricsSystemImpl.java:229)
	at org.apache.hadoop.metrics2.MetricsSystem.register(MetricsSystem.java:71)
	at org.apache.hadoop.mapreduce.v2.app.metrics.MRAppMetrics.create(MRAppMetrics.java:59)
	at org.apache.hadoop.mapreduce.v2.app.metrics.MRAppMetrics.create(MRAppMetrics.java:54)
	at org.apache.hadoop.mapreduce.v2.app.MRAppMaster.<init>(MRAppMaster.java:263)
	at org.apache.hadoop.mapreduce.v2.app.MRApp.<init>(MRApp.java:235)
	at org.apache.hadoop.mapreduce.v2.app.MRApp.<init>(MRApp.java:212)
	at org.apache.hadoop.mapreduce.v2.app.MRApp.<init>(MRApp.java:193)
	at org.apache.hadoop.mapreduce.v2.app.MRApp.<init>(MRApp.java:154)
	at org.apache.hadoop.mapreduce.v2.app.job.impl.TestMapReduceChildJVM$MyMRApp.<init>(TestMapReduceChildJVM.java:256)
	at org.apache.hadoop.mapreduce.v2.app.job.impl.TestMapReduceChildJVM.testReduceCommandLine(TestMapReduceChildJVM.java:108)
	at org.apache.hadoop.mapreduce.v2.app.job.impl.TestMapReduceChildJVM.testReduceCommandLine(TestMapReduceChildJVM.java:102)


FAILED:  org.apache.hadoop.mapreduce.v2.app.job.impl.TestMapReduceChildJVM.testAutoHeapSizes

Error Message:
Metrics source MRAppMetrics already exists!

Stack Trace:
org.apache.hadoop.metrics2.MetricsException: Metrics source MRAppMetrics already exists!
	at org.apache.hadoop.metrics2.lib.DefaultMetricsSystem.newSourceName(DefaultMetricsSystem.java:143)
	at org.apache.hadoop.metrics2.lib.DefaultMetricsSystem.sourceName(DefaultMetricsSystem.java:120)
	at org.apache.hadoop.metrics2.impl.MetricsSystemImpl.register(MetricsSystemImpl.java:229)
	at org.apache.hadoop.metrics2.MetricsSystem.register(MetricsSystem.java:71)
	at org.apache.hadoop.mapreduce.v2.app.metrics.MRAppMetrics.create(MRAppMetrics.java:59)
	at org.apache.hadoop.mapreduce.v2.app.metrics.MRAppMetrics.create(MRAppMetrics.java:54)
	at org.apache.hadoop.mapreduce.v2.app.MRAppMaster.<init>(MRAppMaster.java:263)
	at org.apache.hadoop.mapreduce.v2.app.MRApp.<init>(MRApp.java:235)
	at org.apache.hadoop.mapreduce.v2.app.MRApp.<init>(MRApp.java:212)
	at org.apache.hadoop.mapreduce.v2.app.MRApp.<init>(MRApp.java:193)
	at org.apache.hadoop.mapreduce.v2.app.MRApp.<init>(MRApp.java:154)
	at org.apache.hadoop.mapreduce.v2.app.job.impl.TestMapReduceChildJVM$MyMRApp.<init>(TestMapReduceChildJVM.java:256)
	at org.apache.hadoop.mapreduce.v2.app.job.impl.TestMapReduceChildJVM.testAutoHeapSize(TestMapReduceChildJVM.java:227)
	at org.apache.hadoop.mapreduce.v2.app.job.impl.TestMapReduceChildJVM.testAutoHeapSizes(TestMapReduceChildJVM.java:183)


FAILED:  org.apache.hadoop.mapreduce.v2.app.job.impl.TestMapReduceChildJVM.testEnvironmentVariables

Error Message:
Metrics source MRAppMetrics already exists!

Stack Trace:
org.apache.hadoop.metrics2.MetricsException: Metrics source MRAppMetrics already exists!
	at org.apache.hadoop.metrics2.lib.DefaultMetricsSystem.newSourceName(DefaultMetricsSystem.java:143)
	at org.apache.hadoop.metrics2.lib.DefaultMetricsSystem.sourceName(DefaultMetricsSystem.java:120)
	at org.apache.hadoop.metrics2.impl.MetricsSystemImpl.register(MetricsSystemImpl.java:229)
	at org.apache.hadoop.metrics2.MetricsSystem.register(MetricsSystem.java:71)
	at org.apache.hadoop.mapreduce.v2.app.metrics.MRAppMetrics.create(MRAppMetrics.java:59)
	at org.apache.hadoop.mapreduce.v2.app.metrics.MRAppMetrics.create(MRAppMetrics.java:54)
	at org.apache.hadoop.mapreduce.v2.app.MRAppMaster.<init>(MRAppMaster.java:263)
	at org.apache.hadoop.mapreduce.v2.app.MRApp.<init>(MRApp.java:235)
	at org.apache.hadoop.mapreduce.v2.app.MRApp.<init>(MRApp.java:212)
	at org.apache.hadoop.mapreduce.v2.app.MRApp.<init>(MRApp.java:193)
	at org.apache.hadoop.mapreduce.v2.app.MRApp.<init>(MRApp.java:154)
	at org.apache.hadoop.mapreduce.v2.app.job.impl.TestMapReduceChildJVM$MyMRApp.<init>(TestMapReduceChildJVM.java:256)
	at org.apache.hadoop.mapreduce.v2.app.job.impl.TestMapReduceChildJVM.testEnvironmentVariables(TestMapReduceChildJVM.java:281)


FAILED:  org.apache.hadoop.mapreduce.v2.app.job.impl.TestMapReduceChildJVM.testReduceCommandLineWithSeparateCRLAShuffle

Error Message:
Metrics source MRAppMetrics already exists!

Stack Trace:
org.apache.hadoop.metrics2.MetricsException: Metrics source MRAppMetrics already exists!
	at org.apache.hadoop.metrics2.lib.DefaultMetricsSystem.newSourceName(DefaultMetricsSystem.java:143)
	at org.apache.hadoop.metrics2.lib.DefaultMetricsSystem.sourceName(DefaultMetricsSystem.java:120)
	at org.apache.hadoop.metrics2.impl.MetricsSystemImpl.register(MetricsSystemImpl.java:229)
	at org.apache.hadoop.metrics2.MetricsSystem.register(MetricsSystem.java:71)
	at org.apache.hadoop.mapreduce.v2.app.metrics.MRAppMetrics.create(MRAppMetrics.java:59)
	at org.apache.hadoop.mapreduce.v2.app.metrics.MRAppMetrics.create(MRAppMetrics.java:54)
	at org.apache.hadoop.mapreduce.v2.app.MRAppMaster.<init>(MRAppMaster.java:263)
	at org.apache.hadoop.mapreduce.v2.app.MRApp.<init>(MRApp.java:235)
	at org.apache.hadoop.mapreduce.v2.app.MRApp.<init>(MRApp.java:212)
	at org.apache.hadoop.mapreduce.v2.app.MRApp.<init>(MRApp.java:193)
	at org.apache.hadoop.mapreduce.v2.app.MRApp.<init>(MRApp.java:154)
	at org.apache.hadoop.mapreduce.v2.app.job.impl.TestMapReduceChildJVM$MyMRApp.<init>(TestMapReduceChildJVM.java:256)
	at org.apache.hadoop.mapreduce.v2.app.job.impl.TestMapReduceChildJVM.testReduceCommandLine(TestMapReduceChildJVM.java:108)
	at org.apache.hadoop.mapreduce.v2.app.job.impl.TestMapReduceChildJVM.testReduceCommandLineWithSeparateCRLAShuffle(TestMapReduceChildJVM.java:96)


FAILED:  org.apache.hadoop.mapreduce.v2.app.job.impl.TestTaskAttemptContainerRequest.testAttemptContainerRequest

Error Message:
org/apache/hadoop/fs/Path

Stack Trace:
java.lang.NoClassDefFoundError: org/apache/hadoop/fs/Path
	at java.net.URLClassLoader$1.run(URLClassLoader.java:366)
	at java.net.URLClassLoader$1.run(URLClassLoader.java:355)
	at java.security.AccessController.doPrivileged(Native Method)
	at java.net.URLClassLoader.findClass(URLClassLoader.java:354)
	at java.lang.ClassLoader.loadClass(ClassLoader.java:425)
	at sun.misc.Launcher$AppClassLoader.loadClass(Launcher.java:308)
	at java.lang.ClassLoader.loadClass(ClassLoader.java:358)
	at org.apache.hadoop.mapreduce.v2.app.job.impl.TestTaskAttemptContainerRequest.testAttemptContainerRequest(TestTaskAttemptContainerRequest.java:82)


FAILED:  org.apache.hadoop.mapreduce.v2.app.webapp.TestAMWebServicesAttempt.testGetTaskAttemptIdXMLState

Error Message:
expected:<application/xml> but was:<text/html; charset=ISO-8859-1>

Stack Trace:
java.lang.AssertionError: expected:<application/xml> but was:<text/html; charset=ISO-8859-1>
	at org.junit.Assert.fail(Assert.java:88)
	at org.junit.Assert.failNotEquals(Assert.java:743)
	at org.junit.Assert.assertEquals(Assert.java:118)
	at org.junit.Assert.assertEquals(Assert.java:144)
	at org.apache.hadoop.mapreduce.v2.app.webapp.TestAMWebServicesAttempt.testGetTaskAttemptIdXMLState(TestAMWebServicesAttempt.java:185)


FAILED:  org.apache.hadoop.mapreduce.v2.app.webapp.TestAMWebServicesAttempt.testPutTaskAttemptIdState

Error Message:
expected:<application/json> but was:<text/html; charset=ISO-8859-1>

Stack Trace:
java.lang.AssertionError: expected:<application/json> but was:<text/html; charset=ISO-8859-1>
	at org.junit.Assert.fail(Assert.java:88)
	at org.junit.Assert.failNotEquals(Assert.java:743)
	at org.junit.Assert.assertEquals(Assert.java:118)
	at org.junit.Assert.assertEquals(Assert.java:144)
	at org.apache.hadoop.mapreduce.v2.app.webapp.TestAMWebServicesAttempt.testPutTaskAttemptIdState(TestAMWebServicesAttempt.java:224)


FAILED:  org.apache.hadoop.mapreduce.v2.app.webapp.TestAMWebServicesAttempt.testGetTaskAttemptIdState

Error Message:
expected:<application/json> but was:<text/html; charset=ISO-8859-1>

Stack Trace:
java.lang.AssertionError: expected:<application/json> but was:<text/html; charset=ISO-8859-1>
	at org.junit.Assert.fail(Assert.java:88)
	at org.junit.Assert.failNotEquals(Assert.java:743)
	at org.junit.Assert.assertEquals(Assert.java:118)
	at org.junit.Assert.assertEquals(Assert.java:144)
	at org.apache.hadoop.mapreduce.v2.app.webapp.TestAMWebServicesAttempt.testGetTaskAttemptIdState(TestAMWebServicesAttempt.java:157)


FAILED:  org.apache.hadoop.mapreduce.v2.app.webapp.TestAMWebServicesAttempt.testPutTaskAttemptIdXMLState

Error Message:
expected:<application/xml> but was:<text/html; charset=ISO-8859-1>

Stack Trace:
java.lang.AssertionError: expected:<application/xml> but was:<text/html; charset=ISO-8859-1>
	at org.junit.Assert.fail(Assert.java:88)
	at org.junit.Assert.failNotEquals(Assert.java:743)
	at org.junit.Assert.assertEquals(Assert.java:118)
	at org.junit.Assert.assertEquals(Assert.java:144)
	at org.apache.hadoop.mapreduce.v2.app.webapp.TestAMWebServicesAttempt.testPutTaskAttemptIdXMLState(TestAMWebServicesAttempt.java:257)


FAILED:  org.apache.hadoop.mapreduce.v2.app.webapp.TestAMWebServicesJobConf.testJobConf

Error Message:
org/apache/hadoop/yarn/api/records/YarnApplicationState

Stack Trace:
java.lang.NoClassDefFoundError: org/apache/hadoop/yarn/api/records/YarnApplicationState
	at java.net.URLClassLoader$1.run(URLClassLoader.java:366)
	at java.net.URLClassLoader$1.run(URLClassLoader.java:355)
	at java.security.AccessController.doPrivileged(Native Method)
	at java.net.URLClassLoader.findClass(URLClassLoader.java:354)
	at java.lang.ClassLoader.loadClass(ClassLoader.java:425)
	at sun.misc.Launcher$AppClassLoader.loadClass(Launcher.java:308)
	at java.lang.ClassLoader.loadClass(ClassLoader.java:358)
	at org.apache.hadoop.yarn.MockApps.<clinit>(MockApps.java:37)
	at org.apache.hadoop.mapreduce.v2.app.MockAppContext.<init>(MockAppContext.java:38)
	at org.apache.hadoop.mapreduce.v2.app.webapp.TestAMWebServicesJobConf$1.configureServlets(TestAMWebServicesJobConf.java:117)
	at com.google.inject.servlet.ServletModule.configure(ServletModule.java:53)
	at com.google.inject.AbstractModule.configure(AbstractModule.java:59)
	at com.google.inject.spi.Elements$RecordingBinder.install(Elements.java:223)
	at com.google.inject.spi.Elements.getElements(Elements.java:101)
	at com.google.inject.internal.InjectorShell$Builder.build(InjectorShell.java:133)
	at com.google.inject.internal.InternalInjectorCreator.build(InternalInjectorCreator.java:103)
	at com.google.inject.Guice.createInjector(Guice.java:95)
	at com.google.inject.Guice.createInjector(Guice.java:72)
	at com.google.inject.Guice.createInjector(Guice.java:62)
	at org.apache.hadoop.mapreduce.v2.app.webapp.TestAMWebServicesJobConf.<init>(TestAMWebServicesJobConf.java:90)


FAILED:  org.apache.hadoop.mapreduce.v2.app.webapp.TestAMWebServicesJobConf.testJobConfXML

Error Message:
java.net.BindException: Address already in use

Stack Trace:
com.sun.jersey.test.framework.spi.container.TestContainerException: java.net.BindException: Address already in use
	at sun.nio.ch.Net.bind0(Native Method)
	at sun.nio.ch.Net.bind(Net.java:444)
	at sun.nio.ch.Net.bind(Net.java:436)
	at sun.nio.ch.ServerSocketChannelImpl.bind(ServerSocketChannelImpl.java:214)
	at sun.nio.ch.ServerSocketAdaptor.bind(ServerSocketAdaptor.java:74)
	at org.glassfish.grizzly.nio.transport.TCPNIOTransport.bind(TCPNIOTransport.java:413)
	at org.glassfish.grizzly.nio.transport.TCPNIOTransport.bind(TCPNIOTransport.java:384)
	at org.glassfish.grizzly.nio.transport.TCPNIOTransport.bind(TCPNIOTransport.java:375)
	at org.glassfish.grizzly.http.server.NetworkListener.start(NetworkListener.java:549)
	at org.glassfish.grizzly.http.server.HttpServer.start(HttpServer.java:255)
	at com.sun.jersey.api.container.grizzly2.GrizzlyServerFactory.createHttpServer(GrizzlyServerFactory.java:326)
	at com.sun.jersey.api.container.grizzly2.GrizzlyServerFactory.createHttpServer(GrizzlyServerFactory.java:343)
	at com.sun.jersey.test.framework.spi.container.grizzly2.web.GrizzlyWebTestContainerFactory$GrizzlyWebTestContainer.instantiateGrizzlyWebServer(GrizzlyWebTestContainerFactory.java:219)
	at com.sun.jersey.test.framework.spi.container.grizzly2.web.GrizzlyWebTestContainerFactory$GrizzlyWebTestContainer.<init>(GrizzlyWebTestContainerFactory.java:129)
	at com.sun.jersey.test.framework.spi.container.grizzly2.web.GrizzlyWebTestContainerFactory$GrizzlyWebTestContainer.<init>(GrizzlyWebTestContainerFactory.java:86)
	at com.sun.jersey.test.framework.spi.container.grizzly2.web.GrizzlyWebTestContainerFactory.create(GrizzlyWebTestContainerFactory.java:79)
	at com.sun.jersey.test.framework.JerseyTest.getContainer(JerseyTest.java:342)
	at com.sun.jersey.test.framework.JerseyTest.<init>(JerseyTest.java:217)
	at org.apache.hadoop.mapreduce.v2.app.webapp.TestAMWebServicesJobConf.<init>(TestAMWebServicesJobConf.java:151)


FAILED:  org.apache.hadoop.mapreduce.v2.app.webapp.TestAMWebServicesJobConf.testJobConfSlash

Error Message:
java.net.BindException: Address already in use

Stack Trace:
com.sun.jersey.test.framework.spi.container.TestContainerException: java.net.BindException: Address already in use
	at sun.nio.ch.Net.bind0(Native Method)
	at sun.nio.ch.Net.bind(Net.java:444)
	at sun.nio.ch.Net.bind(Net.java:436)
	at sun.nio.ch.ServerSocketChannelImpl.bind(ServerSocketChannelImpl.java:214)
	at sun.nio.ch.ServerSocketAdaptor.bind(ServerSocketAdaptor.java:74)
	at org.glassfish.grizzly.nio.transport.TCPNIOTransport.bind(TCPNIOTransport.java:413)
	at org.glassfish.grizzly.nio.transport.TCPNIOTransport.bind(TCPNIOTransport.java:384)
	at org.glassfish.grizzly.nio.transport.TCPNIOTransport.bind(TCPNIOTransport.java:375)
	at org.glassfish.grizzly.http.server.NetworkListener.start(NetworkListener.java:549)
	at org.glassfish.grizzly.http.server.HttpServer.start(HttpServer.java:255)
	at com.sun.jersey.api.container.grizzly2.GrizzlyServerFactory.createHttpServer(GrizzlyServerFactory.java:326)
	at com.sun.jersey.api.container.grizzly2.GrizzlyServerFactory.createHttpServer(GrizzlyServerFactory.java:343)
	at com.sun.jersey.test.framework.spi.container.grizzly2.web.GrizzlyWebTestContainerFactory$GrizzlyWebTestContainer.instantiateGrizzlyWebServer(GrizzlyWebTestContainerFactory.java:219)
	at com.sun.jersey.test.framework.spi.container.grizzly2.web.GrizzlyWebTestContainerFactory$GrizzlyWebTestContainer.<init>(GrizzlyWebTestContainerFactory.java:129)
	at com.sun.jersey.test.framework.spi.container.grizzly2.web.GrizzlyWebTestContainerFactory$GrizzlyWebTestContainer.<init>(GrizzlyWebTestContainerFactory.java:86)
	at com.sun.jersey.test.framework.spi.container.grizzly2.web.GrizzlyWebTestContainerFactory.create(GrizzlyWebTestContainerFactory.java:79)
	at com.sun.jersey.test.framework.JerseyTest.getContainer(JerseyTest.java:342)
	at com.sun.jersey.test.framework.JerseyTest.<init>(JerseyTest.java:217)
	at org.apache.hadoop.mapreduce.v2.app.webapp.TestAMWebServicesJobConf.<init>(TestAMWebServicesJobConf.java:151)


FAILED:  org.apache.hadoop.mapreduce.v2.app.webapp.TestAMWebServicesJobConf.testJobConfDefault

Error Message:
java.net.BindException: Address already in use

Stack Trace:
com.sun.jersey.test.framework.spi.container.TestContainerException: java.net.BindException: Address already in use
	at sun.nio.ch.Net.bind0(Native Method)
	at sun.nio.ch.Net.bind(Net.java:444)
	at sun.nio.ch.Net.bind(Net.java:436)
	at sun.nio.ch.ServerSocketChannelImpl.bind(ServerSocketChannelImpl.java:214)
	at sun.nio.ch.ServerSocketAdaptor.bind(ServerSocketAdaptor.java:74)
	at org.glassfish.grizzly.nio.transport.TCPNIOTransport.bind(TCPNIOTransport.java:413)
	at org.glassfish.grizzly.nio.transport.TCPNIOTransport.bind(TCPNIOTransport.java:384)
	at org.glassfish.grizzly.nio.transport.TCPNIOTransport.bind(TCPNIOTransport.java:375)
	at org.glassfish.grizzly.http.server.NetworkListener.start(NetworkListener.java:549)
	at org.glassfish.grizzly.http.server.HttpServer.start(HttpServer.java:255)
	at com.sun.jersey.api.container.grizzly2.GrizzlyServerFactory.createHttpServer(GrizzlyServerFactory.java:326)
	at com.sun.jersey.api.container.grizzly2.GrizzlyServerFactory.createHttpServer(GrizzlyServerFactory.java:343)
	at com.sun.jersey.test.framework.spi.container.grizzly2.web.GrizzlyWebTestContainerFactory$GrizzlyWebTestContainer.instantiateGrizzlyWebServer(GrizzlyWebTestContainerFactory.java:219)
	at com.sun.jersey.test.framework.spi.container.grizzly2.web.GrizzlyWebTestContainerFactory$GrizzlyWebTestContainer.<init>(GrizzlyWebTestContainerFactory.java:129)
	at com.sun.jersey.test.framework.spi.container.grizzly2.web.GrizzlyWebTestContainerFactory$GrizzlyWebTestContainer.<init>(GrizzlyWebTestContainerFactory.java:86)
	at com.sun.jersey.test.framework.spi.container.grizzly2.web.GrizzlyWebTestContainerFactory.create(GrizzlyWebTestContainerFactory.java:79)
	at com.sun.jersey.test.framework.JerseyTest.getContainer(JerseyTest.java:342)
	at com.sun.jersey.test.framework.JerseyTest.<init>(JerseyTest.java:217)
	at org.apache.hadoop.mapreduce.v2.app.webapp.TestAMWebServicesJobConf.<init>(TestAMWebServicesJobConf.java:151)




Hadoop-Mapreduce-trunk - Build # 3305 - Still Failing

Posted by Apache Jenkins Server <je...@builds.apache.org>.
See https://builds.apache.org/job/Hadoop-Mapreduce-trunk/3305/

###################################################################################
########################## LAST 60 LINES OF THE CONSOLE ###########################
[...truncated 32648 lines...]
[INFO] --- maven-antrun-plugin:1.7:run (create-testdirs) @ hadoop-mapreduce ---
[INFO] Executing tasks

main:
[INFO] Executed tasks
[INFO] 
[INFO] --- maven-antrun-plugin:1.7:run (tar) @ hadoop-mapreduce ---
[INFO] Executing tasks

main:
[INFO] Executed tasks
[INFO] 
[INFO] --- maven-site-plugin:3.5:attach-descriptor (attach-descriptor) @ hadoop-mapreduce ---
[INFO] 
[INFO] --- maven-enforcer-plugin:1.3.1:enforce (depcheck) @ hadoop-mapreduce ---
[INFO] 
[INFO] --- maven-install-plugin:2.5.1:install (default-install) @ hadoop-mapreduce ---
[INFO] Installing /home/jenkins/jenkins-slave/workspace/Hadoop-Mapreduce-trunk/hadoop-mapreduce-project/pom.xml to /home/jenkins/.m2/repository/org/apache/hadoop/hadoop-mapreduce/3.0.0-SNAPSHOT/hadoop-mapreduce-3.0.0-SNAPSHOT.pom
[INFO] ------------------------------------------------------------------------
[INFO] Reactor Summary:
[INFO] 
[INFO] Apache Hadoop MapReduce Client .................... SUCCESS [  4.052 s]
[INFO] Apache Hadoop MapReduce Core ...................... SUCCESS [02:26 min]
[INFO] Apache Hadoop MapReduce Common .................... SUCCESS [ 37.730 s]
[INFO] Apache Hadoop MapReduce Shuffle ................... SUCCESS [  7.094 s]
[INFO] Apache Hadoop MapReduce App ....................... SUCCESS [10:08 min]
[INFO] Apache Hadoop MapReduce HistoryServer ............. SUCCESS [06:39 min]
[INFO] Apache Hadoop MapReduce JobClient ................. FAILURE [  02:08 h]
[INFO] Apache Hadoop MapReduce HistoryServer Plugins ..... SUCCESS [  1.799 s]
[INFO] Apache Hadoop MapReduce NativeTask ................ SUCCESS [10:52 min]
[INFO] Apache Hadoop MapReduce Examples .................. SKIPPED
[INFO] Apache Hadoop MapReduce ........................... SUCCESS [  0.334 s]
[INFO] ------------------------------------------------------------------------
[INFO] BUILD FAILURE
[INFO] ------------------------------------------------------------------------
[INFO] Total time: 02:39 h
[INFO] Finished at: 2016-05-11T17:35:18+00:00
[INFO] Final Memory: 36M/703M
[INFO] ------------------------------------------------------------------------
[WARNING] The requested profile "parallel-tests" could not be activated because it does not exist.
[ERROR] Failed to execute goal org.apache.maven.plugins:maven-surefire-plugin:2.17:test (default-test) on project hadoop-mapreduce-client-jobclient: There are test failures.
[ERROR] 
[ERROR] Please refer to /home/jenkins/jenkins-slave/workspace/Hadoop-Mapreduce-trunk/hadoop-mapreduce-project/hadoop-mapreduce-client/hadoop-mapreduce-client-jobclient/target/surefire-reports for the individual test results.
[ERROR] -> [Help 1]
[ERROR] 
[ERROR] To see the full stack trace of the errors, re-run Maven with the -e switch.
[ERROR] Re-run Maven using the -X switch to enable full debug logging.
[ERROR] 
[ERROR] For more information about the errors and possible solutions, please read the following articles:
[ERROR] [Help 1] http://cwiki.apache.org/confluence/display/MAVEN/MojoFailureException
[ERROR] 
[ERROR] After correcting the problems, you can resume the build with the command
[ERROR]   mvn <goals> -rf :hadoop-mapreduce-client-jobclient
Build step 'Execute shell' marked build as failure
[FINDBUGS] Skipping publisher since build result is FAILURE
Archiving artifacts
Recording test results
Email was triggered for: Failure - Any
Sending email for trigger: Failure - Any



###################################################################################
############################## FAILED TESTS (if any) ##############################
2 tests failed.
FAILED:  org.apache.hadoop.mapred.TestMiniMRChildTask.testTaskEnv

Error Message:
The environment checker job failed.

Stack Trace:
java.lang.AssertionError: The environment checker job failed.
	at org.junit.Assert.fail(Assert.java:88)
	at org.junit.Assert.assertTrue(Assert.java:41)
	at org.apache.hadoop.mapred.TestMiniMRChildTask.runTestTaskEnv(TestMiniMRChildTask.java:550)
	at org.apache.hadoop.mapred.TestMiniMRChildTask.testTaskEnv(TestMiniMRChildTask.java:472)


FAILED:  org.apache.hadoop.mapred.TestMiniMRChildTask.testTaskOldEnv

Error Message:
The environment checker job failed.

Stack Trace:
java.lang.AssertionError: The environment checker job failed.
	at org.junit.Assert.fail(Assert.java:88)
	at org.junit.Assert.assertTrue(Assert.java:41)
	at org.apache.hadoop.mapred.TestMiniMRChildTask.runTestTaskEnv(TestMiniMRChildTask.java:550)
	at org.apache.hadoop.mapred.TestMiniMRChildTask.testTaskOldEnv(TestMiniMRChildTask.java:496)




Hadoop-Mapreduce-trunk - Build # 3304 - Still Failing

Posted by Apache Jenkins Server <je...@builds.apache.org>.
See https://builds.apache.org/job/Hadoop-Mapreduce-trunk/3304/

###################################################################################
########################## LAST 60 LINES OF THE CONSOLE ###########################
[...truncated 32132 lines...]
[INFO] --- maven-antrun-plugin:1.7:run (create-testdirs) @ hadoop-mapreduce ---
[INFO] Executing tasks

main:
[INFO] Executed tasks
[INFO] 
[INFO] --- maven-antrun-plugin:1.7:run (tar) @ hadoop-mapreduce ---
[INFO] Executing tasks

main:
[INFO] Executed tasks
[INFO] 
[INFO] --- maven-site-plugin:3.5:attach-descriptor (attach-descriptor) @ hadoop-mapreduce ---
[INFO] 
[INFO] --- maven-enforcer-plugin:1.3.1:enforce (depcheck) @ hadoop-mapreduce ---
[INFO] 
[INFO] --- maven-install-plugin:2.5.1:install (default-install) @ hadoop-mapreduce ---
[INFO] Installing /home/jenkins/jenkins-slave/workspace/Hadoop-Mapreduce-trunk/hadoop-mapreduce-project/pom.xml to /home/jenkins/.m2/repository/org/apache/hadoop/hadoop-mapreduce/3.0.0-SNAPSHOT/hadoop-mapreduce-3.0.0-SNAPSHOT.pom
[INFO] ------------------------------------------------------------------------
[INFO] Reactor Summary:
[INFO] 
[INFO] Apache Hadoop MapReduce Client .................... SUCCESS [  3.708 s]
[INFO] Apache Hadoop MapReduce Core ...................... SUCCESS [02:22 min]
[INFO] Apache Hadoop MapReduce Common .................... SUCCESS [ 36.415 s]
[INFO] Apache Hadoop MapReduce Shuffle ................... SUCCESS [  7.405 s]
[INFO] Apache Hadoop MapReduce App ....................... FAILURE [10:00 min]
[INFO] Apache Hadoop MapReduce HistoryServer ............. SKIPPED
[INFO] Apache Hadoop MapReduce JobClient ................. SKIPPED
[INFO] Apache Hadoop MapReduce HistoryServer Plugins ..... SUCCESS [  1.813 s]
[INFO] Apache Hadoop MapReduce NativeTask ................ SUCCESS [10:59 min]
[INFO] Apache Hadoop MapReduce Examples .................. SKIPPED
[INFO] Apache Hadoop MapReduce ........................... SUCCESS [  0.313 s]
[INFO] ------------------------------------------------------------------------
[INFO] BUILD FAILURE
[INFO] ------------------------------------------------------------------------
[INFO] Total time: 24:14 min
[INFO] Finished at: 2016-05-11T08:50:29+00:00
[INFO] Final Memory: 37M/828M
[INFO] ------------------------------------------------------------------------
[WARNING] The requested profile "parallel-tests" could not be activated because it does not exist.
[ERROR] Failed to execute goal org.apache.maven.plugins:maven-surefire-plugin:2.17:test (default-test) on project hadoop-mapreduce-client-app: There are test failures.
[ERROR] 
[ERROR] Please refer to /home/jenkins/jenkins-slave/workspace/Hadoop-Mapreduce-trunk/hadoop-mapreduce-project/hadoop-mapreduce-client/hadoop-mapreduce-client-app/target/surefire-reports for the individual test results.
[ERROR] -> [Help 1]
[ERROR] 
[ERROR] To see the full stack trace of the errors, re-run Maven with the -e switch.
[ERROR] Re-run Maven using the -X switch to enable full debug logging.
[ERROR] 
[ERROR] For more information about the errors and possible solutions, please read the following articles:
[ERROR] [Help 1] http://cwiki.apache.org/confluence/display/MAVEN/MojoFailureException
[ERROR] 
[ERROR] After correcting the problems, you can resume the build with the command
[ERROR]   mvn <goals> -rf :hadoop-mapreduce-client-app
Build step 'Execute shell' marked build as failure
[FINDBUGS] Skipping publisher since build result is FAILURE
Archiving artifacts
Recording test results
Email was triggered for: Failure - Any
Sending email for trigger: Failure - Any



###################################################################################
############################## FAILED TESTS (if any) ##############################
1 tests failed.
FAILED:  org.apache.hadoop.mapreduce.v2.app.job.impl.TestTaskAttempt.testMRAppHistoryForTAFailedInAssigned

Error Message:
No Ta Started JH Event

Stack Trace:
java.lang.AssertionError: No Ta Started JH Event
	at org.junit.Assert.fail(Assert.java:88)
	at org.junit.Assert.assertTrue(Assert.java:41)
	at org.apache.hadoop.mapreduce.v2.app.job.impl.TestTaskAttempt.testTaskAttemptAssignedKilledHistory(TestTaskAttempt.java:403)
	at org.apache.hadoop.mapreduce.v2.app.job.impl.TestTaskAttempt.testMRAppHistoryForTAFailedInAssigned(TestTaskAttempt.java:190)