You are viewing a plain text version of this content. The canonical link for it is here.
Posted to dev@lucene.apache.org by Policeman Jenkins Server <je...@thetaphi.de> on 2015/04/14 05:34:13 UTC
[JENKINS] Lucene-Solr-5.x-Windows (64bit/jdk1.8.0_40) - Build #
4556 - Failure!
Build: http://jenkins.thetaphi.de/job/Lucene-Solr-5.x-Windows/4556/
Java: 64bit/jdk1.8.0_40 -XX:+UseCompressedOops -XX:+UseParallelGC
1 tests failed.
FAILED: org.apache.lucene.store.TestRateLimiter.testPause
Error Message:
we should sleep less than 2 seconds but did: 2244 millis
Stack Trace:
java.lang.AssertionError: we should sleep less than 2 seconds but did: 2244 millis
at __randomizedtesting.SeedInfo.seed([885A6AB8E952A36D:EEFA2E86627FFA6B]:0)
at org.junit.Assert.fail(Assert.java:93)
at org.junit.Assert.assertTrue(Assert.java:43)
at org.apache.lucene.store.TestRateLimiter.testPause(TestRateLimiter.java:41)
at sun.reflect.NativeMethodAccessorImpl.invoke0(Native Method)
at sun.reflect.NativeMethodAccessorImpl.invoke(NativeMethodAccessorImpl.java:62)
at sun.reflect.DelegatingMethodAccessorImpl.invoke(DelegatingMethodAccessorImpl.java:43)
at java.lang.reflect.Method.invoke(Method.java:497)
at com.carrotsearch.randomizedtesting.RandomizedRunner.invoke(RandomizedRunner.java:1627)
at com.carrotsearch.randomizedtesting.RandomizedRunner$6.evaluate(RandomizedRunner.java:836)
at com.carrotsearch.randomizedtesting.RandomizedRunner$7.evaluate(RandomizedRunner.java:872)
at com.carrotsearch.randomizedtesting.RandomizedRunner$8.evaluate(RandomizedRunner.java:886)
at org.apache.lucene.util.TestRuleSetupTeardownChained$1.evaluate(TestRuleSetupTeardownChained.java:50)
at org.apache.lucene.util.AbstractBeforeAfterRule$1.evaluate(AbstractBeforeAfterRule.java:46)
at org.apache.lucene.util.TestRuleThreadAndTestName$1.evaluate(TestRuleThreadAndTestName.java:49)
at org.apache.lucene.util.TestRuleIgnoreAfterMaxFailures$1.evaluate(TestRuleIgnoreAfterMaxFailures.java:65)
at org.apache.lucene.util.TestRuleMarkFailure$1.evaluate(TestRuleMarkFailure.java:48)
at com.carrotsearch.randomizedtesting.rules.StatementAdapter.evaluate(StatementAdapter.java:36)
at com.carrotsearch.randomizedtesting.ThreadLeakControl$StatementRunner.run(ThreadLeakControl.java:365)
at com.carrotsearch.randomizedtesting.ThreadLeakControl.forkTimeoutingTask(ThreadLeakControl.java:798)
at com.carrotsearch.randomizedtesting.ThreadLeakControl$3.evaluate(ThreadLeakControl.java:458)
at com.carrotsearch.randomizedtesting.RandomizedRunner.runSingleTest(RandomizedRunner.java:845)
at com.carrotsearch.randomizedtesting.RandomizedRunner$3.evaluate(RandomizedRunner.java:747)
at com.carrotsearch.randomizedtesting.RandomizedRunner$4.evaluate(RandomizedRunner.java:781)
at com.carrotsearch.randomizedtesting.RandomizedRunner$5.evaluate(RandomizedRunner.java:792)
at org.apache.lucene.util.AbstractBeforeAfterRule$1.evaluate(AbstractBeforeAfterRule.java:46)
at com.carrotsearch.randomizedtesting.rules.StatementAdapter.evaluate(StatementAdapter.java:36)
at org.apache.lucene.util.TestRuleStoreClassName$1.evaluate(TestRuleStoreClassName.java:42)
at com.carrotsearch.randomizedtesting.rules.NoShadowingOrOverridesOnMethodsRule$1.evaluate(NoShadowingOrOverridesOnMethodsRule.java:39)
at com.carrotsearch.randomizedtesting.rules.NoShadowingOrOverridesOnMethodsRule$1.evaluate(NoShadowingOrOverridesOnMethodsRule.java:39)
at com.carrotsearch.randomizedtesting.rules.StatementAdapter.evaluate(StatementAdapter.java:36)
at com.carrotsearch.randomizedtesting.rules.StatementAdapter.evaluate(StatementAdapter.java:36)
at com.carrotsearch.randomizedtesting.rules.StatementAdapter.evaluate(StatementAdapter.java:36)
at org.apache.lucene.util.TestRuleAssertionsRequired$1.evaluate(TestRuleAssertionsRequired.java:54)
at org.apache.lucene.util.TestRuleMarkFailure$1.evaluate(TestRuleMarkFailure.java:48)
at org.apache.lucene.util.TestRuleIgnoreAfterMaxFailures$1.evaluate(TestRuleIgnoreAfterMaxFailures.java:65)
at org.apache.lucene.util.TestRuleIgnoreTestSuites$1.evaluate(TestRuleIgnoreTestSuites.java:55)
at com.carrotsearch.randomizedtesting.rules.StatementAdapter.evaluate(StatementAdapter.java:36)
at com.carrotsearch.randomizedtesting.ThreadLeakControl$StatementRunner.run(ThreadLeakControl.java:365)
at java.lang.Thread.run(Thread.java:745)
Build Log:
[...truncated 876 lines...]
[junit4] Suite: org.apache.lucene.store.TestRateLimiter
[junit4] 2> NOTE: reproduce with: ant test -Dtestcase=TestRateLimiter -Dtests.method=testPause -Dtests.seed=885A6AB8E952A36D -Dtests.slow=true -Dtests.locale=sl_SI -Dtests.timezone=Africa/Conakry -Dtests.asserts=true -Dtests.file.encoding=UTF-8
[junit4] FAILURE 2.22s J0 | TestRateLimiter.testPause <<<
[junit4] > Throwable #1: java.lang.AssertionError: we should sleep less than 2 seconds but did: 2244 millis
[junit4] > at __randomizedtesting.SeedInfo.seed([885A6AB8E952A36D:EEFA2E86627FFA6B]:0)
[junit4] > at org.apache.lucene.store.TestRateLimiter.testPause(TestRateLimiter.java:41)
[junit4] > at java.lang.Thread.run(Thread.java:745)
[junit4] 2> NOTE: test params are: codec=Lucene50, sim=RandomSimilarityProvider(queryNorm=true,coord=no): {}, locale=sl_SI, timezone=Africa/Conakry
[junit4] 2> NOTE: Windows 7 6.1 amd64/Oracle Corporation 1.8.0_40 (64-bit)/cpus=3,threads=1,free=199512168,total=213385216
[junit4] 2> NOTE: All tests run in this JVM: [TestBooleanQueryVisitSubscorers, TestParallelTermEnum, TestPersistentSnapshotDeletionPolicy, TestBasics, TestTransactionRollback, TestForceMergeForever, TestMockCharFilter, TestRamUsageEstimator, TestStressNRT, Nested1, TestIndexWriterDeleteByQuery, TestIndexWriterConfig, TestCharsRefBuilder, TestExceedMaxTermLength, TestStressIndexing2, TestTimSorterWorstCase, TestSpanFirstQuery, NestedSetupChain, NestedTeardownChain, TestRegexpRandom2, TestDocIdSet, TestDirectoryReader, TestFixedBitSet, TestNamedSPILoader, Test2BPostingsBytes, TestDocValuesRewriteMethod, TestMultiThreadTermVectors, TestIndexWriterMaxDocs, TestBlockPostingsFormat3, TestQueryWrapperFilter, TestStressAdvance, TestUsageTrackingFilterCachingPolicy, TestSpanNearQuery, TestLazyProxSkipping, TestSpanExplanations, TestLucene50NormsFormat, TestCachingWrapperFilter, TestIOUtils, TestDocumentsWriterStallControl, TestBinaryDocument, TestRateLimiter]
[junit4] Completed [135/428] on J0 in 3.22s, 3 tests, 1 failure <<< FAILURES!
[...truncated 977 lines...]
BUILD FAILED
C:\Users\JenkinsSlave\workspace\Lucene-Solr-5.x-Windows\build.xml:536: The following error occurred while executing this line:
C:\Users\JenkinsSlave\workspace\Lucene-Solr-5.x-Windows\build.xml:484: The following error occurred while executing this line:
C:\Users\JenkinsSlave\workspace\Lucene-Solr-5.x-Windows\build.xml:61: The following error occurred while executing this line:
C:\Users\JenkinsSlave\workspace\Lucene-Solr-5.x-Windows\extra-targets.xml:39: The following error occurred while executing this line:
C:\Users\JenkinsSlave\workspace\Lucene-Solr-5.x-Windows\lucene\build.xml:50: The following error occurred while executing this line:
C:\Users\JenkinsSlave\workspace\Lucene-Solr-5.x-Windows\lucene\common-build.xml:1434: The following error occurred while executing this line:
C:\Users\JenkinsSlave\workspace\Lucene-Solr-5.x-Windows\lucene\common-build.xml:991: There were test failures: 428 suites, 3550 tests, 1 failure, 74 ignored (64 assumptions)
Total time: 6 minutes 10 seconds
Build step 'Invoke Ant' marked build as failure
[description-setter] Description set: Java: 64bit/jdk1.8.0_40 -XX:+UseCompressedOops -XX:+UseParallelGC
Archiving artifacts
Recording test results
Email was triggered for: Failure - Any
Sending email for trigger: Failure - Any