You are viewing a plain text version of this content. The canonical link for it is here.
Posted to issues@ambari.apache.org by "Kane (Jira)" <ji...@apache.org> on 2023/11/02 06:49:00 UTC
[jira] [Commented] (AMBARI-26024) Could not resolve dependencies
[ https://issues.apache.org/jira/browse/AMBARI-26024?page=com.atlassian.jira.plugin.system.issuetabpanels:comment-tabpanel&focusedCommentId=17782015#comment-17782015 ]
Kane commented on AMBARI-26024:
-------------------------------
Fixed. FromĀ [Ambari Metrics Storm Sink (Legacy) Build Failure|https://github.com/apache/ambari/pull/3686/files] Edit pom.xml
> Could not resolve dependencies
> ------------------------------
>
> Key: AMBARI-26024
> URL: https://issues.apache.org/jira/browse/AMBARI-26024
> Project: Ambari
> Issue Type: Bug
> Affects Versions: 2.7.7
> Reporter: Kane
> Priority: Major
>
> {code:bash}
> [DEBUG] Resolving artifact org.apache.storm:storm-core:jar:0.10.0.2.3.0.0-2557 from [apache-hadoop (https://repo.hortonworks.com/content/groups/public/, default, releases+snapshots), apache-snapshots (https://repository.apache.org/content/repositories/snapshots, default, releases+snapshots), central (https://repo.maven.apache.org/maven2, default, releases)]
> [DEBUG] Resolving artifact org.apache.storm:storm-core:jar:0.10.0.2.3.0.0-2557 from [apache-hadoop (https://repo.hortonworks.com/content/groups/public/, default, releases+snapshots), apache-snapshots (https://repository.apache.org/content/repositories/snapshots, default, releases+snapshots), central (https://repo.maven.apache.org/maven2, default, releases)]
> [INFO] ------------------------------------------------------------------------
> [INFO] Reactor Summary:
> [INFO]
> [INFO] Ambari Main 2.7.7.0.0 .............................. SUCCESS [ 1.183 s]
> [INFO] Apache Ambari Project POM 2.7.7.0.0 ................ SUCCESS [ 0.046 s]
> [INFO] Ambari Web 2.7.7.0.0 ............................... SUCCESS [ 39.050 s]
> [INFO] Ambari Views 2.7.7.0.0 ............................. SUCCESS [ 1.105 s]
> [INFO] Ambari Admin View 2.7.7.0.0 ........................ SUCCESS [ 50.289 s]
> [INFO] ambari-utility 1.0.0.0-SNAPSHOT .................... SUCCESS [ 1.700 s]
> [INFO] ambari-metrics 2.7.7.0.0 ........................... SUCCESS [ 0.156 s]
> [INFO] Ambari Metrics Common 2.7.7.0.0 .................... SUCCESS [ 3.861 s]
> [INFO] Ambari Metrics Hadoop Sink 2.7.7.0.0 ............... SUCCESS [ 1.069 s]
> [INFO] Ambari Metrics Flume Sink 2.7.7.0.0 ................ SUCCESS [ 0.608 s]
> [INFO] Ambari Metrics Kafka Sink 2.7.7.0.0 ................ SUCCESS [ 0.882 s]
> [INFO] Ambari Metrics Storm Sink 2.7.7.0.0 ................ SUCCESS [ 1.245 s]
> [INFO] Ambari Metrics Storm Sink (Legacy) 2.7.7.0.0 ....... FAILURE [ 0.018 s]
> [INFO] Ambari Metrics Collector 2.7.7.0.0 ................. SKIPPED
> [INFO] Ambari Metrics Monitor 2.7.7.0.0 ................... SKIPPED
> [INFO] Ambari Metrics Grafana 2.7.7.0.0 ................... SKIPPED
> [INFO] Ambari Metrics Host Aggregator 2.7.7.0.0 ........... SKIPPED
> [INFO] Ambari Metrics Assembly 2.7.7.0.0 .................. SKIPPED
> [INFO] Ambari Service Advisor 1.0.0.0-SNAPSHOT ............ SKIPPED
> [INFO] Ambari Server 2.7.7.0.0 ............................ SKIPPED
> [INFO] Ambari Functional Tests 2.7.7.0.0 .................. SKIPPED
> [INFO] Ambari Agent 2.7.7.0.0 ............................. SKIPPED
> [INFO] ambari-logsearch 2.7.7.0.0 ......................... SKIPPED
> [INFO] Ambari Logsearch Appender 2.7.7.0.0 ................ SKIPPED
> [INFO] Ambari Logsearch Config Api 2.7.7.0.0 .............. SKIPPED
> [INFO] Ambari Logsearch Config JSON 2.7.7.0.0 ............. SKIPPED
> [INFO] Ambari Logsearch Config Solr 2.7.7.0.0 ............. SKIPPED
> [INFO] Ambari Logsearch Config Zookeeper 2.7.7.0.0 ........ SKIPPED
> [INFO] Ambari Logsearch Config Local 2.7.7.0.0 ............ SKIPPED
> [INFO] Ambari Logsearch Log Feeder Plugin Api 2.7.7.0.0 ... SKIPPED
> [INFO] Ambari Logsearch Log Feeder Container Registry 2.7.7.0.0 SKIPPED
> [INFO] Ambari Logsearch Log Feeder 2.7.7.0.0 .............. SKIPPED
> [INFO] Ambari Logsearch Web 2.7.7.0.0 ..................... SKIPPED
> [INFO] Ambari Logsearch Server 2.7.7.0.0 .................. SKIPPED
> [INFO] Ambari Logsearch Assembly 2.7.7.0.0 ................ SKIPPED
> [INFO] Ambari Logsearch Integration Test 2.7.7.0.0 ........ SKIPPED
> [INFO] ambari-infra 2.7.7.0.0 ............................. SKIPPED
> [INFO] Ambari Infra Solr Client 2.7.7.0.0 ................. SKIPPED
> [INFO] Ambari Infra Solr Plugin 2.7.7.0.0 ................. SKIPPED
> [INFO] Ambari Infra Manager 2.7.7.0.0 ..................... SKIPPED
> [INFO] Ambari Infra Assembly 2.7.7.0.0 .................... SKIPPED
> [INFO] Ambari Infra Manager Integration Tests 2.7.7.0.0 ... SKIPPED
> [INFO] ------------------------------------------------------------------------
> [INFO] BUILD FAILURE
> [INFO] ------------------------------------------------------------------------
> [INFO] Total time: 01:41 min
> [INFO] Finished at: 2023-11-02T05:33:05Z
> [INFO] ------------------------------------------------------------------------
> [ERROR] Failed to execute goal on project ambari-metrics-storm-sink-legacy: Could not resolve dependencies for project org.apache.ambari:ambari-metrics-storm-sink-legacy:jar:2.7.7.0.0: The following artifacts could not be resolved: org.apache.storm:storm-core:jar:0.10.0.2.3.0.0-2557 (absent): org.apache.storm:storm-core:jar:0.10.0.2.3.0.0-2557 was not found in https://repo.hortonworks.com/content/groups/public/ during a previous attempt. This failure was cached in the local repository and resolution is not reattempted until the update interval of apache-hadoop has elapsed or updates are forced -> [Help 1]
> org.apache.maven.lifecycle.LifecycleExecutionException: Failed to execute goal on project ambari-metrics-storm-sink-legacy: Could not resolve dependencies for project org.apache.ambari:ambari-metrics-storm-sink-legacy:jar:2.7.7.0.0: The following artifacts could not be resolved: org.apache.storm:storm-core:jar:0.10.0.2.3.0.0-2557 (absent): org.apache.storm:storm-core:jar:0.10.0.2.3.0.0-2557 was not found in https://repo.hortonworks.com/content/groups/public/ during a previous attempt. This failure was cached in the local repository and resolution is not reattempted until the update interval of apache-hadoop has elapsed or updates are forced
> at org.apache.maven.lifecycle.internal.LifecycleDependencyResolver.getDependencies (LifecycleDependencyResolver.java:243)
> at org.apache.maven.lifecycle.internal.LifecycleDependencyResolver.resolveProjectDependencies (LifecycleDependencyResolver.java:136)
> at org.apache.maven.lifecycle.internal.MojoExecutor.ensureDependenciesAreResolved (MojoExecutor.java:355)
> at org.apache.maven.lifecycle.internal.MojoExecutor.doExecute (MojoExecutor.java:313)
> at org.apache.maven.lifecycle.internal.MojoExecutor.execute (MojoExecutor.java:212)
> at org.apache.maven.lifecycle.internal.MojoExecutor.execute (MojoExecutor.java:174)
> at org.apache.maven.lifecycle.internal.MojoExecutor.access$000 (MojoExecutor.java:75)
> at org.apache.maven.lifecycle.internal.MojoExecutor$1.run (MojoExecutor.java:162)
> at org.apache.maven.plugin.DefaultMojosExecutionStrategy.execute (DefaultMojosExecutionStrategy.java:39)
> at org.apache.maven.lifecycle.internal.MojoExecutor.execute (MojoExecutor.java:159)
> at org.apache.maven.lifecycle.internal.LifecycleModuleBuilder.buildProject (LifecycleModuleBuilder.java:105)
> at org.apache.maven.lifecycle.internal.LifecycleModuleBuilder.buildProject (LifecycleModuleBuilder.java:73)
> at org.apache.maven.lifecycle.internal.builder.singlethreaded.SingleThreadedBuilder.build (SingleThreadedBuilder.java:53)
> at org.apache.maven.lifecycle.internal.LifecycleStarter.execute (LifecycleStarter.java:118)
> at org.apache.maven.DefaultMaven.doExecute (DefaultMaven.java:261)
> at org.apache.maven.DefaultMaven.doExecute (DefaultMaven.java:173)
> at org.apache.maven.DefaultMaven.execute (DefaultMaven.java:101)
> at org.apache.maven.cli.MavenCli.execute (MavenCli.java:906)
> at org.apache.maven.cli.MavenCli.doMain (MavenCli.java:283)
> at org.apache.maven.cli.MavenCli.main (MavenCli.java:206)
> at sun.reflect.NativeMethodAccessorImpl.invoke0 (Native Method)
> at sun.reflect.NativeMethodAccessorImpl.invoke (NativeMethodAccessorImpl.java:62)
> at sun.reflect.DelegatingMethodAccessorImpl.invoke (DelegatingMethodAccessorImpl.java:43)
> at java.lang.reflect.Method.invoke (Method.java:498)
> at org.codehaus.plexus.classworlds.launcher.Launcher.launchEnhanced (Launcher.java:283)
> at org.codehaus.plexus.classworlds.launcher.Launcher.launch (Launcher.java:226)
> at org.codehaus.plexus.classworlds.launcher.Launcher.mainWithExitCode (Launcher.java:407)
> at org.codehaus.plexus.classworlds.launcher.Launcher.main (Launcher.java:348)
> Caused by: org.apache.maven.project.DependencyResolutionException: Could not resolve dependencies for project org.apache.ambari:ambari-metrics-storm-sink-legacy:jar:2.7.7.0.0: The following artifacts could not be resolved: org.apache.storm:storm-core:jar:0.10.0.2.3.0.0-2557 (absent): org.apache.storm:storm-core:jar:0.10.0.2.3.0.0-2557 was not found in https://repo.hortonworks.com/content/groups/public/ during a previous attempt. This failure was cached in the local repository and resolution is not reattempted until the update interval of apache-hadoop has elapsed or updates are forced
> at org.apache.maven.project.DefaultProjectDependenciesResolver.resolve (DefaultProjectDependenciesResolver.java:187)
> at org.apache.maven.lifecycle.internal.LifecycleDependencyResolver.getDependencies (LifecycleDependencyResolver.java:224)
> at org.apache.maven.lifecycle.internal.LifecycleDependencyResolver.resolveProjectDependencies (LifecycleDependencyResolver.java:136)
> at org.apache.maven.lifecycle.internal.MojoExecutor.ensureDependenciesAreResolved (MojoExecutor.java:355)
> at org.apache.maven.lifecycle.internal.MojoExecutor.doExecute (MojoExecutor.java:313)
> at org.apache.maven.lifecycle.internal.MojoExecutor.execute (MojoExecutor.java:212)
> at org.apache.maven.lifecycle.internal.MojoExecutor.execute (MojoExecutor.java:174)
> at org.apache.maven.lifecycle.internal.MojoExecutor.access$000 (MojoExecutor.java:75)
> at org.apache.maven.lifecycle.internal.MojoExecutor$1.run (MojoExecutor.java:162)
> at org.apache.maven.plugin.DefaultMojosExecutionStrategy.execute (DefaultMojosExecutionStrategy.java:39)
> at org.apache.maven.lifecycle.internal.MojoExecutor.execute (MojoExecutor.java:159)
> at org.apache.maven.lifecycle.internal.LifecycleModuleBuilder.buildProject (LifecycleModuleBuilder.java:105)
> at org.apache.maven.lifecycle.internal.LifecycleModuleBuilder.buildProject (LifecycleModuleBuilder.java:73)
> at org.apache.maven.lifecycle.internal.builder.singlethreaded.SingleThreadedBuilder.build (SingleThreadedBuilder.java:53)
> at org.apache.maven.lifecycle.internal.LifecycleStarter.execute (LifecycleStarter.java:118)
> at org.apache.maven.DefaultMaven.doExecute (DefaultMaven.java:261)
> at org.apache.maven.DefaultMaven.doExecute (DefaultMaven.java:173)
> at org.apache.maven.DefaultMaven.execute (DefaultMaven.java:101)
> at org.apache.maven.cli.MavenCli.execute (MavenCli.java:906)
> at org.apache.maven.cli.MavenCli.doMain (MavenCli.java:283)
> at org.apache.maven.cli.MavenCli.main (MavenCli.java:206)
> at sun.reflect.NativeMethodAccessorImpl.invoke0 (Native Method)
> at sun.reflect.NativeMethodAccessorImpl.invoke (NativeMethodAccessorImpl.java:62)
> at sun.reflect.DelegatingMethodAccessorImpl.invoke (DelegatingMethodAccessorImpl.java:43)
> at java.lang.reflect.Method.invoke (Method.java:498)
> at org.codehaus.plexus.classworlds.launcher.Launcher.launchEnhanced (Launcher.java:283)
> at org.codehaus.plexus.classworlds.launcher.Launcher.launch (Launcher.java:226)
> at org.codehaus.plexus.classworlds.launcher.Launcher.mainWithExitCode (Launcher.java:407)
> at org.codehaus.plexus.classworlds.launcher.Launcher.main (Launcher.java:348)
> Caused by: org.eclipse.aether.resolution.DependencyResolutionException: The following artifacts could not be resolved: org.apache.storm:storm-core:jar:0.10.0.2.3.0.0-2557 (absent): org.apache.storm:storm-core:jar:0.10.0.2.3.0.0-2557 was not found in https://repo.hortonworks.com/content/groups/public/ during a previous attempt. This failure was cached in the local repository and resolution is not reattempted until the update interval of apache-hadoop has elapsed or updates are forced
> at org.eclipse.aether.internal.impl.DefaultRepositorySystem.resolveDependencies (DefaultRepositorySystem.java:365)
> at org.apache.maven.project.DefaultProjectDependenciesResolver.resolve (DefaultProjectDependenciesResolver.java:182)
> at org.apache.maven.lifecycle.internal.LifecycleDependencyResolver.getDependencies (LifecycleDependencyResolver.java:224)
> at org.apache.maven.lifecycle.internal.LifecycleDependencyResolver.resolveProjectDependencies (LifecycleDependencyResolver.java:136)
> at org.apache.maven.lifecycle.internal.MojoExecutor.ensureDependenciesAreResolved (MojoExecutor.java:355)
> at org.apache.maven.lifecycle.internal.MojoExecutor.doExecute (MojoExecutor.java:313)
> at org.apache.maven.lifecycle.internal.MojoExecutor.execute (MojoExecutor.java:212)
> at org.apache.maven.lifecycle.internal.MojoExecutor.execute (MojoExecutor.java:174)
> at org.apache.maven.lifecycle.internal.MojoExecutor.access$000 (MojoExecutor.java:75)
> at org.apache.maven.lifecycle.internal.MojoExecutor$1.run (MojoExecutor.java:162)
> at org.apache.maven.plugin.DefaultMojosExecutionStrategy.execute (DefaultMojosExecutionStrategy.java:39)
> at org.apache.maven.lifecycle.internal.MojoExecutor.execute (MojoExecutor.java:159)
> at org.apache.maven.lifecycle.internal.LifecycleModuleBuilder.buildProject (LifecycleModuleBuilder.java:105)
> at org.apache.maven.lifecycle.internal.LifecycleModuleBuilder.buildProject (LifecycleModuleBuilder.java:73)
> at org.apache.maven.lifecycle.internal.builder.singlethreaded.SingleThreadedBuilder.build (SingleThreadedBuilder.java:53)
> at org.apache.maven.lifecycle.internal.LifecycleStarter.execute (LifecycleStarter.java:118)
> at org.apache.maven.DefaultMaven.doExecute (DefaultMaven.java:261)
> at org.apache.maven.DefaultMaven.doExecute (DefaultMaven.java:173)
> at org.apache.maven.DefaultMaven.execute (DefaultMaven.java:101)
> at org.apache.maven.cli.MavenCli.execute (MavenCli.java:906)
> at org.apache.maven.cli.MavenCli.doMain (MavenCli.java:283)
> at org.apache.maven.cli.MavenCli.main (MavenCli.java:206)
> at sun.reflect.NativeMethodAccessorImpl.invoke0 (Native Method)
> at sun.reflect.NativeMethodAccessorImpl.invoke (NativeMethodAccessorImpl.java:62)
> at sun.reflect.DelegatingMethodAccessorImpl.invoke (DelegatingMethodAccessorImpl.java:43)
> at java.lang.reflect.Method.invoke (Method.java:498)
> at org.codehaus.plexus.classworlds.launcher.Launcher.launchEnhanced (Launcher.java:283)
> at org.codehaus.plexus.classworlds.launcher.Launcher.launch (Launcher.java:226)
> at org.codehaus.plexus.classworlds.launcher.Launcher.mainWithExitCode (Launcher.java:407)
> at org.codehaus.plexus.classworlds.launcher.Launcher.main (Launcher.java:348)
> Caused by: org.eclipse.aether.resolution.ArtifactResolutionException: The following artifacts could not be resolved: org.apache.storm:storm-core:jar:0.10.0.2.3.0.0-2557 (absent): org.apache.storm:storm-core:jar:0.10.0.2.3.0.0-2557 was not found in https://repo.hortonworks.com/content/groups/public/ during a previous attempt. This failure was cached in the local repository and resolution is not reattempted until the update interval of apache-hadoop has elapsed or updates are forced
> at org.eclipse.aether.internal.impl.DefaultArtifactResolver.resolve (DefaultArtifactResolver.java:473)
> at org.eclipse.aether.internal.impl.DefaultArtifactResolver.resolveArtifacts (DefaultArtifactResolver.java:261)
> at org.eclipse.aether.internal.impl.DefaultRepositorySystem.resolveDependencies (DefaultRepositorySystem.java:353)
> at org.apache.maven.project.DefaultProjectDependenciesResolver.resolve (DefaultProjectDependenciesResolver.java:182)
> at org.apache.maven.lifecycle.internal.LifecycleDependencyResolver.getDependencies (LifecycleDependencyResolver.java:224)
> at org.apache.maven.lifecycle.internal.LifecycleDependencyResolver.resolveProjectDependencies (LifecycleDependencyResolver.java:136)
> at org.apache.maven.lifecycle.internal.MojoExecutor.ensureDependenciesAreResolved (MojoExecutor.java:355)
> at org.apache.maven.lifecycle.internal.MojoExecutor.doExecute (MojoExecutor.java:313)
> at org.apache.maven.lifecycle.internal.MojoExecutor.execute (MojoExecutor.java:212)
> at org.apache.maven.lifecycle.internal.MojoExecutor.execute (MojoExecutor.java:174)
> at org.apache.maven.lifecycle.internal.MojoExecutor.access$000 (MojoExecutor.java:75)
> at org.apache.maven.lifecycle.internal.MojoExecutor$1.run (MojoExecutor.java:162)
> at org.apache.maven.plugin.DefaultMojosExecutionStrategy.execute (DefaultMojosExecutionStrategy.java:39)
> at org.apache.maven.lifecycle.internal.MojoExecutor.execute (MojoExecutor.java:159)
> at org.apache.maven.lifecycle.internal.LifecycleModuleBuilder.buildProject (LifecycleModuleBuilder.java:105)
> at org.apache.maven.lifecycle.internal.LifecycleModuleBuilder.buildProject (LifecycleModuleBuilder.java:73)
> at org.apache.maven.lifecycle.internal.builder.singlethreaded.SingleThreadedBuilder.build (SingleThreadedBuilder.java:53)
> at org.apache.maven.lifecycle.internal.LifecycleStarter.execute (LifecycleStarter.java:118)
> at org.apache.maven.DefaultMaven.doExecute (DefaultMaven.java:261)
> at org.apache.maven.DefaultMaven.doExecute (DefaultMaven.java:173)
> at org.apache.maven.DefaultMaven.execute (DefaultMaven.java:101)
> at org.apache.maven.cli.MavenCli.execute (MavenCli.java:906)
> at org.apache.maven.cli.MavenCli.doMain (MavenCli.java:283)
> at org.apache.maven.cli.MavenCli.main (MavenCli.java:206)
> at sun.reflect.NativeMethodAccessorImpl.invoke0 (Native Method)
> at sun.reflect.NativeMethodAccessorImpl.invoke (NativeMethodAccessorImpl.java:62)
> at sun.reflect.DelegatingMethodAccessorImpl.invoke (DelegatingMethodAccessorImpl.java:43)
> at java.lang.reflect.Method.invoke (Method.java:498)
> at org.codehaus.plexus.classworlds.launcher.Launcher.launchEnhanced (Launcher.java:283)
> at org.codehaus.plexus.classworlds.launcher.Launcher.launch (Launcher.java:226)
> at org.codehaus.plexus.classworlds.launcher.Launcher.mainWithExitCode (Launcher.java:407)
> at org.codehaus.plexus.classworlds.launcher.Launcher.main (Launcher.java:348)
> Caused by: org.eclipse.aether.transfer.ArtifactNotFoundException: org.apache.storm:storm-core:jar:0.10.0.2.3.0.0-2557 was not found in https://repo.hortonworks.com/content/groups/public/ during a previous attempt. This failure was cached in the local repository and resolution is not reattempted until the update interval of apache-hadoop has elapsed or updates are forced
> at org.eclipse.aether.internal.impl.DefaultUpdateCheckManager.newException (DefaultUpdateCheckManager.java:225)
> at org.eclipse.aether.internal.impl.DefaultUpdateCheckManager.checkArtifact (DefaultUpdateCheckManager.java:201)
> at org.eclipse.aether.internal.impl.DefaultArtifactResolver.gatherDownloads (DefaultArtifactResolver.java:586)
> at org.eclipse.aether.internal.impl.DefaultArtifactResolver.performDownloads (DefaultArtifactResolver.java:525)
> at org.eclipse.aether.internal.impl.DefaultArtifactResolver.resolve (DefaultArtifactResolver.java:449)
> at org.eclipse.aether.internal.impl.DefaultArtifactResolver.resolveArtifacts (DefaultArtifactResolver.java:261)
> at org.eclipse.aether.internal.impl.DefaultRepositorySystem.resolveDependencies (DefaultRepositorySystem.java:353)
> at org.apache.maven.project.DefaultProjectDependenciesResolver.resolve (DefaultProjectDependenciesResolver.java:182)
> at org.apache.maven.lifecycle.internal.LifecycleDependencyResolver.getDependencies (LifecycleDependencyResolver.java:224)
> at org.apache.maven.lifecycle.internal.LifecycleDependencyResolver.resolveProjectDependencies (LifecycleDependencyResolver.java:136)
> at org.apache.maven.lifecycle.internal.MojoExecutor.ensureDependenciesAreResolved (MojoExecutor.java:355)
> at org.apache.maven.lifecycle.internal.MojoExecutor.doExecute (MojoExecutor.java:313)
> at org.apache.maven.lifecycle.internal.MojoExecutor.execute (MojoExecutor.java:212)
> at org.apache.maven.lifecycle.internal.MojoExecutor.execute (MojoExecutor.java:174)
> at org.apache.maven.lifecycle.internal.MojoExecutor.access$000 (MojoExecutor.java:75)
> at org.apache.maven.lifecycle.internal.MojoExecutor$1.run (MojoExecutor.java:162)
> at org.apache.maven.plugin.DefaultMojosExecutionStrategy.execute (DefaultMojosExecutionStrategy.java:39)
> at org.apache.maven.lifecycle.internal.MojoExecutor.execute (MojoExecutor.java:159)
> at org.apache.maven.lifecycle.internal.LifecycleModuleBuilder.buildProject (LifecycleModuleBuilder.java:105)
> at org.apache.maven.lifecycle.internal.LifecycleModuleBuilder.buildProject (LifecycleModuleBuilder.java:73)
> at org.apache.maven.lifecycle.internal.builder.singlethreaded.SingleThreadedBuilder.build (SingleThreadedBuilder.java:53)
> at org.apache.maven.lifecycle.internal.LifecycleStarter.execute (LifecycleStarter.java:118)
> at org.apache.maven.DefaultMaven.doExecute (DefaultMaven.java:261)
> at org.apache.maven.DefaultMaven.doExecute (DefaultMaven.java:173)
> at org.apache.maven.DefaultMaven.execute (DefaultMaven.java:101)
> at org.apache.maven.cli.MavenCli.execute (MavenCli.java:906)
> at org.apache.maven.cli.MavenCli.doMain (MavenCli.java:283)
> at org.apache.maven.cli.MavenCli.main (MavenCli.java:206)
> at sun.reflect.NativeMethodAccessorImpl.invoke0 (Native Method)
> at sun.reflect.NativeMethodAccessorImpl.invoke (NativeMethodAccessorImpl.java:62)
> at sun.reflect.DelegatingMethodAccessorImpl.invoke (DelegatingMethodAccessorImpl.java:43)
> at java.lang.reflect.Method.invoke (Method.java:498)
> at org.codehaus.plexus.classworlds.launcher.Launcher.launchEnhanced (Launcher.java:283)
> at org.codehaus.plexus.classworlds.launcher.Launcher.launch (Launcher.java:226)
> at org.codehaus.plexus.classworlds.launcher.Launcher.mainWithExitCode (Launcher.java:407)
> at org.codehaus.plexus.classworlds.launcher.Launcher.main (Launcher.java:348)
> [ERROR]
> [ERROR]
> [ERROR] For more information about the errors and possible solutions, please read the following articles:
> [ERROR] [Help 1] http://cwiki.apache.org/confluence/display/MAVEN/DependencyResolutionException
> [ERROR]
> [ERROR] After correcting the problems, you can resume the build with the command
> [ERROR] mvn <args> -rf :ambari-metrics-storm-sink-legacy
> [DEBUG] Shutting down adapter factory; available factories [file-lock, rwlock-local, semaphore-local, noop]; available name mappers [discriminating, file-gav, file-hgav, file-static, gav, static]
> [DEBUG] Shutting down 'file-lock' factory
> [DEBUG] Shutting down 'rwlock-local' factory
> [DEBUG] Shutting down 'semaphore-local' factory
> [DEBUG] Shutting down 'noop' factory
> {code}
--
This message was sent by Atlassian Jira
(v8.20.10#820010)
---------------------------------------------------------------------
To unsubscribe, e-mail: issues-unsubscribe@ambari.apache.org
For additional commands, e-mail: issues-help@ambari.apache.org