You are viewing a plain text version of this content. The canonical link for it is here.
Posted to commits@mina.apache.org by Apache Jenkins Server <je...@builds.apache.org> on 2011/08/26 14:37:09 UTC

Build failed in Jenkins: MINA-2.0.X-jdk1.5-ubuntu #2

See <https://builds.apache.org/job/MINA-2.0.X-jdk1.5-ubuntu/2/>

------------------------------------------
Started by user jvermillard
Building remotely on ubuntu3
Updating https://svn.apache.org/repos/asf/mina/branches/2.0.5
At revision 1162089
no change for https://svn.apache.org/repos/asf/mina/branches/2.0.5 since the previous build
ERROR: Processing failed due to a bug in the code. Please report this to jenkinsci-users@googlegroups.com
java.lang.IllegalArgumentException: /home/hudson/tools/maven/latest3 without lib directory
	at hudson.maven.MavenEmbedderUtils.buildClassRealm(MavenEmbedderUtils.java:82)
	at hudson.maven.MavenEmbedderUtils.getMavenVersion(MavenEmbedderUtils.java:186)
	at hudson.maven.MavenVersionCallable.call(MavenVersionCallable.java:65)
	at hudson.maven.MavenVersionCallable.call(MavenVersionCallable.java:41)
	at hudson.remoting.UserRequest.perform(UserRequest.java:118)
	at hudson.remoting.UserRequest.perform(UserRequest.java:48)
	at hudson.remoting.Request$2.run(Request.java:287)
	at java.util.concurrent.Executors$RunnableAdapter.call(Executors.java:441)
	at java.util.concurrent.FutureTask$Sync.innerRun(FutureTask.java:303)
	at java.util.concurrent.FutureTask.run(FutureTask.java:138)
	at java.util.concurrent.ThreadPoolExecutor$Worker.runTask(ThreadPoolExecutor.java:886)
	at java.util.concurrent.ThreadPoolExecutor$Worker.run(ThreadPoolExecutor.java:908)
	at java.lang.Thread.run(Thread.java:662)
project=hudson.maven.MavenModuleSet@391db695[MINA-2.0.X-jdk1.5-ubuntu]
project.getModules()=[hudson.maven.MavenModule@874d6ef[MINA-2.0.X-jdk1.5-ubuntu/org.apache.mina:mina-core][MINA-2.0.X-jdk1.5-ubuntu/org.apache.mina:mina-core][relativePath:mina-core], hudson.maven.MavenModule@3ffab64d[MINA-2.0.X-jdk1.5-ubuntu/org.apache.mina:mina-example][MINA-2.0.X-jdk1.5-ubuntu/org.apache.mina:mina-example][relativePath:mina-example], hudson.maven.MavenModule@bf379b8[MINA-2.0.X-jdk1.5-ubuntu/org.apache.mina:mina-filter-compression][MINA-2.0.X-jdk1.5-ubuntu/org.apache.mina:mina-filter-compression][relativePath:mina-filter-compression], hudson.maven.MavenModule@7922182b[MINA-2.0.X-jdk1.5-ubuntu/org.apache.mina:mina-integration-beans][MINA-2.0.X-jdk1.5-ubuntu/org.apache.mina:mina-integration-beans][relativePath:mina-integration-beans], hudson.maven.MavenModule@2ef43998[MINA-2.0.X-jdk1.5-ubuntu/org.apache.mina:mina-integration-jmx][MINA-2.0.X-jdk1.5-ubuntu/org.apache.mina:mina-integration-jmx][relativePath:mina-integration-jmx], hudson.maven.MavenModule@4060a763[MINA-2.0.X-jdk1.5-ubuntu/org.apache.mina:mina-integration-ognl][MINA-2.0.X-jdk1.5-ubuntu/org.apache.mina:mina-integration-ognl][relativePath:mina-integration-ognl], hudson.maven.MavenModule@9fc7171[MINA-2.0.X-jdk1.5-ubuntu/org.apache.mina:mina-integration-xbean][MINA-2.0.X-jdk1.5-ubuntu/org.apache.mina:mina-integration-xbean][relativePath:mina-integration-xbean], hudson.maven.MavenModule@5e7e7421[MINA-2.0.X-jdk1.5-ubuntu/org.apache.mina:mina-legal][MINA-2.0.X-jdk1.5-ubuntu/org.apache.mina:mina-legal][relativePath:mina-legal], hudson.maven.MavenModule@70783049[MINA-2.0.X-jdk1.5-ubuntu/org.apache.mina:mina-parent][MINA-2.0.X-jdk1.5-ubuntu/org.apache.mina:mina-parent][relativePath:], hudson.maven.MavenModule@44502aff[MINA-2.0.X-jdk1.5-ubuntu/org.apache.mina:mina-statemachine][MINA-2.0.X-jdk1.5-ubuntu/org.apache.mina:mina-statemachine][relativePath:mina-statemachine], hudson.maven.MavenModule@37432b93[MINA-2.0.X-jdk1.5-ubuntu/org.apache.mina:mina-transport-apr][MINA-2.0.X-jdk1.5-ubuntu/org.apache.mina:mina-transport-apr][relativePath:mina-transport-apr], hudson.maven.MavenModule@31ca4366[MINA-2.0.X-jdk1.5-ubuntu/org.apache.mina:mina-transport-serial][MINA-2.0.X-jdk1.5-ubuntu/org.apache.mina:mina-transport-serial][relativePath:mina-transport-serial]]
project.getRootModule()=hudson.maven.MavenModule@70783049[MINA-2.0.X-jdk1.5-ubuntu/org.apache.mina:mina-parent][MINA-2.0.X-jdk1.5-ubuntu/org.apache.mina:mina-parent][relativePath:]
FATAL: /home/hudson/tools/maven/latest3 without lib directory
java.lang.IllegalArgumentException: /home/hudson/tools/maven/latest3 without lib directory
	at hudson.maven.MavenEmbedderUtils.buildClassRealm(MavenEmbedderUtils.java:82)
	at hudson.maven.MavenEmbedderUtils.getMavenVersion(MavenEmbedderUtils.java:186)
	at hudson.maven.MavenVersionCallable.call(MavenVersionCallable.java:65)
	at hudson.maven.MavenVersionCallable.call(MavenVersionCallable.java:41)
	at hudson.remoting.UserRequest.perform(UserRequest.java:118)
	at hudson.remoting.UserRequest.perform(UserRequest.java:48)
	at hudson.remoting.Request$2.run(Request.java:287)
	at java.util.concurrent.Executors$RunnableAdapter.call(Executors.java:441)
	at java.util.concurrent.FutureTask$Sync.innerRun(FutureTask.java:303)
	at java.util.concurrent.FutureTask.run(FutureTask.java:138)
	at java.util.concurrent.ThreadPoolExecutor$Worker.runTask(ThreadPoolExecutor.java:886)
	at java.util.concurrent.ThreadPoolExecutor$Worker.run(ThreadPoolExecutor.java:908)
	at java.lang.Thread.run(Thread.java:662)


Jenkins build is back to normal : MINA-2.0.X-jdk1.5-ubuntu #6

Posted by Apache Jenkins Server <je...@builds.apache.org>.
See <https://builds.apache.org/job/MINA-2.0.X-jdk1.5-ubuntu/6/>



Build failed in Jenkins: MINA-2.0.X-jdk1.5-ubuntu #5

Posted by Apache Jenkins Server <je...@builds.apache.org>.
See <https://builds.apache.org/job/MINA-2.0.X-jdk1.5-ubuntu/5/>

------------------------------------------
Started by user ngn
Building remotely on ubuntu3
hudson.util.IOException2: Failed to install http://archive.apache.org/dist/maven/binaries/apache-maven-3.0.3-bin.zip to /home/hudson/tools/maven/latest3
	at hudson.FilePath.installIfNecessaryFrom(FilePath.java:647)
	at hudson.tools.DownloadFromUrlInstaller.performInstallation(DownloadFromUrlInstaller.java:72)
	at hudson.tools.InstallerTranslator.getToolHome(InstallerTranslator.java:61)
	at hudson.tools.ToolLocationNodeProperty.getToolHome(ToolLocationNodeProperty.java:107)
	at hudson.tools.ToolInstallation.translateFor(ToolInstallation.java:150)
	at hudson.tasks.Maven$MavenInstallation.forNode(Maven.java:510)
	at hudson.maven.MavenModuleSetBuild.getEnvironment(MavenModuleSetBuild.java:175)
	at hudson.scm.SubversionSCM.checkout(SubversionSCM.java:673)
	at hudson.model.AbstractProject.checkout(AbstractProject.java:1193)
	at hudson.model.AbstractBuild$AbstractRunner.checkout(AbstractBuild.java:555)
	at hudson.model.AbstractBuild$AbstractRunner.run(AbstractBuild.java:443)
	at hudson.model.Run.run(Run.java:1376)
	at hudson.maven.MavenModuleSetBuild.run(MavenModuleSetBuild.java:479)
	at hudson.model.ResourceController.execute(ResourceController.java:88)
	at hudson.model.Executor.run(Executor.java:230)
Caused by: hudson.util.IOException2: remote file operation failed: /home/hudson/tools/maven/latest3 at hudson.remoting.Channel@52bdc0e4:ubuntu3
	at hudson.FilePath.act(FilePath.java:754)
	at hudson.FilePath.act(FilePath.java:740)
	at hudson.FilePath.deleteContents(FilePath.java:836)
	at hudson.FilePath.installIfNecessaryFrom(FilePath.java:624)
	... 14 more
Caused by: java.io.IOException: Unable to delete /home/hudson/tools/maven/latest3/.installedFrom
	at hudson.Util.deleteFile(Util.java:266)
	at hudson.Util.deleteRecursive(Util.java:316)
	at hudson.Util.deleteContentsRecursive(Util.java:227)
	at hudson.FilePath$10.invoke(FilePath.java:838)
	at hudson.FilePath$10.invoke(FilePath.java:836)
	at hudson.FilePath$FileCallableWrapper.call(FilePath.java:1994)
	at hudson.remoting.UserRequest.perform(UserRequest.java:118)
	at hudson.remoting.UserRequest.perform(UserRequest.java:48)
	at hudson.remoting.Request$2.run(Request.java:287)
	at java.util.concurrent.Executors$RunnableAdapter.call(Executors.java:441)
	at java.util.concurrent.FutureTask$Sync.innerRun(FutureTask.java:303)
	at java.util.concurrent.FutureTask.run(FutureTask.java:138)
	at java.util.concurrent.ThreadPoolExecutor$Worker.runTask(ThreadPoolExecutor.java:886)
	at java.util.concurrent.ThreadPoolExecutor$Worker.run(ThreadPoolExecutor.java:908)
	at java.lang.Thread.run(Thread.java:662)


Build failed in Jenkins: MINA-2.0.X-jdk1.5-ubuntu #4

Posted by Apache Jenkins Server <je...@builds.apache.org>.
See <https://builds.apache.org/job/MINA-2.0.X-jdk1.5-ubuntu/4/>

------------------------------------------
Started by user jvermillard
Building remotely on ubuntu3
Updating https://svn.apache.org/repos/asf/mina/branches/2.0.5
At revision 1162096
no change for https://svn.apache.org/repos/asf/mina/branches/2.0.5 since the previous build
ERROR: Processing failed due to a bug in the code. Please report this to jenkinsci-users@googlegroups.com
java.lang.NullPointerException
	at hudson.maven.MavenEmbedderUtils.getMavenVersion(MavenEmbedderUtils.java:195)
	at hudson.maven.MavenVersionCallable.call(MavenVersionCallable.java:65)
	at hudson.maven.MavenVersionCallable.call(MavenVersionCallable.java:41)
	at hudson.remoting.UserRequest.perform(UserRequest.java:118)
	at hudson.remoting.UserRequest.perform(UserRequest.java:48)
	at hudson.remoting.Request$2.run(Request.java:287)
	at java.util.concurrent.Executors$RunnableAdapter.call(Executors.java:441)
	at java.util.concurrent.FutureTask$Sync.innerRun(FutureTask.java:303)
	at java.util.concurrent.FutureTask.run(FutureTask.java:138)
	at java.util.concurrent.ThreadPoolExecutor$Worker.runTask(ThreadPoolExecutor.java:886)
	at java.util.concurrent.ThreadPoolExecutor$Worker.run(ThreadPoolExecutor.java:908)
	at java.lang.Thread.run(Thread.java:662)
project=hudson.maven.MavenModuleSet@391db695[MINA-2.0.X-jdk1.5-ubuntu]
project.getModules()=[hudson.maven.MavenModule@874d6ef[MINA-2.0.X-jdk1.5-ubuntu/org.apache.mina:mina-core][MINA-2.0.X-jdk1.5-ubuntu/org.apache.mina:mina-core][relativePath:mina-core], hudson.maven.MavenModule@3ffab64d[MINA-2.0.X-jdk1.5-ubuntu/org.apache.mina:mina-example][MINA-2.0.X-jdk1.5-ubuntu/org.apache.mina:mina-example][relativePath:mina-example], hudson.maven.MavenModule@bf379b8[MINA-2.0.X-jdk1.5-ubuntu/org.apache.mina:mina-filter-compression][MINA-2.0.X-jdk1.5-ubuntu/org.apache.mina:mina-filter-compression][relativePath:mina-filter-compression], hudson.maven.MavenModule@7922182b[MINA-2.0.X-jdk1.5-ubuntu/org.apache.mina:mina-integration-beans][MINA-2.0.X-jdk1.5-ubuntu/org.apache.mina:mina-integration-beans][relativePath:mina-integration-beans], hudson.maven.MavenModule@2ef43998[MINA-2.0.X-jdk1.5-ubuntu/org.apache.mina:mina-integration-jmx][MINA-2.0.X-jdk1.5-ubuntu/org.apache.mina:mina-integration-jmx][relativePath:mina-integration-jmx], hudson.maven.MavenModule@4060a763[MINA-2.0.X-jdk1.5-ubuntu/org.apache.mina:mina-integration-ognl][MINA-2.0.X-jdk1.5-ubuntu/org.apache.mina:mina-integration-ognl][relativePath:mina-integration-ognl], hudson.maven.MavenModule@9fc7171[MINA-2.0.X-jdk1.5-ubuntu/org.apache.mina:mina-integration-xbean][MINA-2.0.X-jdk1.5-ubuntu/org.apache.mina:mina-integration-xbean][relativePath:mina-integration-xbean], hudson.maven.MavenModule@5e7e7421[MINA-2.0.X-jdk1.5-ubuntu/org.apache.mina:mina-legal][MINA-2.0.X-jdk1.5-ubuntu/org.apache.mina:mina-legal][relativePath:mina-legal], hudson.maven.MavenModule@70783049[MINA-2.0.X-jdk1.5-ubuntu/org.apache.mina:mina-parent][MINA-2.0.X-jdk1.5-ubuntu/org.apache.mina:mina-parent][relativePath:], hudson.maven.MavenModule@44502aff[MINA-2.0.X-jdk1.5-ubuntu/org.apache.mina:mina-statemachine][MINA-2.0.X-jdk1.5-ubuntu/org.apache.mina:mina-statemachine][relativePath:mina-statemachine], hudson.maven.MavenModule@37432b93[MINA-2.0.X-jdk1.5-ubuntu/org.apache.mina:mina-transport-apr][MINA-2.0.X-jdk1.5-ubuntu/org.apache.mina:mina-transport-apr][relativePath:mina-transport-apr], hudson.maven.MavenModule@31ca4366[MINA-2.0.X-jdk1.5-ubuntu/org.apache.mina:mina-transport-serial][MINA-2.0.X-jdk1.5-ubuntu/org.apache.mina:mina-transport-serial][relativePath:mina-transport-serial]]
project.getRootModule()=hudson.maven.MavenModule@70783049[MINA-2.0.X-jdk1.5-ubuntu/org.apache.mina:mina-parent][MINA-2.0.X-jdk1.5-ubuntu/org.apache.mina:mina-parent][relativePath:]
FATAL: null
java.lang.NullPointerException
	at hudson.maven.MavenEmbedderUtils.getMavenVersion(MavenEmbedderUtils.java:195)
	at hudson.maven.MavenVersionCallable.call(MavenVersionCallable.java:65)
	at hudson.maven.MavenVersionCallable.call(MavenVersionCallable.java:41)
	at hudson.remoting.UserRequest.perform(UserRequest.java:118)
	at hudson.remoting.UserRequest.perform(UserRequest.java:48)
	at hudson.remoting.Request$2.run(Request.java:287)
	at java.util.concurrent.Executors$RunnableAdapter.call(Executors.java:441)
	at java.util.concurrent.FutureTask$Sync.innerRun(FutureTask.java:303)
	at java.util.concurrent.FutureTask.run(FutureTask.java:138)
	at java.util.concurrent.ThreadPoolExecutor$Worker.runTask(ThreadPoolExecutor.java:886)
	at java.util.concurrent.ThreadPoolExecutor$Worker.run(ThreadPoolExecutor.java:908)
	at java.lang.Thread.run(Thread.java:662)


Build failed in Jenkins: MINA-2.0.X-jdk1.5-ubuntu #3

Posted by Apache Jenkins Server <je...@builds.apache.org>.
See <https://builds.apache.org/job/MINA-2.0.X-jdk1.5-ubuntu/3/>

------------------------------------------
Started by user jvermillard
Building remotely on ubuntu3
Updating https://svn.apache.org/repos/asf/mina/branches/2.0.5
At revision 1162096
no change for https://svn.apache.org/repos/asf/mina/branches/2.0.5 since the previous build
ERROR: Processing failed due to a bug in the code. Please report this to jenkinsci-users@googlegroups.com
java.lang.NullPointerException
	at hudson.maven.MavenEmbedderUtils.getMavenVersion(MavenEmbedderUtils.java:195)
	at hudson.maven.MavenVersionCallable.call(MavenVersionCallable.java:65)
	at hudson.maven.MavenVersionCallable.call(MavenVersionCallable.java:41)
	at hudson.remoting.UserRequest.perform(UserRequest.java:118)
	at hudson.remoting.UserRequest.perform(UserRequest.java:48)
	at hudson.remoting.Request$2.run(Request.java:287)
	at java.util.concurrent.Executors$RunnableAdapter.call(Executors.java:441)
	at java.util.concurrent.FutureTask$Sync.innerRun(FutureTask.java:303)
	at java.util.concurrent.FutureTask.run(FutureTask.java:138)
	at java.util.concurrent.ThreadPoolExecutor$Worker.runTask(ThreadPoolExecutor.java:886)
	at java.util.concurrent.ThreadPoolExecutor$Worker.run(ThreadPoolExecutor.java:908)
	at java.lang.Thread.run(Thread.java:662)
project=hudson.maven.MavenModuleSet@391db695[MINA-2.0.X-jdk1.5-ubuntu]
project.getModules()=[hudson.maven.MavenModule@874d6ef[MINA-2.0.X-jdk1.5-ubuntu/org.apache.mina:mina-core][MINA-2.0.X-jdk1.5-ubuntu/org.apache.mina:mina-core][relativePath:mina-core], hudson.maven.MavenModule@3ffab64d[MINA-2.0.X-jdk1.5-ubuntu/org.apache.mina:mina-example][MINA-2.0.X-jdk1.5-ubuntu/org.apache.mina:mina-example][relativePath:mina-example], hudson.maven.MavenModule@bf379b8[MINA-2.0.X-jdk1.5-ubuntu/org.apache.mina:mina-filter-compression][MINA-2.0.X-jdk1.5-ubuntu/org.apache.mina:mina-filter-compression][relativePath:mina-filter-compression], hudson.maven.MavenModule@7922182b[MINA-2.0.X-jdk1.5-ubuntu/org.apache.mina:mina-integration-beans][MINA-2.0.X-jdk1.5-ubuntu/org.apache.mina:mina-integration-beans][relativePath:mina-integration-beans], hudson.maven.MavenModule@2ef43998[MINA-2.0.X-jdk1.5-ubuntu/org.apache.mina:mina-integration-jmx][MINA-2.0.X-jdk1.5-ubuntu/org.apache.mina:mina-integration-jmx][relativePath:mina-integration-jmx], hudson.maven.MavenModule@4060a763[MINA-2.0.X-jdk1.5-ubuntu/org.apache.mina:mina-integration-ognl][MINA-2.0.X-jdk1.5-ubuntu/org.apache.mina:mina-integration-ognl][relativePath:mina-integration-ognl], hudson.maven.MavenModule@9fc7171[MINA-2.0.X-jdk1.5-ubuntu/org.apache.mina:mina-integration-xbean][MINA-2.0.X-jdk1.5-ubuntu/org.apache.mina:mina-integration-xbean][relativePath:mina-integration-xbean], hudson.maven.MavenModule@5e7e7421[MINA-2.0.X-jdk1.5-ubuntu/org.apache.mina:mina-legal][MINA-2.0.X-jdk1.5-ubuntu/org.apache.mina:mina-legal][relativePath:mina-legal], hudson.maven.MavenModule@70783049[MINA-2.0.X-jdk1.5-ubuntu/org.apache.mina:mina-parent][MINA-2.0.X-jdk1.5-ubuntu/org.apache.mina:mina-parent][relativePath:], hudson.maven.MavenModule@44502aff[MINA-2.0.X-jdk1.5-ubuntu/org.apache.mina:mina-statemachine][MINA-2.0.X-jdk1.5-ubuntu/org.apache.mina:mina-statemachine][relativePath:mina-statemachine], hudson.maven.MavenModule@37432b93[MINA-2.0.X-jdk1.5-ubuntu/org.apache.mina:mina-transport-apr][MINA-2.0.X-jdk1.5-ubuntu/org.apache.mina:mina-transport-apr][relativePath:mina-transport-apr], hudson.maven.MavenModule@31ca4366[MINA-2.0.X-jdk1.5-ubuntu/org.apache.mina:mina-transport-serial][MINA-2.0.X-jdk1.5-ubuntu/org.apache.mina:mina-transport-serial][relativePath:mina-transport-serial]]
project.getRootModule()=hudson.maven.MavenModule@70783049[MINA-2.0.X-jdk1.5-ubuntu/org.apache.mina:mina-parent][MINA-2.0.X-jdk1.5-ubuntu/org.apache.mina:mina-parent][relativePath:]
FATAL: null
java.lang.NullPointerException
	at hudson.maven.MavenEmbedderUtils.getMavenVersion(MavenEmbedderUtils.java:195)
	at hudson.maven.MavenVersionCallable.call(MavenVersionCallable.java:65)
	at hudson.maven.MavenVersionCallable.call(MavenVersionCallable.java:41)
	at hudson.remoting.UserRequest.perform(UserRequest.java:118)
	at hudson.remoting.UserRequest.perform(UserRequest.java:48)
	at hudson.remoting.Request$2.run(Request.java:287)
	at java.util.concurrent.Executors$RunnableAdapter.call(Executors.java:441)
	at java.util.concurrent.FutureTask$Sync.innerRun(FutureTask.java:303)
	at java.util.concurrent.FutureTask.run(FutureTask.java:138)
	at java.util.concurrent.ThreadPoolExecutor$Worker.runTask(ThreadPoolExecutor.java:886)
	at java.util.concurrent.ThreadPoolExecutor$Worker.run(ThreadPoolExecutor.java:908)
	at java.lang.Thread.run(Thread.java:662)