You are viewing a plain text version of this content. The canonical link for it is here.
Posted to builds@cassandra.apache.org by Apache Jenkins Server <je...@builds.apache.org> on 2021/05/04 18:35:30 UTC
Build complete: Cassandra-4.0 #4 [FAILURE]
288bb9d9021d297611eb6ce27143de15a10b119d
-------------------------------------------------------------------------------
Build Cassandra-4.0 #4 Failure
URL: https://ci-cassandra.apache.org/job/Cassandra-4.0/4/
-------------------------------------------------------------------------------
Changes:
[Brandon Williams] Fix cqlsh encoding error with unicode in multi-line statement
-------------------------------------------------------------------------------
Failed Tests:
3 tests failed.
FAILED: cqlshlib.python3.jdk8.no_cython.test.test_unicode.TestCqlshUnicode.test_multiline_input
FAILED: cqlshlib.python3.jdk8.cython.test.test_unicode.TestCqlshUnicode.test_multiline_input
FAILED: org.apache.cassandra.distributed.test.metrics.StreamingMetricsTest.testMetricsWithRepairAndStreamingToTwoNodes
-------------------------------------------------------------------------------
For complete test report and logs see https://nightlies.apache.org/cassandra/Cassandra-4.0/4/