You are viewing a plain text version of this content. The canonical link for it is here.
Posted to builds@beam.apache.org by Apache Jenkins Server <je...@builds.apache.org> on 2021/08/12 00:11:11 UTC
Build failed in Jenkins: beam_PostCommit_Go_VR_Flink #5070
See <https://ci-beam.apache.org/job/beam_PostCommit_Go_VR_Flink/5070/display/redirect?page=changes>
Changes:
[marwant] Move misplaced cloud healthcare update info line from template to
[Robert Burke] [BEAM-12738][GoSDK] Fix Dataflow Job URL
[eugene.nikolayev] Fix docs typos in contrib guide.
[noreply] Merge pull request #15126 from [BEAM-12665] Add option in ReadAll
[noreply] Update ptransform.py error message (#15286)
------------------------------------------
[...truncated 475.91 KB...]
File "/usr/lib/python3.5/urllib/request.py", line 444, in _call_chain
result = func(*args)
File "/usr/lib/python3.5/urllib/request.py", line 590, in http_error_default
raise HTTPError(req.full_url, code, msg, hdrs, fp)
urllib.error.HTTPError: HTTP Error 502: Bad Gateway
ERROR:root:Invalid url for grpc-protobuf-lite-1.37.0: https://opensource.org/licenses/Apache-2.0. Retrying...
Traceback (most recent call last):
File "<https://ci-beam.apache.org/job/beam_PostCommit_Go_VR_Flink/ws/src/sdks/java/container/license_scripts/pull_licenses_java.py",> line 53, in pull_from_url
url_read = urlopen(url)
File "/usr/lib/python3.5/urllib/request.py", line 163, in urlopen
return opener.open(url, data, timeout)
File "/usr/lib/python3.5/urllib/request.py", line 472, in open
response = meth(req, response)
File "/usr/lib/python3.5/urllib/request.py", line 582, in http_response
'http', request, response, code, msg, hdrs)
File "/usr/lib/python3.5/urllib/request.py", line 504, in error
result = self._call_chain(*args)
File "/usr/lib/python3.5/urllib/request.py", line 444, in _call_chain
result = func(*args)
File "/usr/lib/python3.5/urllib/request.py", line 696, in http_error_302
return self.parent.open(new, timeout=req.timeout)
File "/usr/lib/python3.5/urllib/request.py", line 472, in open
response = meth(req, response)
File "/usr/lib/python3.5/urllib/request.py", line 582, in http_response
'http', request, response, code, msg, hdrs)
File "/usr/lib/python3.5/urllib/request.py", line 510, in error
return self._call_chain(*args)
File "/usr/lib/python3.5/urllib/request.py", line 444, in _call_chain
result = func(*args)
File "/usr/lib/python3.5/urllib/request.py", line 590, in http_error_default
raise HTTPError(req.full_url, code, msg, hdrs, fp)
urllib.error.HTTPError: HTTP Error 502: Bad Gateway
ERROR:root:Invalid url for visible-assertions-2.1.2: http://opensource.org/licenses/MIT. Retrying...
Traceback (most recent call last):
File "<https://ci-beam.apache.org/job/beam_PostCommit_Go_VR_Flink/ws/src/sdks/java/container/license_scripts/pull_licenses_java.py",> line 53, in pull_from_url
url_read = urlopen(url)
File "/usr/lib/python3.5/urllib/request.py", line 163, in urlopen
return opener.open(url, data, timeout)
File "/usr/lib/python3.5/urllib/request.py", line 472, in open
response = meth(req, response)
File "/usr/lib/python3.5/urllib/request.py", line 582, in http_response
'http', request, response, code, msg, hdrs)
File "/usr/lib/python3.5/urllib/request.py", line 504, in error
result = self._call_chain(*args)
File "/usr/lib/python3.5/urllib/request.py", line 444, in _call_chain
result = func(*args)
File "/usr/lib/python3.5/urllib/request.py", line 696, in http_error_302
return self.parent.open(new, timeout=req.timeout)
File "/usr/lib/python3.5/urllib/request.py", line 472, in open
response = meth(req, response)
File "/usr/lib/python3.5/urllib/request.py", line 582, in http_response
'http', request, response, code, msg, hdrs)
File "/usr/lib/python3.5/urllib/request.py", line 504, in error
result = self._call_chain(*args)
File "/usr/lib/python3.5/urllib/request.py", line 444, in _call_chain
result = func(*args)
File "/usr/lib/python3.5/urllib/request.py", line 696, in http_error_302
return self.parent.open(new, timeout=req.timeout)
File "/usr/lib/python3.5/urllib/request.py", line 472, in open
response = meth(req, response)
File "/usr/lib/python3.5/urllib/request.py", line 582, in http_response
'http', request, response, code, msg, hdrs)
File "/usr/lib/python3.5/urllib/request.py", line 510, in error
return self._call_chain(*args)
File "/usr/lib/python3.5/urllib/request.py", line 444, in _call_chain
result = func(*args)
File "/usr/lib/python3.5/urllib/request.py", line 590, in http_error_default
raise HTTPError(req.full_url, code, msg, hdrs, fp)
urllib.error.HTTPError: HTTP Error 502: Bad Gateway
ERROR:root:Invalid url for slf4j-simple-1.7.30: http://www.opensource.org/licenses/mit-license.php. Retrying...
Traceback (most recent call last):
File "<https://ci-beam.apache.org/job/beam_PostCommit_Go_VR_Flink/ws/src/sdks/java/container/license_scripts/pull_licenses_java.py",> line 53, in pull_from_url
url_read = urlopen(url)
File "/usr/lib/python3.5/urllib/request.py", line 163, in urlopen
return opener.open(url, data, timeout)
File "/usr/lib/python3.5/urllib/request.py", line 472, in open
response = meth(req, response)
File "/usr/lib/python3.5/urllib/request.py", line 582, in http_response
'http', request, response, code, msg, hdrs)
File "/usr/lib/python3.5/urllib/request.py", line 510, in error
return self._call_chain(*args)
File "/usr/lib/python3.5/urllib/request.py", line 444, in _call_chain
result = func(*args)
File "/usr/lib/python3.5/urllib/request.py", line 590, in http_error_default
raise HTTPError(req.full_url, code, msg, hdrs, fp)
urllib.error.HTTPError: HTTP Error 502: Bad Gateway
ERROR:root:Invalid url for grpc-context-1.37.0: https://opensource.org/licenses/Apache-2.0. Retrying...
Traceback (most recent call last):
File "<https://ci-beam.apache.org/job/beam_PostCommit_Go_VR_Flink/ws/src/sdks/java/container/license_scripts/pull_licenses_java.py",> line 53, in pull_from_url
url_read = urlopen(url)
File "/usr/lib/python3.5/urllib/request.py", line 163, in urlopen
return opener.open(url, data, timeout)
File "/usr/lib/python3.5/urllib/request.py", line 472, in open
response = meth(req, response)
File "/usr/lib/python3.5/urllib/request.py", line 582, in http_response
'http', request, response, code, msg, hdrs)
File "/usr/lib/python3.5/urllib/request.py", line 510, in error
return self._call_chain(*args)
File "/usr/lib/python3.5/urllib/request.py", line 444, in _call_chain
result = func(*args)
File "/usr/lib/python3.5/urllib/request.py", line 590, in http_error_default
raise HTTPError(req.full_url, code, msg, hdrs, fp)
urllib.error.HTTPError: HTTP Error 502: Bad Gateway
ERROR:root:Invalid url for grpc-protobuf-lite-1.37.0: https://opensource.org/licenses/Apache-2.0. Retrying...
Traceback (most recent call last):
File "<https://ci-beam.apache.org/job/beam_PostCommit_Go_VR_Flink/ws/src/sdks/java/container/license_scripts/pull_licenses_java.py",> line 53, in pull_from_url
url_read = urlopen(url)
File "/usr/lib/python3.5/urllib/request.py", line 163, in urlopen
return opener.open(url, data, timeout)
File "/usr/lib/python3.5/urllib/request.py", line 472, in open
response = meth(req, response)
File "/usr/lib/python3.5/urllib/request.py", line 582, in http_response
'http', request, response, code, msg, hdrs)
File "/usr/lib/python3.5/urllib/request.py", line 504, in error
result = self._call_chain(*args)
File "/usr/lib/python3.5/urllib/request.py", line 444, in _call_chain
result = func(*args)
File "/usr/lib/python3.5/urllib/request.py", line 696, in http_error_302
return self.parent.open(new, timeout=req.timeout)
File "/usr/lib/python3.5/urllib/request.py", line 472, in open
response = meth(req, response)
File "/usr/lib/python3.5/urllib/request.py", line 582, in http_response
'http', request, response, code, msg, hdrs)
File "/usr/lib/python3.5/urllib/request.py", line 510, in error
return self._call_chain(*args)
File "/usr/lib/python3.5/urllib/request.py", line 444, in _call_chain
result = func(*args)
File "/usr/lib/python3.5/urllib/request.py", line 590, in http_error_default
raise HTTPError(req.full_url, code, msg, hdrs, fp)
urllib.error.HTTPError: HTTP Error 502: Bad Gateway
ERROR:root:Invalid url for visible-assertions-2.1.2: http://opensource.org/licenses/MIT. Retrying...
Traceback (most recent call last):
File "<https://ci-beam.apache.org/job/beam_PostCommit_Go_VR_Flink/ws/src/sdks/java/container/license_scripts/pull_licenses_java.py",> line 53, in pull_from_url
url_read = urlopen(url)
File "/usr/lib/python3.5/urllib/request.py", line 163, in urlopen
return opener.open(url, data, timeout)
File "/usr/lib/python3.5/urllib/request.py", line 472, in open
response = meth(req, response)
File "/usr/lib/python3.5/urllib/request.py", line 582, in http_response
'http', request, response, code, msg, hdrs)
File "/usr/lib/python3.5/urllib/request.py", line 504, in error
result = self._call_chain(*args)
File "/usr/lib/python3.5/urllib/request.py", line 444, in _call_chain
result = func(*args)
File "/usr/lib/python3.5/urllib/request.py", line 696, in http_error_302
return self.parent.open(new, timeout=req.timeout)
File "/usr/lib/python3.5/urllib/request.py", line 472, in open
response = meth(req, response)
File "/usr/lib/python3.5/urllib/request.py", line 582, in http_response
'http', request, response, code, msg, hdrs)
File "/usr/lib/python3.5/urllib/request.py", line 504, in error
result = self._call_chain(*args)
File "/usr/lib/python3.5/urllib/request.py", line 444, in _call_chain
result = func(*args)
File "/usr/lib/python3.5/urllib/request.py", line 696, in http_error_302
return self.parent.open(new, timeout=req.timeout)
File "/usr/lib/python3.5/urllib/request.py", line 472, in open
response = meth(req, response)
File "/usr/lib/python3.5/urllib/request.py", line 582, in http_response
'http', request, response, code, msg, hdrs)
File "/usr/lib/python3.5/urllib/request.py", line 510, in error
return self._call_chain(*args)
File "/usr/lib/python3.5/urllib/request.py", line 444, in _call_chain
result = func(*args)
File "/usr/lib/python3.5/urllib/request.py", line 590, in http_error_default
raise HTTPError(req.full_url, code, msg, hdrs, fp)
urllib.error.HTTPError: HTTP Error 502: Bad Gateway
ERROR:root:Invalid url for slf4j-simple-1.7.30: http://www.opensource.org/licenses/mit-license.php. Retrying...
ERROR:root:['zstd-jni-1.4.3-1', 'protobuf-java-3.15.8', 'grpc-api-1.37.0', 'grpc-grpclb-1.37.0', 'grpc-stub-1.37.0', 'google-auth-library-credentials-0.25.2', 'reflectasm-1.07', 'checker-compat-qual-2.5.3', 'software-and-algorithms-1.0', 'classgraph-4.8.104', 'junit-quickcheck-core-0.8', 'kryo-2.21', 'jopt-simple-4.6', 'hamcrest-2.1', 'reflection-util-0.0.2', 'pcollections-2.1.2', 'zstd-jni-1.4.5-2', 'grpc-auth-1.37.0', 'protobuf-java-util-3.15.8', 'grpc-protobuf-1.37.0', 'perfmark-api-0.23.0', 'google-auth-library-oauth2-http-0.25.2', 'grpc-alts-1.37.0', 'duct-tape-1.0.8', 'checker-compat-qual-2.5.5', 'kafka-1.15.1', 'require-javadoc-0.1.0', 'slf4j-jdk14-1.7.30', 'minlog-1.2', 'plume-util-1.0.6']
ERROR:root:**************************************** Licenses were not able to be pulled automatically for some dependencies. Please search source code of the dependencies on the internet and add "license" and "notice" (if available) field to <https://ci-beam.apache.org/job/beam_PostCommit_Go_VR_Flink/ws/src/sdks/java/container/license_scripts/dep_urls_java.yaml> for each missing license. Dependency List: [checker-compat-qual-2.5.3,checker-compat-qual-2.5.5,classgraph-4.8.104,duct-tape-1.0.8,google-auth-library-credentials-0.25.2,google-auth-library-oauth2-http-0.25.2,grpc-alts-1.37.0,grpc-api-1.37.0,grpc-auth-1.37.0,grpc-grpclb-1.37.0,grpc-protobuf-1.37.0,grpc-stub-1.37.0,hamcrest-2.1,jopt-simple-4.6,junit-quickcheck-core-0.8,kafka-1.15.1,kryo-2.21,minlog-1.2,pcollections-2.1.2,perfmark-api-0.23.0,plume-util-1.0.6,protobuf-java-3.15.8,protobuf-java-util-3.15.8,reflectasm-1.07,reflection-util-0.0.2,require-javadoc-0.1.0,slf4j-jdk14-1.7.30,software-and-algorithms-1.0,zstd-jni-1.4.3-1,zstd-jni-1.4.5-2]
INFO:root:pull_licenses_java.py failed. It took 100.66329 seconds with 16 threads.
Traceback (most recent call last):
File "<https://ci-beam.apache.org/job/beam_PostCommit_Go_VR_Flink/ws/src/sdks/java/container/license_scripts/pull_licenses_java.py",> line 315, in <module>
error_msg)
RuntimeError: ('1 error(s) occurred.', ['**************************************** Licenses were not able to be pulled automatically for some dependencies. Please search source code of the dependencies on the internet and add "license" and "notice" (if available) field to <https://ci-beam.apache.org/job/beam_PostCommit_Go_VR_Flink/ws/src/sdks/java/container/license_scripts/dep_urls_java.yaml> for each missing license. Dependency List: [checker-compat-qual-2.5.3,checker-compat-qual-2.5.5,classgraph-4.8.104,duct-tape-1.0.8,google-auth-library-credentials-0.25.2,google-auth-library-oauth2-http-0.25.2,grpc-alts-1.37.0,grpc-api-1.37.0,grpc-auth-1.37.0,grpc-grpclb-1.37.0,grpc-protobuf-1.37.0,grpc-stub-1.37.0,hamcrest-2.1,jopt-simple-4.6,junit-quickcheck-core-0.8,kafka-1.15.1,kryo-2.21,minlog-1.2,pcollections-2.1.2,perfmark-api-0.23.0,plume-util-1.0.6,protobuf-java-3.15.8,protobuf-java-util-3.15.8,reflectasm-1.07,reflection-util-0.0.2,require-javadoc-0.1.0,slf4j-jdk14-1.7.30,software-and-algorithms-1.0,zstd-jni-1.4.3-1,zstd-jni-1.4.5-2]'])
> Task :release:go-licenses:go:dockerRun
+ go-licenses csv github.com/apache/beam/sdks/go/container
+ tee /output/licenses/list.csv
+ chmod -R a+w /output/licenses
> Task :release:go-licenses:go:createLicenses
> Task :release:go-licenses:java:dockerRun
+ chmod -R a+w /output/licenses
> Task :sdks:go:container:copyGolangLicenses
> Task :release:go-licenses:java:createLicenses
> Task :sdks:java:container:java8:copyGolangLicenses
> Task :sdks:java:container:java11:copyGolangLicenses
> Task :sdks:go:resolveBuildDependencies
Resolving google.golang.org/api: commit='0324d5e90dc7753607860272666845fad9ceb97e', urls=[https://code.googlesource.com/google-api-go-client]
Resolving google.golang.org/genproto: commit='4d944d34d83c502a5f761500a14d8842648415c3', urls=[https://github.com/google/go-genproto]
Resolving google.golang.org/grpc: commit='5e8f83304c0563d1ba74db05fee83d9c18ab9a58', urls=[https://github.com/grpc/grpc-go]
Resolving google.golang.org/protobuf: commit='d165be301fb1e13390ad453281ded24385fd8ebc', urls=[https://go.googlesource.com/protobuf]
Resolving cached github.com/etcd-io/etcd: commit='11214aa33bf5a47d3d9d8dafe0f6b97237dfe921', urls=[https://github.com/etcd-io/etcd.git, git@github.com:etcd-io/etcd.git]
Resolving cached github.com/etcd-io/etcd: commit='11214aa33bf5a47d3d9d8dafe0f6b97237dfe921', urls=[https://github.com/etcd-io/etcd.git, git@github.com:etcd-io/etcd.git]
> Task :sdks:go:installDependencies
> Task :sdks:go:buildLinuxAmd64
> Task :sdks:go:goBuild
> Task :sdks:java:container:resolveBuildDependencies
Resolving ./github.com/apache/beam/sdks/go@<https://ci-beam.apache.org/job/beam_PostCommit_Go_VR_Flink/ws/src/sdks/go>
> Task :sdks:go:container:resolveBuildDependencies
Resolving ./github.com/apache/beam/sdks/go@<https://ci-beam.apache.org/job/beam_PostCommit_Go_VR_Flink/ws/src/sdks/go>
> Task :sdks:go:test:resolveBuildDependencies
Resolving ./github.com/apache/beam/sdks/go@<https://ci-beam.apache.org/job/beam_PostCommit_Go_VR_Flink/ws/src/sdks/go>
> Task :sdks:java:container:installDependencies
> Task :sdks:go:test:installDependencies
> Task :sdks:go:container:installDependencies
> Task :sdks:go:test:buildLinuxAmd64
> Task :sdks:go:test:goBuild
> Task :sdks:go:container:buildLinuxAmd64
> Task :sdks:go:container:goBuild
> Task :sdks:java:container:buildLinuxAmd64
> Task :sdks:java:container:goBuild
> Task :sdks:go:container:dockerPrepare
> Task :sdks:java:container:java11:copySdkHarnessLauncher
> Task :sdks:java:container:java8:copySdkHarnessLauncher
> Task :sdks:go:container:docker
FAILURE: Build failed with an exception.
* What went wrong:
Execution failed for task ':sdks:java:container:pullLicenses'.
> Process 'command './license_scripts/license_script.sh'' finished with non-zero exit value 1
* Try:
Run with --stacktrace option to get the stack trace. Run with --info or --debug option to get more log output. Run with --scan to get full insights.
* Get more help at https://help.gradle.org
Deprecated Gradle features were used in this build, making it incompatible with Gradle 7.0.
Use '--warning-mode all' to show the individual deprecation warnings.
See https://docs.gradle.org/6.8.3/userguide/command_line_interface.html#sec:command_line_warnings
BUILD FAILED in 10m 36s
164 actionable tasks: 117 executed, 42 from cache, 5 up-to-date
Publishing build scan...
https://gradle.com/s/nsvcklvvlf5kg
Build step 'Invoke Gradle script' changed build result to FAILURE
Build step 'Invoke Gradle script' marked build as failure
---------------------------------------------------------------------
To unsubscribe, e-mail: builds-unsubscribe@beam.apache.org
For additional commands, e-mail: builds-help@beam.apache.org
Jenkins build is back to normal : beam_PostCommit_Go_VR_Flink #5072
Posted by Apache Jenkins Server <je...@builds.apache.org>.
See <https://ci-beam.apache.org/job/beam_PostCommit_Go_VR_Flink/5072/display/redirect>
---------------------------------------------------------------------
To unsubscribe, e-mail: builds-unsubscribe@beam.apache.org
For additional commands, e-mail: builds-help@beam.apache.org
Build failed in Jenkins: beam_PostCommit_Go_VR_Flink #5071
Posted by Apache Jenkins Server <je...@builds.apache.org>.
See <https://ci-beam.apache.org/job/beam_PostCommit_Go_VR_Flink/5071/display/redirect?page=changes>
Changes:
[noreply] [GoSDK Infra] Limit simultaneous tests binaries to 3. (#15321)
------------------------------------------
[...truncated 3.46 MB...]
type_urn: "beam:artifact:type:file:v1"
type_payload: "\ng/tmp/beam-artifact-staging/094f41b53d1de5aa636eb5fe08d46d08eb74e72e423e1c243469f905d36f29da/1-go-worker"
role_urn: "beam:artifact:role:staging_to:v1"
role_payload: "\n\006worker"
}
Aug 12, 2021 6:18:00 AM org.apache.beam.runners.fnexecution.logging.GrpcLoggingService close
INFO: 1 Beam Fn Logging clients still connected during shutdown.
Aug 12, 2021 6:18:00 AM org.apache.beam.sdk.fn.data.BeamFnDataGrpcMultiplexer$InboundObserver onCompleted
WARNING: Hanged up for unknown endpoint.
Aug 12, 2021 6:18:00 AM org.apache.beam.runners.fnexecution.environment.DockerContainerEnvironment close
INFO: Closing Docker container d6cb62dc75472cdff3ba667d8d137abec5bf84b6d74b5a44a28c1eb3bd8d3a6f. Logs:
2021/08/12 06:18:00 Provision info:
pipeline_options:{fields:{key:"beam:option:app_name:v1" value:{string_value:"go-job-7-1628749071882634494"}} fields:{key:"beam:option:experiments:v1" value:{list_value:{values:{string_value:"beam_fn_api"}}}} fields:{key:"beam:option:flink_master:v1" value:{string_value:"[local]"}} fields:{key:"beam:option:go_options:v1" value:{struct_value:{fields:{key:"options" value:{struct_value:{fields:{key:"hooks" value:{string_value:"{}"}}}}}}}} fields:{key:"beam:option:job_name:v1" value:{string_value:"go0job0701628749071882634494-jenkins-0812061754-e0b68304"}} fields:{key:"beam:option:options_id:v1" value:{number_value:33}} fields:{key:"beam:option:output_executable_path:v1" value:{null_value:NULL_VALUE}} fields:{key:"beam:option:parallelism:v1" value:{number_value:-1}} fields:{key:"beam:option:retain_docker_containers:v1" value:{bool_value:false}} fields:{key:"beam:option:runner:v1" value:{null_value:NULL_VALUE}}} logging_endpoint:{url:"localhost:43555"} artifact_endpoint:{url:"localhost:35925"} control_endpoint:{url:"localhost:46071"} dependencies:{type_urn:"beam:artifact:type:file:v1" type_payload:"\ng/tmp/beam-artifact-staging/094f41b53d1de5aa636eb5fe08d46d08eb74e72e423e1c243469f905d36f29da/1-go-worker" role_urn:"beam:artifact:role:staging_to:v1" role_payload:"\n\x06worker"}
2021/08/12 06:18:00 Initializing Go harness: /opt/apache/beam/boot --id=53-1 --provision_endpoint=localhost:34403
2021/08/12 06:18:00 Downloaded: /tmp/staged/worker (sha256: 93f7d10c1cac080544aa8fc9034c57d00464fff7be09742584c6aac596ab8678, size: 27195142)
Worker exited successfully!
2021/08/12 06:18:00 control response channel closed
Aug 12, 2021 6:18:01 AM org.apache.flink.runtime.taskmanager.Task transitionState
INFO: MapPartition (MapPartition at [1]passert.Equals/passert.failIfBadEntries) (1/1)#0 (d82d6b4a301c6e428c6337dd591841fb) switched from RUNNING to FINISHED.
Aug 12, 2021 6:18:01 AM org.apache.flink.runtime.taskmanager.Task doRun
INFO: Freeing task resources for MapPartition (MapPartition at [1]passert.Equals/passert.failIfBadEntries) (1/1)#0 (d82d6b4a301c6e428c6337dd591841fb).
Aug 12, 2021 6:18:01 AM org.apache.flink.runtime.taskmanager.Task transitionState
INFO: DataSink (DiscardingOutput) (1/1)#0 (115b10b9d4bd8de28d08237456332f37) switched from RUNNING to FINISHED.
Aug 12, 2021 6:18:01 AM org.apache.flink.runtime.taskmanager.Task doRun
INFO: Freeing task resources for DataSink (DiscardingOutput) (1/1)#0 (115b10b9d4bd8de28d08237456332f37).
Aug 12, 2021 6:18:01 AM org.apache.flink.runtime.taskexecutor.TaskExecutor unregisterTaskAndNotifyFinalState
INFO: Un-registering task and sending final execution state FINISHED to JobManager for task MapPartition (MapPartition at [1]passert.Equals/passert.failIfBadEntries) (1/1)#0 d82d6b4a301c6e428c6337dd591841fb.
Aug 12, 2021 6:18:01 AM org.apache.flink.runtime.taskexecutor.TaskExecutor unregisterTaskAndNotifyFinalState
INFO: Un-registering task and sending final execution state FINISHED to JobManager for task DataSink (DiscardingOutput) (1/1)#0 115b10b9d4bd8de28d08237456332f37.
Aug 12, 2021 6:18:01 AM org.apache.flink.runtime.executiongraph.Execution transitionState
INFO: MapPartition (MapPartition at [1]passert.Equals/passert.failIfBadEntries) (1/1) (d82d6b4a301c6e428c6337dd591841fb) switched from RUNNING to FINISHED.
Aug 12, 2021 6:18:01 AM org.apache.flink.runtime.executiongraph.Execution transitionState
INFO: DataSink (DiscardingOutput) (1/1) (115b10b9d4bd8de28d08237456332f37) switched from RUNNING to FINISHED.
Aug 12, 2021 6:18:01 AM org.apache.flink.runtime.resourcemanager.slotmanager.DeclarativeSlotManager processResourceRequirements
INFO: Clearing resource requirements of job ee1705519f47fbd8d9b64f298b4d871a
Aug 12, 2021 6:18:01 AM org.apache.flink.runtime.executiongraph.DefaultExecutionGraph transitionState
INFO: Job go0job0701628749071882634494-jenkins-0812061754-e0b68304 (ee1705519f47fbd8d9b64f298b4d871a) switched from state RUNNING to FINISHED.
Aug 12, 2021 6:18:01 AM org.apache.flink.runtime.dispatcher.Dispatcher jobReachedTerminalState
INFO: Job ee1705519f47fbd8d9b64f298b4d871a reached terminal state FINISHED.
Aug 12, 2021 6:18:01 AM org.apache.flink.runtime.minicluster.MiniCluster closeAsync
INFO: Shutting down Flink Mini Cluster
Aug 12, 2021 6:18:01 AM org.apache.flink.runtime.taskexecutor.TaskExecutor onStop
INFO: Stopping TaskExecutor akka://flink/user/rpc/taskmanager_124.
Aug 12, 2021 6:18:01 AM org.apache.flink.runtime.rest.RestServerEndpoint closeAsync
INFO: Shutting down rest endpoint.
Aug 12, 2021 6:18:01 AM org.apache.flink.runtime.taskexecutor.TaskExecutor closeResourceManagerConnection
INFO: Close ResourceManager connection dd8665ae979475149658d7ec2673a165.
Aug 12, 2021 6:18:01 AM org.apache.flink.runtime.jobmaster.JobMaster onStop
INFO: Stopping the JobMaster for job go0job0701628749071882634494-jenkins-0812061754-e0b68304(ee1705519f47fbd8d9b64f298b4d871a).
Aug 12, 2021 6:18:01 AM org.apache.flink.runtime.taskexecutor.TaskExecutor disconnectJobManagerConnection
INFO: Close JobManager connection for job ee1705519f47fbd8d9b64f298b4d871a.
Aug 12, 2021 6:18:01 AM org.apache.flink.runtime.resourcemanager.ResourceManager closeTaskManagerConnection
INFO: Closing TaskExecutor connection 0c105819-0404-4238-b074-174ad5ea38ec because: The TaskExecutor is shutting down.
Aug 12, 2021 6:18:01 AM org.apache.flink.runtime.jobmaster.slotpool.DefaultDeclarativeSlotPool releaseSlots
INFO: Releasing slot [29381e91421915d5bcfa5a734d0753ee].
Aug 12, 2021 6:18:01 AM org.apache.flink.runtime.resourcemanager.slotmanager.DeclarativeSlotManager processResourceRequirements
INFO: Clearing resource requirements of job ee1705519f47fbd8d9b64f298b4d871a
Aug 12, 2021 6:18:01 AM org.apache.flink.runtime.jobmaster.JobMaster dissolveResourceManagerConnection
INFO: Close ResourceManager connection dd8665ae979475149658d7ec2673a165: Stopping JobMaster for job go0job0701628749071882634494-jenkins-0812061754-e0b68304(ee1705519f47fbd8d9b64f298b4d871a)..
Aug 12, 2021 6:18:01 AM org.apache.flink.runtime.taskexecutor.slot.TaskSlotTableImpl freeSlotInternal
INFO: Free slot TaskSlot(index:0, state:ALLOCATED, resource profile: ResourceProfile{taskHeapMemory=1024.000gb (1099511627776 bytes), taskOffHeapMemory=1024.000gb (1099511627776 bytes), managedMemory=9.081gb (9750337536 bytes), networkMemory=64.000mb (67108864 bytes)}, allocationId: 29381e91421915d5bcfa5a734d0753ee, jobId: ee1705519f47fbd8d9b64f298b4d871a).
Aug 12, 2021 6:18:01 AM org.apache.beam.runners.flink.FlinkPipelineRunner createPortablePipelineResult
INFO: Execution finished in 6081 msecs
Aug 12, 2021 6:18:01 AM org.apache.flink.runtime.resourcemanager.ResourceManager closeJobManagerConnection
INFO: Disconnect job manager a80a621a10e67791c714f2e21d134f05@akka://flink/user/rpc/jobmanager_127 for job ee1705519f47fbd8d9b64f298b4d871a from the resource manager.
Aug 12, 2021 6:18:01 AM org.apache.beam.runners.flink.FlinkPipelineRunner createPortablePipelineResult
INFO: Final accumulator values:
Aug 12, 2021 6:18:01 AM org.apache.beam.runners.flink.FlinkPipelineRunner createPortablePipelineResult
INFO: __metricscontainers : {
"metrics": {
"attempted": [{
"urn": "beam:metric:data_channel:read_index:v1",
"type": "beam:metrics:sum_int64:v1",
"payload": "AQ==",
"labels": {
"PTRANSFORM": "fn/read/n4:0"
}
}, {
"urn": "beam:metric:element_count:v1",
"type": "beam:metrics:sum_int64:v1",
"payload": "AQ==",
"labels": {
"PCOLLECTION": "n4"
}
}, {
"urn": "beam:metric:data_channel:read_index:v1",
"type": "beam:metrics:sum_int64:v1",
"payload": "AQ==",
"labels": {
"PTRANSFORM": "fn/read/n8:0"
}
}, {
"urn": "beam:metric:element_count:v1",
"type": "beam:metrics:sum_int64:v1",
"payload": "AQ==",
"labels": {
"PCOLLECTION": "n8"
}
}, {
"urn": "beam:metric:element_count:v1",
"type": "beam:metrics:sum_int64:v1",
"payload": "AQ==",
"labels": {
"PCOLLECTION": "n10"
}
}, {
"urn": "beam:metric:data_channel:read_index:v1",
"type": "beam:metrics:sum_int64:v1",
"payload": "AQ==",
"labels": {
"PTRANSFORM": "fn/read/n10:0"
}
}, {
"urn": "beam:metric:element_count:v1",
"type": "beam:metrics:sum_int64:v1",
"payload": "AQ==",
"labels": {
"PCOLLECTION": "n14"
}
}, {
"urn": "beam:metric:data_channel:read_index:v1",
"type": "beam:metrics:sum_int64:v1",
"payload": "AQ==",
"labels": {
"PTRANSFORM": "fn/read/n14:0"
}
}, {
"urn": "beam:metric:element_count:v1",
"type": "beam:metrics:sum_int64:v1",
"payload": "AQ==",
"labels": {
"PCOLLECTION": "n1"
}
}, {
"urn": "beam:metric:data_channel:read_index:v1",
"type": "beam:metrics:sum_int64:v1",
"payload": "AQ==",
"labels": {
"PTRANSFORM": "fn/read/n1:0"
}
}]
}
}
Aug 12, 2021 6:18:01 AM org.apache.flink.runtime.taskexecutor.DefaultJobLeaderService stop
INFO: Stop job leader service.
Aug 12, 2021 6:18:01 AM org.apache.flink.runtime.taskexecutor.TaskExecutor$JobLeaderListenerImpl jobManagerLostLeadership
INFO: JobManager for job ee1705519f47fbd8d9b64f298b4d871a with leader id a80a621a10e67791c714f2e21d134f05 lost leadership.
Aug 12, 2021 6:18:01 AM org.apache.flink.runtime.state.TaskExecutorLocalStateStoresManager shutdown
INFO: Shutting down TaskExecutorLocalStateStoresManager.
Aug 12, 2021 6:18:01 AM org.apache.beam.runners.jobsubmission.InMemoryJobService getJobMetrics
INFO: Getting job metrics for go0job0701628749071882634494-jenkins-0812061754-e0b68304_7a2cc563-5f01-4e39-943b-457f39bafbd9
Aug 12, 2021 6:18:01 AM org.apache.beam.runners.jobsubmission.InMemoryJobService getJobMetrics
INFO: Finished getting job metrics for go0job0701628749071882634494-jenkins-0812061754-e0b68304_7a2cc563-5f01-4e39-943b-457f39bafbd9
Aug 12, 2021 6:18:01 AM org.apache.flink.runtime.io.disk.FileChannelManagerImpl lambda$getFileCloser$0
INFO: FileChannelManager removed spill file directory /tmp/flink-io-fff68e87-f24e-4ebc-a487-37e2e5aa5e1c
Aug 12, 2021 6:18:01 AM org.apache.flink.runtime.io.network.NettyShuffleEnvironment close
INFO: Shutting down the network environment and its components.
Aug 12, 2021 6:18:01 AM org.apache.flink.runtime.io.disk.FileChannelManagerImpl lambda$getFileCloser$0
INFO: FileChannelManager removed spill file directory /tmp/flink-netty-shuffle-2fed392e-3bc4-4f7c-95d3-4b527c22c752
Aug 12, 2021 6:18:01 AM org.apache.flink.runtime.taskexecutor.KvStateService shutdown
INFO: Shutting down the kvState service and its components.
Aug 12, 2021 6:18:01 AM org.apache.flink.runtime.taskexecutor.DefaultJobLeaderService stop
INFO: Stop job leader service.
Aug 12, 2021 6:18:01 AM org.apache.flink.runtime.filecache.FileCache shutdown
INFO: removed file cache directory /tmp/flink-dist-cache-cd35838b-06b1-4be0-9956-fc7349ee872f
Aug 12, 2021 6:18:01 AM org.apache.flink.runtime.taskexecutor.TaskExecutor handleOnStopException
INFO: Stopped TaskExecutor akka://flink/user/rpc/taskmanager_124.
Aug 12, 2021 6:18:01 AM org.apache.flink.runtime.webmonitor.WebMonitorEndpoint lambda$shutDownInternal$5
INFO: Removing cache directory /tmp/flink-web-ui
Aug 12, 2021 6:18:01 AM org.apache.flink.runtime.rest.RestServerEndpoint lambda$closeAsync$1
INFO: Shut down complete.
Aug 12, 2021 6:18:01 AM org.apache.flink.runtime.resourcemanager.ResourceManager deregisterApplication
INFO: Shut down cluster because application is in CANCELED, diagnostics DispatcherResourceManagerComponent has been closed..
Aug 12, 2021 6:18:01 AM org.apache.flink.runtime.entrypoint.component.DispatcherResourceManagerComponent closeAsyncInternal
INFO: Closing components.
Aug 12, 2021 6:18:01 AM org.apache.flink.runtime.dispatcher.runner.AbstractDispatcherLeaderProcess closeInternal
INFO: Stopping SessionDispatcherLeaderProcess.
Aug 12, 2021 6:18:01 AM org.apache.flink.runtime.dispatcher.Dispatcher onStop
INFO: Stopping dispatcher akka://flink/user/rpc/dispatcher_126.
Aug 12, 2021 6:18:01 AM org.apache.flink.runtime.resourcemanager.slotmanager.DeclarativeSlotManager close
INFO: Closing the slot manager.
Aug 12, 2021 6:18:01 AM org.apache.flink.runtime.dispatcher.Dispatcher terminateRunningJobs
INFO: Stopping all currently running jobs of dispatcher akka://flink/user/rpc/dispatcher_126.
Aug 12, 2021 6:18:01 AM org.apache.flink.runtime.resourcemanager.slotmanager.DeclarativeSlotManager suspend
INFO: Suspending the slot manager.
Aug 12, 2021 6:18:01 AM org.apache.flink.runtime.dispatcher.Dispatcher lambda$onStop$0
INFO: Stopped dispatcher akka://flink/user/rpc/dispatcher_126.
Aug 12, 2021 6:18:01 AM org.apache.flink.runtime.rpc.akka.AkkaRpcService stopService
INFO: Stopping Akka RPC service.
Aug 12, 2021 6:18:01 AM org.apache.flink.runtime.rpc.akka.AkkaRpcService stopService
INFO: Stopping Akka RPC service.
Aug 12, 2021 6:18:01 AM org.apache.flink.runtime.rpc.akka.AkkaRpcService lambda$stopService$7
INFO: Stopped Akka RPC service.
Aug 12, 2021 6:18:01 AM org.apache.flink.runtime.blob.AbstractBlobCache close
INFO: Shutting down BLOB cache
Aug 12, 2021 6:18:01 AM org.apache.flink.runtime.blob.AbstractBlobCache close
INFO: Shutting down BLOB cache
Aug 12, 2021 6:18:01 AM org.apache.flink.runtime.blob.BlobServer close
INFO: Stopped BLOB server at 0.0.0.0:37089
Aug 12, 2021 6:18:01 AM org.apache.flink.runtime.rpc.akka.AkkaRpcService lambda$stopService$7
INFO: Stopped Akka RPC service.
if [[ "$RUNNER" == "dataflow" ]]; then
# Delete the container locally and remotely
docker rmi $CONTAINER:$TAG || echo "Failed to remove container"
gcloud --quiet container images delete $CONTAINER:$TAG || echo "Failed to delete container"
if [[ -n "$TEST_EXPANSION_ADDR" || -n "$IO_EXPANSION_ADDR" ]]; then
# Delete the java cross-language container locally and remotely
docker rmi $JAVA_CONTAINER:$JAVA_TAG || echo "Failed to remove container"
gcloud --quiet container images delete $JAVA_CONTAINER:$JAVA_TAG || echo "Failed to delete container"
fi
# Clean up tempdir
rm -rf $TMPDIR
fi
exit $TEST_EXIT_CODE
exit_background_processes
> Task :sdks:go:test:flinkValidatesRunner FAILED
FAILURE: Build failed with an exception.
* Where:
Build file '<https://ci-beam.apache.org/job/beam_PostCommit_Go_VR_Flink/ws/src/sdks/go/test/build.gradle'> line: 94
* What went wrong:
Execution failed for task ':sdks:go:test:flinkValidatesRunner'.
> Process 'command 'sh'' finished with non-zero exit value 1
* Try:
Run with --stacktrace option to get the stack trace. Run with --info or --debug option to get more log output. Run with --scan to get full insights.
* Get more help at https://help.gradle.org
Deprecated Gradle features were used in this build, making it incompatible with Gradle 7.0.
Use '--warning-mode all' to show the individual deprecation warnings.
See https://docs.gradle.org/6.8.3/userguide/command_line_interface.html#sec:command_line_warnings
BUILD FAILED in 17m 32s
169 actionable tasks: 122 executed, 42 from cache, 5 up-to-date
Publishing build scan...
https://gradle.com/s/ixbxdhnncvgri
Build step 'Invoke Gradle script' changed build result to FAILURE
Build step 'Invoke Gradle script' marked build as failure
---------------------------------------------------------------------
To unsubscribe, e-mail: builds-unsubscribe@beam.apache.org
For additional commands, e-mail: builds-help@beam.apache.org