You are viewing a plain text version of this content. The canonical link for it is here.
Posted to dev@calcite.apache.org by Apache Jenkins Server <je...@builds.apache.org> on 2022/11/09 01:07:23 UTC

Build failed in Jenkins: Calcite » Calcite-snapshots #270

See <https://ci-builds.apache.org/job/Calcite/job/Calcite-snapshots/270/display/redirect?page=changes>

Changes:

[Julian Hyde] [CALCITE-5155] Custom time frames


------------------------------------------
[...truncated 324.19 KB...]
         25.0sec, org.apache.calcite.test.PigRelExTest > testLessThan()
          2.2sec, org.apache.calcite.test.PigRelExTest > testNot()
          7.6sec, org.apache.calcite.test.PigRelOpTest > testLoadWithoutSchema()
         25.6sec, org.apache.calcite.test.PigRelOpTest > testLoadWithSchema()
          3.9sec, org.apache.calcite.test.PigRelOpTest > testFlattenStrSplit()
         26.9sec, org.apache.calcite.test.PigScriptTest > testReadScript()
         26.9sec, org.apache.calcite.test.PigRelOpTest > testUnionDifferentSchemas1()
         27.2sec,    1 completed,   0 failed,   0 skipped, org.apache.calcite.test.PigScriptTest

> Task :redis:test

Gradle Test Executor 9 STANDARD_OUT
    docker[redis:2.8.19] 2022-11-09 01:05:31,390 [ForkJoinPool-1-worker-25] INFO  - Pulling docker image: redis:2.8.19. Please be patient; this may take some time but only needs to be done once.
    docker[redis:2.8.19] 2022-11-09 01:05:32,909 [docker-java-stream--1133810895] INFO  - Starting to pull image
    docker[redis:2.8.19] 2022-11-09 01:05:32,912 [docker-java-stream--1133810895] INFO  - Pulling image layers:  0 pending,  0 downloaded,  0 extracted, (0 bytes/0 bytes)
    docker[redis:2.8.19] 2022-11-09 01:05:33,253 [docker-java-stream--1133810895] INFO  - Pulling image layers:  8 pending,  1 downloaded,  0 extracted, (1 KB/? MB)
    docker[redis:2.8.19] 2022-11-09 01:05:33,255 [docker-java-stream--1133810895] INFO  - Pulling image layers:  7 pending,  2 downloaded,  0 extracted, (1 KB/? MB)
    docker[redis:2.8.19] 2022-11-09 01:05:33,624 [docker-java-stream--1133810895] INFO  - Pulling image layers:  6 pending,  3 downloaded,  0 extracted, (13 MB/? MB)
    docker[redis:2.8.19] 2022-11-09 01:05:34,006 [docker-java-stream--1133810895] INFO  - Pulling image layers:  5 pending,  4 downloaded,  0 extracted, (29 MB/? MB)
    docker[redis:2.8.19] 2022-11-09 01:05:34,075 [docker-java-stream--1133810895] INFO  - Pulling image layers:  4 pending,  5 downloaded,  0 extracted, (33 MB/? MB)

> Task :geode:test

> Task :babel:test
         31.3sec, org.apache.calcite.test.BabelQuidemTest > test(String)[4], [4] sql/redshift.iq
         32.5sec,    4 completed,   0 failed,   0 skipped, org.apache.calcite.test.BabelQuidemTest > test(String)
         32.6sec,    4 completed,   0 failed,   0 skipped, org.apache.calcite.test.BabelQuidemTest
WARNING  37.2sec,  471 completed,   0 failed,   5 skipped, Gradle Test Run :babel:test

> Task :plus:test
         30.5sec, org.apache.calcite.adapter.tpch.TpchTest > testQuery11()
         11.7sec, org.apache.calcite.adapter.tpch.TpchTest > testQuery16()
          8.3sec, org.apache.calcite.adapter.tpch.TpchTest > testQuery22()
         31.6sec, org.apache.calcite.adapter.tpch.TpchTest > testQuery06()
         31.7sec, org.apache.calcite.adapter.tpch.TpchTest > testQuery01()
         14.5sec, org.apache.calcite.adapter.tpch.TpchTest > testQuery14()
         16.1sec, org.apache.calcite.adapter.tpch.TpchTest > testQuery13()
         14.6sec, org.apache.calcite.adapter.tpch.TpchTest > testQuery15()
         12.9sec, org.apache.calcite.adapter.tpch.TpchTest > testQuery20()
         16.9sec, org.apache.calcite.adapter.tpch.TpchTest > testQuery12()
         32.3sec, org.apache.calcite.adapter.tpch.TpchTest > testQuery10()
         32.5sec, org.apache.calcite.adapter.tpch.TpchTest > testQuery03()
         32.8sec, org.apache.calcite.adapter.tpch.TpchTest > testQuery04()
         13.6sec, org.apache.calcite.adapter.tpch.TpchTest > testQuery17()
         13.6sec, org.apache.calcite.adapter.tpch.TpchTest > testQuery18()
         33.0sec, org.apache.calcite.adapter.tpch.TpchTest > testQuery08()
         33.0sec, org.apache.calcite.adapter.tpch.TpchTest > testQuery09()
         33.2sec, org.apache.calcite.adapter.tpch.TpchTest > testQuery02Conversion()
         33.4sec, org.apache.calcite.adapter.tpch.TpchTest > testQuery02()

> Task :piglet:test
         26.9sec, org.apache.calcite.test.PigRelOpTest > testUdf()
          2.3sec, org.apache.calcite.test.PigRelOpTest > testSimpleForEach3()
          4.9sec, org.apache.calcite.test.PigRelOpTest > testMultipleStores()
         26.8sec, org.apache.calcite.test.PigRelOpTest > testLimit()
          2.4sec, org.apache.calcite.test.PigRelOpTest > testSimpleForEach2()
         10.4sec, org.apache.calcite.test.PigRelOpTest > testSplit()
         27.6sec, org.apache.calcite.test.PigRelOpTest > testAggregate2half()
          5.1sec, org.apache.calcite.test.PigRelOpTest > testGroupby()
         28.2sec, org.apache.calcite.test.PigRelOpTest > testUnionDifferentSchemas2()
         28.7sec, org.apache.calcite.test.PigRelOpTest > testCross()
          3.5sec, org.apache.calcite.test.PigRelOpTest > testAggregate2()
         11.8sec, org.apache.calcite.test.PigRelOpTest > testRank()
         29.3sec, org.apache.calcite.test.PigRelOpTest > testOrderBy()
          2.0sec, org.apache.calcite.test.PigRelOpTest > testFilter()
          2.4sec, org.apache.calcite.test.PigRelOpTest > testGroupby2()
          2.5sec, org.apache.calcite.test.PigRelOpTest > testUnionSameSchema()
          2.3sec, org.apache.calcite.test.PigRelOpTest > testMultisetProjection()
          3.0sec, org.apache.calcite.test.PigRelOpTest > testAggregate()
          3.1sec, org.apache.calcite.test.PigRelOpTest > testCubeCube()
          3.1sec, org.apache.calcite.test.PigRelOpTest > testCoGroup()
          5.1sec, org.apache.calcite.test.PigRelOpTest > testJoin3Rels()
          2.7sec, org.apache.calcite.test.PigRelOpTest > testCubeRollup()
          5.4sec, org.apache.calcite.test.PigRelOpTest > testJoin2Rels()
          3.6sec, org.apache.calcite.test.PigRelOpTest > testAggregate3()
          3.2sec, org.apache.calcite.test.PigRelExTest > testCast()
WARNING  31.1sec,   29 completed,   0 failed,   1 skipped, org.apache.calcite.test.PigRelExTest
          3.9sec, org.apache.calcite.test.PigRelOpTest > testForEachNested()
         31.2sec,   35 completed,   0 failed,   0 skipped, org.apache.calcite.test.PigRelOpTest
WARNING  37.6sec,  106 completed,   0 failed,   2 skipped, Gradle Test Run :piglet:test

> Task :redis:test
    docker[redis:2.8.19] 2022-11-09 01:05:34,481 [docker-java-stream--1133810895] INFO  - Pulling image layers:  3 pending,  6 downloaded,  0 extracted, (34 MB/? MB)
    docker[redis:2.8.19] 2022-11-09 01:05:34,913 [docker-java-stream--1133810895] INFO  - Pulling image layers:  2 pending,  7 downloaded,  0 extracted, (36 MB/? MB)
    docker[redis:2.8.19] 2022-11-09 01:05:35,784 [docker-java-stream--1133810895] INFO  - Pulling image layers:  1 pending,  8 downloaded,  0 extracted, (40 MB/? MB)
    docker[redis:2.8.19] 2022-11-09 01:05:37,018 [docker-java-stream--1133810895] INFO  - Pulling image layers:  0 pending,  9 downloaded,  0 extracted, (42 MB/46 MB)
    docker[redis:2.8.19] 2022-11-09 01:05:39,182 [docker-java-stream--1133810895] INFO  - Pulling image layers:  0 pending,  9 downloaded,  1 extracted, (45 MB/46 MB)

> Task :spark:test
         33.4sec, org.apache.calcite.test.SparkAdapterTest > testOrderByLimit()
         33.6sec, org.apache.calcite.test.SparkAdapterTest > testFilterFalse()
         33.6sec, org.apache.calcite.test.SparkAdapterTest > testFilterTrue()
         33.4sec, org.apache.calcite.test.SparkAdapterTest > testUnion()
         33.3sec, org.apache.calcite.test.SparkAdapterTest > testFilterIsNotNull()
         33.6sec, org.apache.calcite.test.SparkAdapterTest > testFilterIsNull()
         33.4sec, org.apache.calcite.test.SparkAdapterTest > testSelectDistinct()
         33.4sec, org.apache.calcite.test.SparkAdapterTest > testUnionAll()
         33.5sec, org.apache.calcite.test.SparkAdapterTest > testGroupByOrderByAsc()
         33.4sec, org.apache.calcite.test.SparkAdapterTest > testArithmeticMul()
         33.5sec, org.apache.calcite.test.SparkAdapterTest > testSortXAscProjectY()
         33.4sec, org.apache.calcite.test.SparkAdapterTest > testJoinProject()
         33.5sec, org.apache.calcite.test.SparkAdapterTest > testFilterOr()
         33.6sec, org.apache.calcite.test.SparkAdapterTest > testLimit()
         33.4sec, org.apache.calcite.test.SparkAdapterTest > testSortXAscYDescProjectY()
         33.4sec, org.apache.calcite.test.SparkAdapterTest > testArithmeticPlus()
         33.5sec, org.apache.calcite.test.SparkAdapterTest > testJoinProjectAliasProject()
         33.6sec, org.apache.calcite.test.SparkAdapterTest > testArithmeticDiv()
         33.5sec, org.apache.calcite.test.SparkAdapterTest > testSortXDescYAscProjectY()
         33.7sec, org.apache.calcite.test.SparkAdapterTest > testSortXDescYDescProjectY()
         33.8sec, org.apache.calcite.test.SparkAdapterTest > testUnionWithFiltersProject()
         34.1sec, org.apache.calcite.test.SparkAdapterTest > testGroupBy()
         34.0sec, org.apache.calcite.test.SparkAdapterTest > testAggFuncNoGroupBy()
         33.9sec, org.apache.calcite.test.SparkAdapterTest > testGroupByMinMaxCountCountDistinctOrderByAsc()
WARNING  34.6sec,   38 completed,   0 failed,   4 skipped, org.apache.calcite.test.SparkAdapterTest
WARNING  40.3sec,   38 completed,   0 failed,   4 skipped, Gradle Test Run :spark:test

> Task :plus:test
         15.2sec, org.apache.calcite.adapter.tpch.TpchTest > testQuery21()

> Task :geode:test
          5.2sec, org.apache.calcite.adapter.geode.rel.GeodeBookstoreTest > testSqlDistinctSort()
          5.2sec, org.apache.calcite.adapter.geode.rel.GeodeBookstoreTest > testSqlDistinctSort2()
          5.5sec, org.apache.calcite.adapter.geode.rel.GeodeAllDataTypesTest > testSqlMultipleTimestampWhereFilter()
          5.2sec, org.apache.calcite.adapter.geode.rel.GeodeAllDataTypesTest > testSqlMultipleTimeWhereFilter()
          5.5sec, org.apache.calcite.adapter.geode.rel.GeodeAllDataTypesTest > testSqlBooleanColumnNotFilter()
          5.3sec, org.apache.calcite.adapter.geode.rel.GeodeAllDataTypesTest > testSqlMultipleDateWhereFilter()
          5.5sec, org.apache.calcite.adapter.geode.rel.GeodeBookstoreTest > testInSetFilterWithNestedStringField()
          5.4sec, org.apache.calcite.adapter.geode.rel.GeodeAllDataTypesTest > testSqlMultipleBooleanWhereFilter()
          5.5sec, org.apache.calcite.adapter.geode.rel.GeodeAllDataTypesTest > testSqlSingleBooleanWhereFilter()
          5.5sec, org.apache.calcite.adapter.geode.rel.GeodeBookstoreTest > testSqlSimple()
          5.6sec, org.apache.calcite.adapter.geode.rel.GeodeAllDataTypesTest > testSqlWhereWithMultipleOrForLiteralFields()
          5.6sec, org.apache.calcite.adapter.geode.rel.GeodeAllDataTypesTest > testSqlWhereWithMultipleOrForAllFields()
          5.4sec, org.apache.calcite.adapter.geode.rel.GeodeZipsTest > testMaxRaw()
          5.5sec, org.apache.calcite.adapter.geode.rel.GeodeBookstoreTest > testMissingProjectRelationOnGroupByColumnMatchingProjectedFields()
          5.6sec, org.apache.calcite.adapter.geode.rel.GeodeBookstoreTest > testAddMissingGroupByColumnToProjectedFields()
          5.5sec, org.apache.calcite.adapter.geode.rel.GeodeBookstoreTest > testSortWithProjection()
          5.5sec, org.apache.calcite.adapter.geode.rel.GeodeBookstoreTest > testSortWithProjectionAndLimit()
          5.4sec, org.apache.calcite.adapter.geode.rel.GeodeBookstoreTest > testLimit()
          5.5sec, org.apache.calcite.adapter.geode.rel.GeodeBookstoreTest > testCount()
          5.5sec, org.apache.calcite.adapter.geode.rel.GeodeZipsTest > testWhereWithOrForNestedNumericField()
          5.8sec, org.apache.calcite.adapter.geode.rel.GeodeBookstoreTest > testFilterWithNestedField()
          5.8sec, org.apache.calcite.adapter.geode.rel.GeodeBookstoreTest > testWhereWithOr()
          5.7sec, org.apache.calcite.adapter.geode.rel.GeodeAllDataTypesTest > testSqlSingleTimeWhereFilter()
          5.9sec, org.apache.calcite.adapter.geode.rel.GeodeAllDataTypesTest > testSqlSingleDateWhereFilter()
         25.5sec,   12 completed,   0 failed,   0 skipped, org.apache.calcite.adapter.geode.rel.GeodeAllDataTypesTest
         25.8sec,   36 completed,   0 failed,   0 skipped, org.apache.calcite.adapter.geode.rel.GeodeBookstoreTest
WARNING  25.8sec,   14 completed,   0 failed,   3 skipped, org.apache.calcite.adapter.geode.rel.GeodeZipsTest
WARNING  36.4sec,   62 completed,   0 failed,   3 skipped, Gradle Test Run :geode:test

> Task :elasticsearch:test

Gradle Test Executor 19 STANDARD_OUT
    2022-11-09 01:05:40,480 [ForkJoinPool-1-worker-11] WARN  - gateway.auto_import_dangling_indices is disabled, dangling indices will not be automatically detected or imported and must be managed manually
          3.8sec, org.apache.calcite.adapter.elasticsearch.ProjectionTest > projection()
         49.5sec,    1 completed,   0 failed,   0 skipped, org.apache.calcite.adapter.elasticsearch.ProjectionTest
          4.9sec, org.apache.calcite.adapter.elasticsearch.BooleanLogicTest > notExpression()
          6.0sec, org.apache.calcite.adapter.elasticsearch.BooleanLogicTest > expressions()
         51.9sec,    2 completed,   0 failed,   0 skipped, org.apache.calcite.adapter.elasticsearch.BooleanLogicTest

> Task :redis:test
    docker[redis:2.8.19] 2022-11-09 01:05:39,795 [docker-java-stream--1133810895] INFO  - Pulling image layers:  0 pending,  9 downloaded,  2 extracted, (45 MB/46 MB)
    docker[redis:2.8.19] 2022-11-09 01:05:40,388 [docker-java-stream--1133810895] INFO  - Pulling image layers:  0 pending,  9 downloaded,  3 extracted, (45 MB/46 MB)
    docker[redis:2.8.19] 2022-11-09 01:05:41,279 [docker-java-stream--1133810895] INFO  - Pulling image layers:  0 pending,  9 downloaded,  4 extracted, (45 MB/46 MB)
    docker[redis:2.8.19] 2022-11-09 01:05:41,741 [docker-java-stream--1133810895] INFO  - Pulling image layers:  0 pending,  9 downloaded,  5 extracted, (45 MB/46 MB)
    docker[redis:2.8.19] 2022-11-09 01:05:42,373 [docker-java-stream--1133810895] INFO  - Pulling image layers:  0 pending,  9 downloaded,  6 extracted, (45 MB/46 MB)
    docker[redis:2.8.19] 2022-11-09 01:05:43,968 [docker-java-stream--1133810895] INFO  - Pulling image layers:  0 pending,  9 downloaded,  7 extracted, (46 MB/46 MB)
    docker[redis:2.8.19] 2022-11-09 01:05:44,318 [docker-java-stream--1133810895] INFO  - Pulling image layers:  0 pending,  9 downloaded,  8 extracted, (46 MB/46 MB)
    docker[redis:2.8.19] 2022-11-09 01:05:45,378 [docker-java-stream--1133810895] INFO  - Pulling image layers:  0 pending,  9 downloaded,  9 extracted, (46 MB/46 MB)
    docker[redis:2.8.19] 2022-11-09 01:05:47,196 [docker-java-stream--1133810895] INFO  - Pull complete. 9 layers, pulled in 14s (downloaded 46 MB at 3 MB/s)
    docker[redis:2.8.19] 2022-11-09 01:05:47,231 [ForkJoinPool-1-worker-25] INFO  - Creating container for image: redis:2.8.19
    docker[redis:2.8.19] 2022-11-09 01:05:52,478 [ForkJoinPool-1-worker-25] INFO  - Starting container with ID: d51abe493fbe4f860a6ea0c7644743d2e24aa7cec4374e948be58260b9c7635a
    docker[redis:2.8.19] 2022-11-09 01:05:54,160 [ForkJoinPool-1-worker-25] INFO  - Container redis:2.8.19 is starting: d51abe493fbe4f860a6ea0c7644743d2e24aa7cec4374e948be58260b9c7635a
    docker[redis:2.8.19] 2022-11-09 01:05:54,322 [ForkJoinPool-1-worker-25] INFO  - Container redis:2.8.19 started in PT23.057S
          3.4sec, org.apache.calcite.adapter.redis.RedisAdapterCaseBase > testSqlWithJoin()
         59.2sec,    2 completed,   0 failed,   0 skipped, org.apache.calcite.adapter.redis.RedisAdapterCaseBase
WARNING  62.8sec,    3 completed,   0 failed,   1 skipped, Gradle Test Run :redis:test

> Task :plus:test
         40.1sec, org.apache.calcite.adapter.tpch.TpchTest > testQuery05()

> Task :elasticsearch:test
WARNING   1.1sec,    1 completed,   0 failed,   1 skipped, org.apache.calcite.adapter.elasticsearch.ScrollingTest
          3.5sec,    7 completed,   0 failed,   0 skipped, org.apache.calcite.adapter.elasticsearch.Projection2Test
WARNING   4.0sec,   14 completed,   0 failed,   1 skipped, org.apache.calcite.adapter.elasticsearch.AggregationTest
          4.5sec,    1 completed,   0 failed,   0 skipped, org.apache.calcite.adapter.elasticsearch.MatchTest
WARNING   5.2sec,   22 completed,   0 failed,   1 skipped, org.apache.calcite.adapter.elasticsearch.ElasticSearchAdapterTest
WARNING  64.8sec,   64 completed,   0 failed,   3 skipped, Gradle Test Run :elasticsearch:test

> Task :cassandra:test

CassandraAdapterDataTypesTest STANDARD_OUT
    2022-11-09 01:06:21,365 [s0-io-3] WARN  - [s0] Detected a keyspace change at runtime (<none> => cassandraunitkeyspace). This is an anti-pattern that should be avoided in production (see 'advanced.request.warn-if-set-keyspace' in the configuration).
    2022-11-09 01:06:22,759 [s0-io-3] WARN  - [s0] Detected a keyspace change at runtime (cassandraunitkeyspace => dtcassandra). This is an anti-pattern that should be avoided in production (see 'advanced.request.warn-if-set-keyspace' in the configuration).

> Task :plus:test
         83.8sec, org.apache.calcite.adapter.tpch.TpchTest > testQuery07()
WARNING  84.4sec,   29 completed,   0 failed,   7 skipped, org.apache.calcite.adapter.tpch.TpchTest
WARNING  88.7sec,   51 completed,   0 failed,  11 skipped, Gradle Test Run :plus:test

> Task :cassandra:test
          3.7sec, org.apache.calcite.test.CassandraAdapterDataTypesTest > testCollectionsRowType()
         99.9sec,   11 completed,   0 failed,   0 skipped, org.apache.calcite.test.CassandraAdapterDataTypesTest

CassandraAdapterTest STANDARD_OUT
    2022-11-09 01:06:49,734 [s0-io-3] WARN  - [s0] Detected a keyspace change at runtime (dtcassandra => cassandraunitkeyspace). This is an anti-pattern that should be avoided in production (see 'advanced.request.warn-if-set-keyspace' in the configuration).
    2022-11-09 01:07:07,588 [s0-io-3] WARN  - [s0] Detected a keyspace change at runtime (cassandraunitkeyspace => twissandra). This is an anti-pattern that should be avoided in production (see 'advanced.request.warn-if-set-keyspace' in the configuration).
    2022-11-09 01:07:07,606 [s0-admin-0] WARN  - Query '[0 values] CREATE MATERIALIZED VIEW twissandra."Tweets_By_User" AS SELECT username, tweet_id FROM twissandra.tweets WHERE username IS NOT NULL AND tweet_id IS NOT NULL PRIMARY KEY (username, tweet_id);' generated server side warning(s): Materialized views are experimental and are not recommended for production use.
         26.4sec,   11 completed,   0 failed,   0 skipped, org.apache.calcite.test.CassandraAdapterTest

Gradle Test Executor 16 STANDARD_OUT
    2022-11-09 01:07:13,357 [s1-admin-0] WARN  - [s1|localhost/127.0.0.1:9142]  Error while opening new channel (ConnectionInitException: [s1|connecting...] Protocol initialization request, step 1 (STARTUP {CQL_VERSION=3.0.0, DRIVER_NAME=DataStax Java driver for Apache Cassandra(R), DRIVER_VERSION=4.13.0, CLIENT_ID=20097dfa-bb86-4363-ab67-c1d66bdfd855}): failed to send request (io.netty.channel.StacklessClosedChannelException))
    2022-11-09 01:07:13,391 [s2-admin-0] WARN  - [s2|localhost/127.0.0.1:9142]  Error while opening new channel (ConnectionInitException: [s2|connecting...] Protocol initialization request, step 1 (STARTUP {CQL_VERSION=3.0.0, DRIVER_NAME=DataStax Java driver for Apache Cassandra(R), DRIVER_VERSION=4.13.0, CLIENT_ID=95534667-20bb-4a35-97e0-164ce1f3f785}): failed to send request (io.netty.channel.StacklessClosedChannelException))
    2022-11-09 01:07:15,398 [s2-admin-0] WARN  - [s2|localhost/127.0.0.1:9142]  Error while opening new channel (ConnectionInitException: [s2|connecting...] Protocol initialization request, step 1 (STARTUP {CQL_VERSION=3.0.0, DRIVER_NAME=DataStax Java driver for Apache Cassandra(R), DRIVER_VERSION=4.13.0, CLIENT_ID=95534667-20bb-4a35-97e0-164ce1f3f785}): failed to send request (io.netty.channel.StacklessClosedChannelException))
    2022-11-09 01:07:15,605 [s1-admin-0] WARN  - [s1|localhost/127.0.0.1:9142]  Error while opening new channel (ConnectionInitException: [s1|connecting...] Protocol initialization request, step 1 (STARTUP {CQL_VERSION=3.0.0, DRIVER_NAME=DataStax Java driver for Apache Cassandra(R), DRIVER_VERSION=4.13.0, CLIENT_ID=20097dfa-bb86-4363-ab67-c1d66bdfd855}): failed to send request (io.netty.channel.StacklessClosedChannelException))
    2022-11-09 01:07:18,805 [s2-admin-0] WARN  - [s2|localhost/127.0.0.1:9142]  Error while opening new channel (ConnectionInitException: [s2|connecting...] Protocol initialization request, step 1 (STARTUP {CQL_VERSION=3.0.0, DRIVER_NAME=DataStax Java driver for Apache Cassandra(R), DRIVER_VERSION=4.13.0, CLIENT_ID=95534667-20bb-4a35-97e0-164ce1f3f785}): failed to send request (io.netty.channel.StacklessClosedChannelException))
    2022-11-09 01:07:19,372 [s1-admin-0] WARN  - [s1|localhost/127.0.0.1:9142]  Error while opening new channel (ConnectionInitException: [s1|connecting...] Protocol initialization request, step 1 (STARTUP {CQL_VERSION=3.0.0, DRIVER_NAME=DataStax Java driver for Apache Cassandra(R), DRIVER_VERSION=4.13.0, CLIENT_ID=20097dfa-bb86-4363-ab67-c1d66bdfd855}): failed to send request (io.netty.channel.StacklessClosedChannelException))
        140.5sec,   22 completed,   0 failed,   0 skipped, Gradle Test Run :cassandra:test

FAILURE: Build failed with an exception.

* What went wrong:
Execution failed for task ':server:test'.
> There were failing tests. See the report at: file://<https://ci-builds.apache.org/job/Calcite/job/Calcite-snapshots/ws/server/build/reports/tests/test/index.html>

* Try:
> Run with --stacktrace option to get the stack trace.
> Run with --info or --debug option to get more log output.
> Run with --scan to get full insights.

* Get more help at https://help.gradle.org

Deprecated Gradle features were used in this build, making it incompatible with Gradle 8.0.

You can use '--warning-mode all' to show the individual deprecation warnings and determine if they come from your own scripts or plugins.

See https://docs.gradle.org/7.4.2/userguide/command_line_interface.html#sec:command_line_warnings

BUILD FAILED in 5m 43s
428 actionable tasks: 428 executed

See the profiling report at: file://<https://ci-builds.apache.org/job/Calcite/job/Calcite-snapshots/ws/build/reports/profile/profile-2022-11-09-01-01-42.html>
A fine-grained performance profile is available: use the --scan option.

See the profiling report at: file://<https://ci-builds.apache.org/job/Calcite/job/Calcite-snapshots/ws/buildSrc/build/reports/profile/profile-2022-11-09-01-01-46.html>
A fine-grained performance profile is available: use the --scan option.
Build step 'Invoke Gradle script' changed build result to FAILURE
Build step 'Invoke Gradle script' marked build as failure
Recording test results
[Checks API] No suitable checks publisher found.

Jenkins build is back to normal : Calcite » Calcite-snapshots #271

Posted by Apache Jenkins Server <je...@builds.apache.org>.
See <https://ci-builds.apache.org/job/Calcite/job/Calcite-snapshots/271/display/redirect?page=changes>