You are viewing a plain text version of this content. The canonical link for it is here.
Posted to dev@lucene.apache.org by Policeman Jenkins Server <je...@thetaphi.de> on 2016/09/07 20:01:16 UTC
[JENKINS] Lucene-Solr-5.5-Linux (32bit/jdk1.8.0_102) - Build # 400
- Still Unstable!
Build: http://jenkins.thetaphi.de/job/Lucene-Solr-5.5-Linux/400/
Java: 32bit/jdk1.8.0_102 -server -XX:+UseParallelGC
1 tests failed.
FAILED: junit.framework.TestSuite.org.apache.solr.schema.TestManagedSchemaAPI
Error Message:
ObjectTracker found 4 object(s) that were not released!!! [MDCAwareThreadPoolExecutor, MockDirectoryWrapper, TransactionLog, MockDirectoryWrapper]
Stack Trace:
java.lang.AssertionError: ObjectTracker found 4 object(s) that were not released!!! [MDCAwareThreadPoolExecutor, MockDirectoryWrapper, TransactionLog, MockDirectoryWrapper]
at __randomizedtesting.SeedInfo.seed([7CCE63E3BAA527D4]:0)
at org.junit.Assert.fail(Assert.java:93)
at org.junit.Assert.assertTrue(Assert.java:43)
at org.junit.Assert.assertNull(Assert.java:551)
at org.apache.solr.SolrTestCaseJ4.afterClass(SolrTestCaseJ4.java:238)
at sun.reflect.GeneratedMethodAccessor22.invoke(Unknown Source)
at sun.reflect.DelegatingMethodAccessorImpl.invoke(DelegatingMethodAccessorImpl.java:43)
at java.lang.reflect.Method.invoke(Method.java:498)
at com.carrotsearch.randomizedtesting.RandomizedRunner.invoke(RandomizedRunner.java:1764)
at com.carrotsearch.randomizedtesting.RandomizedRunner$7.evaluate(RandomizedRunner.java:834)
at com.carrotsearch.randomizedtesting.rules.StatementAdapter.evaluate(StatementAdapter.java:36)
at com.carrotsearch.randomizedtesting.rules.SystemPropertiesRestoreRule$1.evaluate(SystemPropertiesRestoreRule.java:57)
at org.apache.lucene.util.AbstractBeforeAfterRule$1.evaluate(AbstractBeforeAfterRule.java:45)
at com.carrotsearch.randomizedtesting.rules.StatementAdapter.evaluate(StatementAdapter.java:36)
at org.apache.lucene.util.TestRuleStoreClassName$1.evaluate(TestRuleStoreClassName.java:41)
at com.carrotsearch.randomizedtesting.rules.NoShadowingOrOverridesOnMethodsRule$1.evaluate(NoShadowingOrOverridesOnMethodsRule.java:40)
at com.carrotsearch.randomizedtesting.rules.NoShadowingOrOverridesOnMethodsRule$1.evaluate(NoShadowingOrOverridesOnMethodsRule.java:40)
at com.carrotsearch.randomizedtesting.rules.StatementAdapter.evaluate(StatementAdapter.java:36)
at com.carrotsearch.randomizedtesting.rules.StatementAdapter.evaluate(StatementAdapter.java:36)
at com.carrotsearch.randomizedtesting.rules.StatementAdapter.evaluate(StatementAdapter.java:36)
at org.apache.lucene.util.TestRuleAssertionsRequired$1.evaluate(TestRuleAssertionsRequired.java:53)
at org.apache.lucene.util.TestRuleMarkFailure$1.evaluate(TestRuleMarkFailure.java:47)
at org.apache.lucene.util.TestRuleIgnoreAfterMaxFailures$1.evaluate(TestRuleIgnoreAfterMaxFailures.java:64)
at org.apache.lucene.util.TestRuleIgnoreTestSuites$1.evaluate(TestRuleIgnoreTestSuites.java:54)
at com.carrotsearch.randomizedtesting.rules.StatementAdapter.evaluate(StatementAdapter.java:36)
at com.carrotsearch.randomizedtesting.ThreadLeakControl$StatementRunner.run(ThreadLeakControl.java:367)
at java.lang.Thread.run(Thread.java:745)
Build Log:
[...truncated 11106 lines...]
[junit4] Suite: org.apache.solr.schema.TestManagedSchemaAPI
[junit4] 2> Creating dataDir: /home/jenkins/workspace/Lucene-Solr-5.5-Linux/solr/build/solr-core/test/J2/temp/solr.schema.TestManagedSchemaAPI_7CCE63E3BAA527D4-001/init-core-data-001
[junit4] 2> 343994 INFO (SUITE-TestManagedSchemaAPI-seed#[7CCE63E3BAA527D4]-worker) [ ] o.a.s.SolrTestCaseJ4 Randomized ssl (false) and clientAuth (false)
[junit4] 2> 343996 INFO (TEST-TestManagedSchemaAPI.test-seed#[7CCE63E3BAA527D4]) [ ] o.a.s.SolrTestCaseJ4 ###Starting test
[junit4] 2> 343996 INFO (TEST-TestManagedSchemaAPI.test-seed#[7CCE63E3BAA527D4]) [ ] o.a.s.c.ZkTestServer STARTING ZK TEST SERVER
[junit4] 2> 344018 INFO (Thread-1275) [ ] o.a.s.c.ZkTestServer client port:0.0.0.0/0.0.0.0:0
[junit4] 2> 344019 INFO (Thread-1275) [ ] o.a.s.c.ZkTestServer Starting server
[junit4] 2> 344118 INFO (TEST-TestManagedSchemaAPI.test-seed#[7CCE63E3BAA527D4]) [ ] o.a.s.c.ZkTestServer start zk server on port:34221
[junit4] 2> 344118 INFO (TEST-TestManagedSchemaAPI.test-seed#[7CCE63E3BAA527D4]) [ ] o.a.s.c.c.SolrZkClient Using default ZkCredentialsProvider
[junit4] 2> 344119 INFO (TEST-TestManagedSchemaAPI.test-seed#[7CCE63E3BAA527D4]) [ ] o.a.s.c.c.ConnectionManager Waiting for client to connect to ZooKeeper
[junit4] 2> 344120 INFO (zkCallback-491-thread-1) [ ] o.a.s.c.c.ConnectionManager Watcher org.apache.solr.common.cloud.ConnectionManager@e95a34 name:ZooKeeperConnection Watcher:127.0.0.1:34221 got event WatchedEvent state:SyncConnected type:None path:null path:null type:None
[junit4] 2> 344120 INFO (TEST-TestManagedSchemaAPI.test-seed#[7CCE63E3BAA527D4]) [ ] o.a.s.c.c.ConnectionManager Client is connected to ZooKeeper
[junit4] 2> 344121 INFO (TEST-TestManagedSchemaAPI.test-seed#[7CCE63E3BAA527D4]) [ ] o.a.s.c.c.SolrZkClient Using default ZkACLProvider
[junit4] 2> 344121 INFO (TEST-TestManagedSchemaAPI.test-seed#[7CCE63E3BAA527D4]) [ ] o.a.s.c.c.SolrZkClient makePath: /solr/solr.xml
[junit4] 2> 344125 INFO (jetty-launcher-490-thread-1) [ ] o.e.j.s.Server jetty-9.2.13.v20150730
[junit4] 2> 344126 INFO (jetty-launcher-490-thread-1) [ ] o.e.j.s.h.ContextHandler Started o.e.j.s.ServletContextHandler@ba92a{/solr,null,AVAILABLE}
[junit4] 2> 344127 INFO (jetty-launcher-490-thread-2) [ ] o.e.j.s.Server jetty-9.2.13.v20150730
[junit4] 2> 344132 INFO (jetty-launcher-490-thread-2) [ ] o.e.j.s.h.ContextHandler Started o.e.j.s.ServletContextHandler@12a33ba{/solr,null,AVAILABLE}
[junit4] 2> 344132 INFO (jetty-launcher-490-thread-2) [ ] o.e.j.s.ServerConnector Started ServerConnector@72565{HTTP/1.1}{127.0.0.1:34876}
[junit4] 2> 344132 INFO (jetty-launcher-490-thread-2) [ ] o.e.j.s.Server Started @346086ms
[junit4] 2> 344132 INFO (jetty-launcher-490-thread-2) [ ] o.a.s.c.s.e.JettySolrRunner Jetty properties: {hostContext=/solr, hostPort=34876}
[junit4] 2> 344132 INFO (jetty-launcher-490-thread-2) [ ] o.a.s.s.SolrDispatchFilter SolrDispatchFilter.init(): sun.misc.Launcher$AppClassLoader@1d16e93
[junit4] 2> 344132 INFO (jetty-launcher-490-thread-2) [ ] o.a.s.c.SolrResourceLoader new SolrResourceLoader for directory: '/home/jenkins/workspace/Lucene-Solr-5.5-Linux/solr/build/solr-core/test/J2/temp/solr.schema.TestManagedSchemaAPI_7CCE63E3BAA527D4-001/tempDir-001/node2'
[junit4] 2> 344132 INFO (jetty-launcher-490-thread-2) [ ] o.a.s.c.SolrResourceLoader JNDI not configured for solr (NoInitialContextEx)
[junit4] 2> 344132 INFO (jetty-launcher-490-thread-2) [ ] o.a.s.c.SolrResourceLoader solr home defaulted to 'solr/' (could not find system property or JNDI)
[junit4] 2> 344133 INFO (jetty-launcher-490-thread-2) [ ] o.a.s.c.c.SolrZkClient Using default ZkCredentialsProvider
[junit4] 2> 344133 INFO (jetty-launcher-490-thread-2) [ ] o.a.s.c.c.ConnectionManager Waiting for client to connect to ZooKeeper
[junit4] 2> 344133 INFO (jetty-launcher-490-thread-1) [ ] o.e.j.s.ServerConnector Started ServerConnector@145a6a9{HTTP/1.1}{127.0.0.1:46489}
[junit4] 2> 344133 INFO (jetty-launcher-490-thread-1) [ ] o.e.j.s.Server Started @346087ms
[junit4] 2> 344133 INFO (jetty-launcher-490-thread-1) [ ] o.a.s.c.s.e.JettySolrRunner Jetty properties: {hostContext=/solr, hostPort=46489}
[junit4] 2> 344133 INFO (jetty-launcher-490-thread-1) [ ] o.a.s.s.SolrDispatchFilter SolrDispatchFilter.init(): sun.misc.Launcher$AppClassLoader@1d16e93
[junit4] 2> 344133 INFO (jetty-launcher-490-thread-1) [ ] o.a.s.c.SolrResourceLoader new SolrResourceLoader for directory: '/home/jenkins/workspace/Lucene-Solr-5.5-Linux/solr/build/solr-core/test/J2/temp/solr.schema.TestManagedSchemaAPI_7CCE63E3BAA527D4-001/tempDir-001/node1'
[junit4] 2> 344133 INFO (jetty-launcher-490-thread-1) [ ] o.a.s.c.SolrResourceLoader JNDI not configured for solr (NoInitialContextEx)
[junit4] 2> 344133 INFO (jetty-launcher-490-thread-1) [ ] o.a.s.c.SolrResourceLoader solr home defaulted to 'solr/' (could not find system property or JNDI)
[junit4] 2> 344134 INFO (jetty-launcher-490-thread-1) [ ] o.a.s.c.c.SolrZkClient Using default ZkCredentialsProvider
[junit4] 2> 344134 INFO (jetty-launcher-490-thread-1) [ ] o.a.s.c.c.ConnectionManager Waiting for client to connect to ZooKeeper
[junit4] 2> 344136 INFO (zkCallback-492-thread-1) [ ] o.a.s.c.c.ConnectionManager Watcher org.apache.solr.common.cloud.ConnectionManager@e2af22 name:ZooKeeperConnection Watcher:127.0.0.1:34221/solr got event WatchedEvent state:SyncConnected type:None path:null path:null type:None
[junit4] 2> 344136 INFO (zkCallback-493-thread-1) [ ] o.a.s.c.c.ConnectionManager Watcher org.apache.solr.common.cloud.ConnectionManager@1968d5a name:ZooKeeperConnection Watcher:127.0.0.1:34221/solr got event WatchedEvent state:SyncConnected type:None path:null path:null type:None
[junit4] 2> 344136 INFO (jetty-launcher-490-thread-2) [ ] o.a.s.c.c.ConnectionManager Client is connected to ZooKeeper
[junit4] 2> 344136 INFO (jetty-launcher-490-thread-1) [ ] o.a.s.c.c.ConnectionManager Client is connected to ZooKeeper
[junit4] 2> 344136 INFO (jetty-launcher-490-thread-2) [ ] o.a.s.c.c.SolrZkClient Using default ZkACLProvider
[junit4] 2> 344136 INFO (jetty-launcher-490-thread-1) [ ] o.a.s.c.c.SolrZkClient Using default ZkACLProvider
[junit4] 2> 344136 INFO (jetty-launcher-490-thread-2) [ ] o.a.s.s.SolrDispatchFilter solr.xml found in ZooKeeper. Loading...
[junit4] 2> 344136 INFO (jetty-launcher-490-thread-1) [ ] o.a.s.s.SolrDispatchFilter solr.xml found in ZooKeeper. Loading...
[junit4] 2> 344142 INFO (jetty-launcher-490-thread-1) [ ] o.a.s.c.CorePropertiesLocator Config-defined core root directory: /home/jenkins/workspace/Lucene-Solr-5.5-Linux/solr/build/solr-core/test/J2/temp/solr.schema.TestManagedSchemaAPI_7CCE63E3BAA527D4-001/tempDir-001/node1/.
[junit4] 2> 344142 INFO (jetty-launcher-490-thread-1) [ ] o.a.s.c.CoreContainer New CoreContainer 31607527
[junit4] 2> 344142 INFO (jetty-launcher-490-thread-1) [ ] o.a.s.c.CoreContainer Loading cores into CoreContainer [instanceDir=/home/jenkins/workspace/Lucene-Solr-5.5-Linux/solr/build/solr-core/test/J2/temp/solr.schema.TestManagedSchemaAPI_7CCE63E3BAA527D4-001/tempDir-001/node1]
[junit4] 2> 344142 INFO (jetty-launcher-490-thread-2) [ ] o.a.s.c.CorePropertiesLocator Config-defined core root directory: /home/jenkins/workspace/Lucene-Solr-5.5-Linux/solr/build/solr-core/test/J2/temp/solr.schema.TestManagedSchemaAPI_7CCE63E3BAA527D4-001/tempDir-001/node2/.
[junit4] 2> 344143 INFO (jetty-launcher-490-thread-2) [ ] o.a.s.c.CoreContainer New CoreContainer 844060
[junit4] 2> 344143 INFO (jetty-launcher-490-thread-2) [ ] o.a.s.c.CoreContainer Loading cores into CoreContainer [instanceDir=/home/jenkins/workspace/Lucene-Solr-5.5-Linux/solr/build/solr-core/test/J2/temp/solr.schema.TestManagedSchemaAPI_7CCE63E3BAA527D4-001/tempDir-001/node2]
[junit4] 2> 344143 WARN (jetty-launcher-490-thread-1) [ ] o.a.s.c.CoreContainer Couldn't add files from /home/jenkins/workspace/Lucene-Solr-5.5-Linux/solr/build/solr-core/test/J2/temp/solr.schema.TestManagedSchemaAPI_7CCE63E3BAA527D4-001/tempDir-001/node1/lib to classpath: /home/jenkins/workspace/Lucene-Solr-5.5-Linux/solr/build/solr-core/test/J2/temp/solr.schema.TestManagedSchemaAPI_7CCE63E3BAA527D4-001/tempDir-001/node1/lib
[junit4] 2> 344143 WARN (jetty-launcher-490-thread-2) [ ] o.a.s.c.CoreContainer Couldn't add files from /home/jenkins/workspace/Lucene-Solr-5.5-Linux/solr/build/solr-core/test/J2/temp/solr.schema.TestManagedSchemaAPI_7CCE63E3BAA527D4-001/tempDir-001/node2/lib to classpath: /home/jenkins/workspace/Lucene-Solr-5.5-Linux/solr/build/solr-core/test/J2/temp/solr.schema.TestManagedSchemaAPI_7CCE63E3BAA527D4-001/tempDir-001/node2/lib
[junit4] 2> 344143 INFO (jetty-launcher-490-thread-1) [ ] o.a.s.h.c.HttpShardHandlerFactory created with socketTimeout : 90000,urlScheme : ,connTimeout : 15000,maxConnectionsPerHost : 20,maxConnections : 10000,corePoolSize : 0,maximumPoolSize : 2147483647,maxThreadIdleTime : 5,sizeOfQueue : -1,fairnessPolicy : false,useRetries : false,connectionsEvictorSleepDelay : 5000,maxConnectionIdleTime : 40000,
[junit4] 2> 344143 INFO (jetty-launcher-490-thread-2) [ ] o.a.s.h.c.HttpShardHandlerFactory created with socketTimeout : 90000,urlScheme : ,connTimeout : 15000,maxConnectionsPerHost : 20,maxConnections : 10000,corePoolSize : 0,maximumPoolSize : 2147483647,maxThreadIdleTime : 5,sizeOfQueue : -1,fairnessPolicy : false,useRetries : false,connectionsEvictorSleepDelay : 5000,maxConnectionIdleTime : 40000,
[junit4] 2> 344144 INFO (jetty-launcher-490-thread-1) [ ] o.a.s.u.UpdateShardHandler Creating UpdateShardHandler HTTP client with params: socketTimeout=340000&connTimeout=45000&retry=true
[junit4] 2> 344144 INFO (jetty-launcher-490-thread-2) [ ] o.a.s.u.UpdateShardHandler Creating UpdateShardHandler HTTP client with params: socketTimeout=340000&connTimeout=45000&retry=true
[junit4] 2> 344145 INFO (jetty-launcher-490-thread-1) [ ] o.a.s.l.LogWatcher SLF4J impl is org.slf4j.impl.Log4jLoggerFactory
[junit4] 2> 344145 INFO (jetty-launcher-490-thread-1) [ ] o.a.s.l.LogWatcher Registering Log Listener [Log4j (org.slf4j.impl.Log4jLoggerFactory)]
[junit4] 2> 344145 INFO (jetty-launcher-490-thread-2) [ ] o.a.s.l.LogWatcher SLF4J impl is org.slf4j.impl.Log4jLoggerFactory
[junit4] 2> 344145 INFO (jetty-launcher-490-thread-2) [ ] o.a.s.l.LogWatcher Registering Log Listener [Log4j (org.slf4j.impl.Log4jLoggerFactory)]
[junit4] 2> 344145 INFO (jetty-launcher-490-thread-1) [ ] o.a.s.c.ZkContainer Zookeeper client=127.0.0.1:34221/solr
[junit4] 2> 344145 INFO (jetty-launcher-490-thread-1) [ ] o.a.s.c.ZkController zkHost includes chroot
[junit4] 2> 344145 INFO (jetty-launcher-490-thread-2) [ ] o.a.s.c.ZkContainer Zookeeper client=127.0.0.1:34221/solr
[junit4] 2> 344145 INFO (jetty-launcher-490-thread-1) [ ] o.a.s.c.c.SolrZkClient Using default ZkCredentialsProvider
[junit4] 2> 344145 INFO (jetty-launcher-490-thread-2) [ ] o.a.s.c.ZkController zkHost includes chroot
[junit4] 2> 344145 INFO (jetty-launcher-490-thread-2) [ ] o.a.s.c.c.SolrZkClient Using default ZkCredentialsProvider
[junit4] 2> 344146 INFO (jetty-launcher-490-thread-1) [ ] o.a.s.c.c.ConnectionManager Waiting for client to connect to ZooKeeper
[junit4] 2> 344146 INFO (jetty-launcher-490-thread-2) [ ] o.a.s.c.c.ConnectionManager Waiting for client to connect to ZooKeeper
[junit4] 2> 344146 INFO (zkCallback-498-thread-1) [ ] o.a.s.c.c.ConnectionManager Watcher org.apache.solr.common.cloud.ConnectionManager@130df27 name:ZooKeeperConnection Watcher:127.0.0.1:34221 got event WatchedEvent state:SyncConnected type:None path:null path:null type:None
[junit4] 2> 344146 INFO (jetty-launcher-490-thread-1) [ ] o.a.s.c.c.ConnectionManager Client is connected to ZooKeeper
[junit4] 2> 344147 INFO (zkCallback-499-thread-1) [ ] o.a.s.c.c.ConnectionManager Watcher org.apache.solr.common.cloud.ConnectionManager@10fbb5a name:ZooKeeperConnection Watcher:127.0.0.1:34221 got event WatchedEvent state:SyncConnected type:None path:null path:null type:None
[junit4] 2> 344147 INFO (jetty-launcher-490-thread-2) [ ] o.a.s.c.c.ConnectionManager Client is connected to ZooKeeper
[junit4] 2> 344147 INFO (jetty-launcher-490-thread-1) [ ] o.a.s.c.c.SolrZkClient Using default ZkACLProvider
[junit4] 2> 344147 INFO (jetty-launcher-490-thread-2) [ ] o.a.s.c.c.SolrZkClient Using default ZkACLProvider
[junit4] 2> 344148 INFO (jetty-launcher-490-thread-2) [n:127.0.0.1:34876_solr ] o.a.s.c.ZkController Added new OnReconnect listener org.apache.solr.cloud.ZkController$6@117aca7
[junit4] 2> 344148 WARN (NIOServerCxn.Factory:0.0.0.0/0.0.0.0:0) [ ] o.a.z.s.NIOServerCnxn caught end of stream exception
[junit4] 2> EndOfStreamException: Unable to read additional data from client sessionid 0x157061c988c0004, likely client has closed socket
[junit4] 2> at org.apache.zookeeper.server.NIOServerCnxn.doIO(NIOServerCnxn.java:228)
[junit4] 2> at org.apache.zookeeper.server.NIOServerCnxnFactory.run(NIOServerCnxnFactory.java:208)
[junit4] 2> at java.lang.Thread.run(Thread.java:745)
[junit4] 2> 344148 INFO (jetty-launcher-490-thread-1) [n:127.0.0.1:46489_solr ] o.a.s.c.ZkController Added new OnReconnect listener org.apache.solr.cloud.ZkController$6@19741f9
[junit4] 2> 344149 INFO (jetty-launcher-490-thread-2) [n:127.0.0.1:34876_solr ] o.a.s.c.c.ConnectionManager Waiting for client to connect to ZooKeeper
[junit4] 2> 344149 INFO (jetty-launcher-490-thread-1) [n:127.0.0.1:46489_solr ] o.a.s.c.c.ConnectionManager Waiting for client to connect to ZooKeeper
[junit4] 2> 344150 INFO (zkCallback-501-thread-1-processing-n:127.0.0.1:46489_solr) [n:127.0.0.1:46489_solr ] o.a.s.c.c.ConnectionManager Watcher org.apache.solr.common.cloud.ConnectionManager@1442e13 name:ZooKeeperConnection Watcher:127.0.0.1:34221/solr got event WatchedEvent state:SyncConnected type:None path:null path:null type:None
[junit4] 2> 344150 INFO (zkCallback-500-thread-1-processing-n:127.0.0.1:34876_solr) [n:127.0.0.1:34876_solr ] o.a.s.c.c.ConnectionManager Watcher org.apache.solr.common.cloud.ConnectionManager@1107055 name:ZooKeeperConnection Watcher:127.0.0.1:34221/solr got event WatchedEvent state:SyncConnected type:None path:null path:null type:None
[junit4] 2> 344150 INFO (jetty-launcher-490-thread-1) [n:127.0.0.1:46489_solr ] o.a.s.c.c.ConnectionManager Client is connected to ZooKeeper
[junit4] 2> 344150 INFO (jetty-launcher-490-thread-2) [n:127.0.0.1:34876_solr ] o.a.s.c.c.ConnectionManager Client is connected to ZooKeeper
[junit4] 2> 344156 INFO (jetty-launcher-490-thread-1) [n:127.0.0.1:46489_solr ] o.a.s.c.c.SolrZkClient makePath: /overseer/queue
[junit4] 2> 344156 INFO (jetty-launcher-490-thread-2) [n:127.0.0.1:34876_solr ] o.a.s.c.c.SolrZkClient makePath: /overseer/queue
[junit4] 2> 344157 INFO (jetty-launcher-490-thread-1) [n:127.0.0.1:46489_solr ] o.a.s.c.c.SolrZkClient makePath: /overseer/collection-queue-work
[junit4] 2> 344157 INFO (jetty-launcher-490-thread-2) [n:127.0.0.1:34876_solr ] o.a.s.c.c.SolrZkClient makePath: /overseer/collection-queue-work
[junit4] 2> 344159 INFO (jetty-launcher-490-thread-2) [n:127.0.0.1:34876_solr ] o.a.s.c.c.SolrZkClient makePath: /overseer/collection-map-running
[junit4] 2> 344159 INFO (jetty-launcher-490-thread-1) [n:127.0.0.1:46489_solr ] o.a.s.c.c.SolrZkClient makePath: /overseer/collection-map-running
[junit4] 2> 344161 INFO (jetty-launcher-490-thread-2) [n:127.0.0.1:34876_solr ] o.a.s.c.c.SolrZkClient makePath: /overseer/collection-map-completed
[junit4] 2> 344161 INFO (jetty-launcher-490-thread-1) [n:127.0.0.1:46489_solr ] o.a.s.c.c.SolrZkClient makePath: /overseer/collection-map-completed
[junit4] 2> 344162 INFO (jetty-launcher-490-thread-2) [n:127.0.0.1:34876_solr ] o.a.s.c.c.SolrZkClient makePath: /overseer/collection-map-failure
[junit4] 2> 344162 INFO (jetty-launcher-490-thread-1) [n:127.0.0.1:46489_solr ] o.a.s.c.c.SolrZkClient makePath: /overseer/collection-map-failure
[junit4] 2> 344163 INFO (jetty-launcher-490-thread-2) [n:127.0.0.1:34876_solr ] o.a.s.c.c.SolrZkClient makePath: /live_nodes
[junit4] 2> 344165 INFO (jetty-launcher-490-thread-1) [n:127.0.0.1:46489_solr ] o.a.s.c.c.SolrZkClient makePath: /live_nodes
[junit4] 2> 344165 INFO (jetty-launcher-490-thread-1) [n:127.0.0.1:46489_solr ] o.a.s.c.c.SolrZkClient makePath: /collections
[junit4] 2> 344165 INFO (jetty-launcher-490-thread-2) [n:127.0.0.1:34876_solr ] o.a.s.c.c.SolrZkClient makePath: /collections
[junit4] 2> 344166 INFO (jetty-launcher-490-thread-2) [n:127.0.0.1:34876_solr ] o.a.s.c.c.SolrZkClient makePath: /aliases.json
[junit4] 2> 344167 INFO (jetty-launcher-490-thread-2) [n:127.0.0.1:34876_solr ] o.a.s.c.c.SolrZkClient makePath: /clusterstate.json
[junit4] 2> 344167 INFO (jetty-launcher-490-thread-2) [n:127.0.0.1:34876_solr ] o.a.s.c.c.SolrZkClient makePath: /security.json
[junit4] 2> 344168 INFO (jetty-launcher-490-thread-2) [n:127.0.0.1:34876_solr ] o.a.s.c.ZkController Register node as live in ZooKeeper:/live_nodes/127.0.0.1:34876_solr
[junit4] 2> 344168 INFO (jetty-launcher-490-thread-2) [n:127.0.0.1:34876_solr ] o.a.s.c.c.SolrZkClient makePath: /live_nodes/127.0.0.1:34876_solr
[junit4] 2> 344169 INFO (jetty-launcher-490-thread-2) [n:127.0.0.1:34876_solr ] o.a.s.c.c.SolrZkClient makePath: /overseer_elect
[junit4] 2> 344169 INFO (jetty-launcher-490-thread-1) [n:127.0.0.1:46489_solr ] o.a.s.c.ZkController Register node as live in ZooKeeper:/live_nodes/127.0.0.1:46489_solr
[junit4] 2> 344169 INFO (jetty-launcher-490-thread-1) [n:127.0.0.1:46489_solr ] o.a.s.c.c.SolrZkClient makePath: /live_nodes/127.0.0.1:46489_solr
[junit4] 2> 344169 INFO (jetty-launcher-490-thread-2) [n:127.0.0.1:34876_solr ] o.a.s.c.c.SolrZkClient makePath: /overseer_elect/election
[junit4] 2> 344170 INFO (jetty-launcher-490-thread-1) [n:127.0.0.1:46489_solr ] o.a.s.c.Overseer Overseer (id=null) closing
[junit4] 2> 344170 INFO (jetty-launcher-490-thread-2) [n:127.0.0.1:34876_solr ] o.a.s.c.Overseer Overseer (id=null) closing
[junit4] 2> 344170 INFO (jetty-launcher-490-thread-2) [n:127.0.0.1:34876_solr ] o.a.s.c.LeaderElector Joined leadership election with path: /overseer_elect/election/96552636899917829-127.0.0.1:34876_solr-n_0000000000
[junit4] 2> 344171 INFO (jetty-launcher-490-thread-2) [n:127.0.0.1:34876_solr ] o.a.s.c.OverseerElectionContext I am going to be the leader 127.0.0.1:34876_solr
[junit4] 2> 344171 INFO (jetty-launcher-490-thread-2) [n:127.0.0.1:34876_solr ] o.a.s.c.c.SolrZkClient makePath: /overseer_elect/leader
[junit4] 2> 344178 INFO (jetty-launcher-490-thread-1) [n:127.0.0.1:46489_solr ] o.a.s.c.LeaderElector Joined leadership election with path: /overseer_elect/election/96552636899917830-127.0.0.1:46489_solr-n_0000000001
[junit4] 2> 344179 INFO (jetty-launcher-490-thread-2) [n:127.0.0.1:34876_solr ] o.a.s.c.Overseer Overseer (id=96552636899917829-127.0.0.1:34876_solr-n_0000000000) starting
[junit4] 2> 344179 INFO (jetty-launcher-490-thread-1) [n:127.0.0.1:46489_solr ] o.a.s.c.LeaderElector Watching path /overseer_elect/election/96552636899917829-127.0.0.1:34876_solr-n_0000000000 to know if I could be the leader
[junit4] 2> 344179 INFO (jetty-launcher-490-thread-1) [n:127.0.0.1:46489_solr ] o.a.s.c.c.ZkStateReader Updating cluster state from ZooKeeper...
[junit4] 2> 344181 INFO (jetty-launcher-490-thread-2) [n:127.0.0.1:34876_solr ] o.a.s.c.c.SolrZkClient makePath: /overseer/queue-work
[junit4] 2> 344183 INFO (jetty-launcher-490-thread-2) [n:127.0.0.1:34876_solr ] o.a.s.c.OverseerAutoReplicaFailoverThread Starting OverseerAutoReplicaFailoverThread autoReplicaFailoverWorkLoopDelay=10000 autoReplicaFailoverWaitAfterExpiration=30000 autoReplicaFailoverBadNodeExpiration=60000
[junit4] 2> 344184 INFO (jetty-launcher-490-thread-2) [n:127.0.0.1:34876_solr ] o.a.s.c.c.ZkStateReader Updating cluster state from ZooKeeper...
[junit4] 2> 344184 INFO (OverseerCollectionConfigSetProcessor-96552636899917829-127.0.0.1:34876_solr-n_0000000000) [n:127.0.0.1:34876_solr ] o.a.s.c.OverseerTaskProcessor Process current queue of overseer operations
[junit4] 2> 344184 INFO (OverseerStateUpdate-96552636899917829-127.0.0.1:34876_solr-n_0000000000) [n:127.0.0.1:34876_solr ] o.a.s.c.Overseer Starting to work on the main queue
[junit4] 2> 344192 INFO (jetty-launcher-490-thread-1) [n:127.0.0.1:46489_solr ] o.a.s.c.CoreContainer Security conf doesn't exist. Skipping setup for authorization module.
[junit4] 2> 344192 INFO (jetty-launcher-490-thread-1) [n:127.0.0.1:46489_solr ] o.a.s.c.CoreContainer No authentication plugin used.
[junit4] 2> 344193 INFO (jetty-launcher-490-thread-1) [n:127.0.0.1:46489_solr ] o.a.s.c.CorePropertiesLocator Looking for core definitions underneath /home/jenkins/workspace/Lucene-Solr-5.5-Linux/solr/build/solr-core/test/J2/temp/solr.schema.TestManagedSchemaAPI_7CCE63E3BAA527D4-001/tempDir-001/node1/.
[junit4] 2> 344193 INFO (jetty-launcher-490-thread-1) [n:127.0.0.1:46489_solr ] o.a.s.c.CorePropertiesLocator Found 0 core definitions
[junit4] 2> 344193 INFO (jetty-launcher-490-thread-1) [n:127.0.0.1:46489_solr ] o.a.s.s.SolrDispatchFilter user.dir=/home/jenkins/workspace/Lucene-Solr-5.5-Linux/solr/build/solr-core/test/J2
[junit4] 2> 344193 INFO (jetty-launcher-490-thread-1) [n:127.0.0.1:46489_solr ] o.a.s.s.SolrDispatchFilter SolrDispatchFilter.init() done
[junit4] 2> 344197 INFO (jetty-launcher-490-thread-2) [n:127.0.0.1:34876_solr ] o.a.s.c.CoreContainer Security conf doesn't exist. Skipping setup for authorization module.
[junit4] 2> 344197 INFO (jetty-launcher-490-thread-2) [n:127.0.0.1:34876_solr ] o.a.s.c.CoreContainer No authentication plugin used.
[junit4] 2> 344197 INFO (jetty-launcher-490-thread-2) [n:127.0.0.1:34876_solr ] o.a.s.c.CorePropertiesLocator Looking for core definitions underneath /home/jenkins/workspace/Lucene-Solr-5.5-Linux/solr/build/solr-core/test/J2/temp/solr.schema.TestManagedSchemaAPI_7CCE63E3BAA527D4-001/tempDir-001/node2/.
[junit4] 2> 344198 INFO (jetty-launcher-490-thread-2) [n:127.0.0.1:34876_solr ] o.a.s.c.CorePropertiesLocator Found 0 core definitions
[junit4] 2> 344198 INFO (jetty-launcher-490-thread-2) [n:127.0.0.1:34876_solr ] o.a.s.s.SolrDispatchFilter user.dir=/home/jenkins/workspace/Lucene-Solr-5.5-Linux/solr/build/solr-core/test/J2
[junit4] 2> 344198 INFO (jetty-launcher-490-thread-2) [n:127.0.0.1:34876_solr ] o.a.s.s.SolrDispatchFilter SolrDispatchFilter.init() done
[junit4] 2> 344198 INFO (TEST-TestManagedSchemaAPI.test-seed#[7CCE63E3BAA527D4]) [ ] o.a.s.c.c.SolrZkClient Using default ZkCredentialsProvider
[junit4] 2> 344199 INFO (TEST-TestManagedSchemaAPI.test-seed#[7CCE63E3BAA527D4]) [ ] o.a.s.c.c.ConnectionManager Waiting for client to connect to ZooKeeper
[junit4] 2> 344199 INFO (zkCallback-502-thread-1) [ ] o.a.s.c.c.ConnectionManager Watcher org.apache.solr.common.cloud.ConnectionManager@177f883 name:ZooKeeperConnection Watcher:127.0.0.1:34221 got event WatchedEvent state:SyncConnected type:None path:null path:null type:None
[junit4] 2> 344199 INFO (TEST-TestManagedSchemaAPI.test-seed#[7CCE63E3BAA527D4]) [ ] o.a.s.c.c.ConnectionManager Client is connected to ZooKeeper
[junit4] 2> 344200 INFO (TEST-TestManagedSchemaAPI.test-seed#[7CCE63E3BAA527D4]) [ ] o.a.s.c.c.SolrZkClient Using default ZkACLProvider
[junit4] 2> 344201 INFO (TEST-TestManagedSchemaAPI.test-seed#[7CCE63E3BAA527D4]) [ ] o.a.s.c.c.SolrZkClient Using default ZkCredentialsProvider
[junit4] 2> 344201 INFO (TEST-TestManagedSchemaAPI.test-seed#[7CCE63E3BAA527D4]) [ ] o.a.s.c.c.ConnectionManager Waiting for client to connect to ZooKeeper
[junit4] 2> 344201 INFO (zkCallback-504-thread-1) [ ] o.a.s.c.c.ConnectionManager Watcher org.apache.solr.common.cloud.ConnectionManager@16a16ab name:ZooKeeperConnection Watcher:127.0.0.1:34221/solr got event WatchedEvent state:SyncConnected type:None path:null path:null type:None
[junit4] 2> 344201 INFO (TEST-TestManagedSchemaAPI.test-seed#[7CCE63E3BAA527D4]) [ ] o.a.s.c.c.ConnectionManager Client is connected to ZooKeeper
[junit4] 2> 344202 INFO (TEST-TestManagedSchemaAPI.test-seed#[7CCE63E3BAA527D4]) [ ] o.a.s.c.c.SolrZkClient Using default ZkACLProvider
[junit4] 2> 344202 INFO (TEST-TestManagedSchemaAPI.test-seed#[7CCE63E3BAA527D4]) [ ] o.a.s.c.c.SolrZkClient makePath: /configs/conf1/solrconfig.xml
[junit4] 2> 344204 INFO (TEST-TestManagedSchemaAPI.test-seed#[7CCE63E3BAA527D4]) [ ] o.a.s.c.c.SolrZkClient makePath: /configs/conf1/managed-schema
[junit4] 2> 344205 INFO (TEST-TestManagedSchemaAPI.test-seed#[7CCE63E3BAA527D4]) [ ] o.a.s.c.c.SolrZkClient Using default ZkCredentialsProvider
[junit4] 2> 344205 INFO (TEST-TestManagedSchemaAPI.test-seed#[7CCE63E3BAA527D4]) [ ] o.a.s.c.c.ConnectionManager Waiting for client to connect to ZooKeeper
[junit4] 2> 344206 INFO (zkCallback-505-thread-1) [ ] o.a.s.c.c.ConnectionManager Watcher org.apache.solr.common.cloud.ConnectionManager@1821a1f name:ZooKeeperConnection Watcher:127.0.0.1:34221/solr got event WatchedEvent state:SyncConnected type:None path:null path:null type:None
[junit4] 2> 344206 INFO (TEST-TestManagedSchemaAPI.test-seed#[7CCE63E3BAA527D4]) [ ] o.a.s.c.c.ConnectionManager Client is connected to ZooKeeper
[junit4] 2> 344206 INFO (TEST-TestManagedSchemaAPI.test-seed#[7CCE63E3BAA527D4]) [ ] o.a.s.c.c.SolrZkClient Using default ZkACLProvider
[junit4] 2> 344206 INFO (TEST-TestManagedSchemaAPI.test-seed#[7CCE63E3BAA527D4]) [ ] o.a.s.c.c.ZkStateReader Updating cluster state from ZooKeeper...
[junit4] 2> 344210 INFO (qtp7445847-3623) [n:127.0.0.1:34876_solr ] o.a.s.h.a.CollectionsHandler Invoked Collection Action :create with params replicationFactor=2&collection.configName=conf1&name=testschemaapi&action=CREATE&numShards=1&wt=javabin&version=2 and sendToOCPQueue=true
[junit4] 2> 344211 INFO (OverseerCollectionConfigSetProcessor-96552636899917829-127.0.0.1:34876_solr-n_0000000000) [n:127.0.0.1:34876_solr ] o.a.s.c.OverseerTaskProcessor Overseer Collection Message Handler: Get the message id:/overseer/collection-queue-work/qn-0000000000 message:{
[junit4] 2> "name":"testschemaapi",
[junit4] 2> "fromApi":"true",
[junit4] 2> "replicationFactor":"2",
[junit4] 2> "collection.configName":"conf1",
[junit4] 2> "numShards":"1",
[junit4] 2> "stateFormat":"2",
[junit4] 2> "operation":"create"}
[junit4] 2> 344212 INFO (OverseerThreadFactory-1554-thread-1-processing-n:127.0.0.1:34876_solr) [n:127.0.0.1:34876_solr ] o.a.s.c.OverseerCollectionMessageHandler OverseerCollectionMessageHandler.processMessage : create , {
[junit4] 2> "name":"testschemaapi",
[junit4] 2> "fromApi":"true",
[junit4] 2> "replicationFactor":"2",
[junit4] 2> "collection.configName":"conf1",
[junit4] 2> "numShards":"1",
[junit4] 2> "stateFormat":"2",
[junit4] 2> "operation":"create"}
[junit4] 2> 344212 INFO (OverseerThreadFactory-1554-thread-1-processing-n:127.0.0.1:34876_solr) [n:127.0.0.1:34876_solr ] o.a.s.c.OverseerCollectionMessageHandler Create collection testschemaapi
[junit4] 2> 344212 INFO (OverseerThreadFactory-1554-thread-1-processing-n:127.0.0.1:34876_solr) [n:127.0.0.1:34876_solr ] o.a.s.c.OverseerCollectionMessageHandler creating collections conf node /collections/testschemaapi
[junit4] 2> 344212 INFO (OverseerThreadFactory-1554-thread-1-processing-n:127.0.0.1:34876_solr) [n:127.0.0.1:34876_solr ] o.a.s.c.c.SolrZkClient makePath: /collections/testschemaapi
[junit4] 2> 344213 INFO (zkCallback-500-thread-1-processing-n:127.0.0.1:34876_solr) [n:127.0.0.1:34876_solr ] o.a.s.c.c.ZkStateReader A collections change: [WatchedEvent state:SyncConnected type:NodeChildrenChanged path:/collections], has occurred - updating...
[junit4] 2> 344213 INFO (zkCallback-505-thread-1) [ ] o.a.s.c.c.ZkStateReader A collections change: [WatchedEvent state:SyncConnected type:NodeChildrenChanged path:/collections], has occurred - updating...
[junit4] 2> 344213 INFO (zkCallback-501-thread-1-processing-n:127.0.0.1:46489_solr) [n:127.0.0.1:46489_solr ] o.a.s.c.c.ZkStateReader A collections change: [WatchedEvent state:SyncConnected type:NodeChildrenChanged path:/collections], has occurred - updating...
[junit4] 2> 344215 INFO (OverseerStateUpdate-96552636899917829-127.0.0.1:34876_solr-n_0000000000) [n:127.0.0.1:34876_solr ] o.a.s.c.Overseer processMessage: queueSize: 1, message = {
[junit4] 2> "name":"testschemaapi",
[junit4] 2> "fromApi":"true",
[junit4] 2> "replicationFactor":"2",
[junit4] 2> "collection.configName":"conf1",
[junit4] 2> "numShards":"1",
[junit4] 2> "stateFormat":"2",
[junit4] 2> "operation":"create"} current state version: 0
[junit4] 2> 344215 INFO (OverseerStateUpdate-96552636899917829-127.0.0.1:34876_solr-n_0000000000) [n:127.0.0.1:34876_solr ] o.a.s.c.o.ClusterStateMutator building a new cName: testschemaapi
[junit4] 2> 344216 INFO (OverseerStateUpdate-96552636899917829-127.0.0.1:34876_solr-n_0000000000) [n:127.0.0.1:34876_solr ] o.a.s.c.o.ZkStateWriter going to create_collection /collections/testschemaapi/state.json
[junit4] 2> 344316 INFO (OverseerThreadFactory-1554-thread-1-processing-n:127.0.0.1:34876_solr) [n:127.0.0.1:34876_solr ] o.a.s.c.OverseerCollectionMessageHandler Creating SolrCores for new collection testschemaapi, shardNames [shard1] , replicationFactor : 2
[junit4] 2> 344316 INFO (OverseerThreadFactory-1554-thread-1-processing-n:127.0.0.1:34876_solr) [n:127.0.0.1:34876_solr ] o.a.s.c.OverseerCollectionMessageHandler Creating core testschemaapi_shard1_replica1 as part of shard shard1 of collection testschemaapi on 127.0.0.1:34876_solr
[junit4] 2> 344316 INFO (OverseerThreadFactory-1554-thread-1-processing-n:127.0.0.1:34876_solr) [n:127.0.0.1:34876_solr ] o.a.s.c.OverseerCollectionMessageHandler Creating core testschemaapi_shard1_replica2 as part of shard shard1 of collection testschemaapi on 127.0.0.1:46489_solr
[junit4] 2> 344318 INFO (qtp7445847-3610) [n:127.0.0.1:34876_solr ] o.a.s.h.a.CoreAdminOperation core create command qt=/admin/cores&collection.configName=conf1&name=testschemaapi_shard1_replica1&action=CREATE&numShards=1&collection=testschemaapi&shard=shard1&wt=javabin&version=2
[junit4] 2> 344318 INFO (qtp4455438-3602) [n:127.0.0.1:46489_solr ] o.a.s.h.a.CoreAdminOperation core create command qt=/admin/cores&collection.configName=conf1&name=testschemaapi_shard1_replica2&action=CREATE&numShards=1&collection=testschemaapi&shard=shard1&wt=javabin&version=2
[junit4] 2> 344318 INFO (qtp4455438-3602) [n:127.0.0.1:46489_solr ] o.a.s.c.CoreDescriptor Created CoreDescriptor: {name=testschemaapi_shard1_replica2, collection.configName=conf1, config=solrconfig.xml, transient=false, schema=schema.xml, loadOnStartup=true, configSetProperties=configsetprops.json, collection=testschemaapi, numShards=1, dataDir=data/, shard=shard1}
[junit4] 2> 344318 INFO (qtp7445847-3610) [n:127.0.0.1:34876_solr ] o.a.s.c.CoreDescriptor Created CoreDescriptor: {name=testschemaapi_shard1_replica1, collection.configName=conf1, config=solrconfig.xml, transient=false, schema=schema.xml, loadOnStartup=true, configSetProperties=configsetprops.json, collection=testschemaapi, numShards=1, dataDir=data/, shard=shard1}
[junit4] 2> 344319 INFO (qtp7445847-3610) [n:127.0.0.1:34876_solr c:testschemaapi s:shard1 x:testschemaapi_shard1_replica1] o.a.s.c.ZkController publishing state=down
[junit4] 2> 344319 INFO (qtp4455438-3602) [n:127.0.0.1:46489_solr c:testschemaapi s:shard1 x:testschemaapi_shard1_replica2] o.a.s.c.ZkController publishing state=down
[junit4] 2> 344320 INFO (qtp7445847-3610) [n:127.0.0.1:34876_solr c:testschemaapi s:shard1 x:testschemaapi_shard1_replica1] o.a.s.c.ZkController Registering watch for collection testschemaapi
[junit4] 2> 344320 INFO (qtp4455438-3602) [n:127.0.0.1:46489_solr c:testschemaapi s:shard1 x:testschemaapi_shard1_replica2] o.a.s.c.ZkController Registering watch for collection testschemaapi
[junit4] 2> 344320 INFO (qtp7445847-3610) [n:127.0.0.1:34876_solr c:testschemaapi s:shard1 x:testschemaapi_shard1_replica1] o.a.s.c.c.ZkStateReader addZkWatch [testschemaapi]
[junit4] 2> 344320 INFO (qtp4455438-3602) [n:127.0.0.1:46489_solr c:testschemaapi s:shard1 x:testschemaapi_shard1_replica2] o.a.s.c.c.ZkStateReader addZkWatch [testschemaapi]
[junit4] 2> 344320 INFO (OverseerStateUpdate-96552636899917829-127.0.0.1:34876_solr-n_0000000000) [n:127.0.0.1:34876_solr ] o.a.s.c.Overseer processMessage: queueSize: 2, message = {
[junit4] 2> "core":"testschemaapi_shard1_replica1",
[junit4] 2> "roles":null,
[junit4] 2> "base_url":"http://127.0.0.1:34876/solr",
[junit4] 2> "node_name":"127.0.0.1:34876_solr",
[junit4] 2> "numShards":"1",
[junit4] 2> "state":"down",
[junit4] 2> "shard":"shard1",
[junit4] 2> "collection":"testschemaapi",
[junit4] 2> "operation":"state"} current state version: 0
[junit4] 2> 344320 INFO (qtp7445847-3610) [n:127.0.0.1:34876_solr c:testschemaapi s:shard1 x:testschemaapi_shard1_replica1] o.a.s.c.c.ZkStateReader Add data for [testschemaapi] ver [0]
[junit4] 2> 344320 INFO (qtp4455438-3602) [n:127.0.0.1:46489_solr c:testschemaapi s:shard1 x:testschemaapi_shard1_replica2] o.a.s.c.c.ZkStateReader Add data for [testschemaapi] ver [0]
[junit4] 2> 344320 INFO (qtp7445847-3610) [n:127.0.0.1:34876_solr c:testschemaapi s:shard1 x:testschemaapi_shard1_replica1] o.a.s.c.ZkController look for our core node name
[junit4] 2> 344320 INFO (qtp4455438-3602) [n:127.0.0.1:46489_solr c:testschemaapi s:shard1 x:testschemaapi_shard1_replica2] o.a.s.c.ZkController look for our core node name
[junit4] 2> 344320 INFO (OverseerStateUpdate-96552636899917829-127.0.0.1:34876_solr-n_0000000000) [n:127.0.0.1:34876_solr ] o.a.s.c.o.ReplicaMutator Update state numShards=1 message={
[junit4] 2> "core":"testschemaapi_shard1_replica1",
[junit4] 2> "roles":null,
[junit4] 2> "base_url":"http://127.0.0.1:34876/solr",
[junit4] 2> "node_name":"127.0.0.1:34876_solr",
[junit4] 2> "numShards":"1",
[junit4] 2> "state":"down",
[junit4] 2> "shard":"shard1",
[junit4] 2> "collection":"testschemaapi",
[junit4] 2> "operation":"state"}
[junit4] 2> 344321 INFO (OverseerStateUpdate-96552636899917829-127.0.0.1:34876_solr-n_0000000000) [n:127.0.0.1:34876_solr ] o.a.s.c.Overseer processMessage: queueSize: 1, message = {
[junit4] 2> "core":"testschemaapi_shard1_replica2",
[junit4] 2> "roles":null,
[junit4] 2> "base_url":"http://127.0.0.1:46489/solr",
[junit4] 2> "node_name":"127.0.0.1:46489_solr",
[junit4] 2> "numShards":"1",
[junit4] 2> "state":"down",
[junit4] 2> "shard":"shard1",
[junit4] 2> "collection":"testschemaapi",
[junit4] 2> "operation":"state"} current state version: 0
[junit4] 2> 344321 INFO (OverseerStateUpdate-96552636899917829-127.0.0.1:34876_solr-n_0000000000) [n:127.0.0.1:34876_solr ] o.a.s.c.o.ReplicaMutator Update state numShards=1 message={
[junit4] 2> "core":"testschemaapi_shard1_replica2",
[junit4] 2> "roles":null,
[junit4] 2> "base_url":"http://127.0.0.1:46489/solr",
[junit4] 2> "node_name":"127.0.0.1:46489_solr",
[junit4] 2> "numShards":"1",
[junit4] 2> "state":"down",
[junit4] 2> "shard":"shard1",
[junit4] 2> "collection":"testschemaapi",
[junit4] 2> "operation":"state"}
[junit4] 2> 344422 INFO (OverseerStateUpdate-96552636899917829-127.0.0.1:34876_solr-n_0000000000) [n:127.0.0.1:34876_solr ] o.a.s.c.o.ZkStateWriter going to update_collection /collections/testschemaapi/state.json version: 0
[junit4] 2> 344422 INFO (zkCallback-500-thread-1-processing-n:127.0.0.1:34876_solr) [n:127.0.0.1:34876_solr ] o.a.s.c.c.ZkStateReader A cluster state change: [WatchedEvent state:SyncConnected type:NodeDataChanged path:/collections/testschemaapi/state.json] for collection [testschemaapi] has occurred - updating... (live nodes size: [2])
[junit4] 2> 344422 INFO (zkCallback-501-thread-1-processing-n:127.0.0.1:46489_solr) [n:127.0.0.1:46489_solr ] o.a.s.c.c.ZkStateReader A cluster state change: [WatchedEvent state:SyncConnected type:NodeDataChanged path:/collections/testschemaapi/state.json] for collection [testschemaapi] has occurred - updating... (live nodes size: [2])
[junit4] 2> 344422 INFO (zkCallback-500-thread-1-processing-n:127.0.0.1:34876_solr) [n:127.0.0.1:34876_solr ] o.a.s.c.c.ZkStateReader Updating data for [testschemaapi] from [0] to [1]
[junit4] 2> 344422 INFO (zkCallback-501-thread-1-processing-n:127.0.0.1:46489_solr) [n:127.0.0.1:46489_solr ] o.a.s.c.c.ZkStateReader Updating data for [testschemaapi] from [0] to [1]
[junit4] 2> 345320 INFO (qtp7445847-3610) [n:127.0.0.1:34876_solr c:testschemaapi s:shard1 x:testschemaapi_shard1_replica1] o.a.s.c.ZkController waiting to find shard id in clusterstate for testschemaapi_shard1_replica1
[junit4] 2> 345320 INFO (qtp4455438-3602) [n:127.0.0.1:46489_solr c:testschemaapi s:shard1 x:testschemaapi_shard1_replica2] o.a.s.c.ZkController waiting to find shard id in clusterstate for testschemaapi_shard1_replica2
[junit4] 2> 345320 INFO (qtp7445847-3610) [n:127.0.0.1:34876_solr c:testschemaapi s:shard1 x:testschemaapi_shard1_replica1] o.a.s.c.ZkController Check for collection zkNode:testschemaapi
[junit4] 2> 345320 INFO (qtp4455438-3602) [n:127.0.0.1:46489_solr c:testschemaapi s:shard1 x:testschemaapi_shard1_replica2] o.a.s.c.ZkController Check for collection zkNode:testschemaapi
[junit4] 2> 345320 INFO (qtp7445847-3610) [n:127.0.0.1:34876_solr c:testschemaapi s:shard1 x:testschemaapi_shard1_replica1] o.a.s.c.ZkController Collection zkNode exists
[junit4] 2> 345320 INFO (qtp4455438-3602) [n:127.0.0.1:46489_solr c:testschemaapi s:shard1 x:testschemaapi_shard1_replica2] o.a.s.c.ZkController Collection zkNode exists
[junit4] 2> 345321 INFO (qtp7445847-3610) [n:127.0.0.1:34876_solr c:testschemaapi s:shard1 x:testschemaapi_shard1_replica1] o.a.s.c.c.ZkStateReader Load collection config from: [/collections/testschemaapi]
[junit4] 2> 345321 INFO (qtp4455438-3602) [n:127.0.0.1:46489_solr c:testschemaapi s:shard1 x:testschemaapi_shard1_replica2] o.a.s.c.c.ZkStateReader Load collection config from: [/collections/testschemaapi]
[junit4] 2> 345321 INFO (qtp4455438-3602) [n:127.0.0.1:46489_solr c:testschemaapi s:shard1 x:testschemaapi_shard1_replica2] o.a.s.c.c.ZkStateReader path=[/collections/testschemaapi] [configName]=[conf1] specified config exists in ZooKeeper
[junit4] 2> 345321 INFO (qtp7445847-3610) [n:127.0.0.1:34876_solr c:testschemaapi s:shard1 x:testschemaapi_shard1_replica1] o.a.s.c.c.ZkStateReader path=[/collections/testschemaapi] [configName]=[conf1] specified config exists in ZooKeeper
[junit4] 2> 345321 INFO (qtp4455438-3602) [n:127.0.0.1:46489_solr c:testschemaapi s:shard1 x:testschemaapi_shard1_replica2] o.a.s.c.SolrResourceLoader new SolrResourceLoader for directory: '/home/jenkins/workspace/Lucene-Solr-5.5-Linux/solr/build/solr-core/test/J2/temp/solr.schema.TestManagedSchemaAPI_7CCE63E3BAA527D4-001/tempDir-001/node1/testschemaapi_shard1_replica2'
[junit4] 2> 345321 INFO (qtp7445847-3610) [n:127.0.0.1:34876_solr c:testschemaapi s:shard1 x:testschemaapi_shard1_replica1] o.a.s.c.SolrResourceLoader new SolrResourceLoader for directory: '/home/jenkins/workspace/Lucene-Solr-5.5-Linux/solr/build/solr-core/test/J2/temp/solr.schema.TestManagedSchemaAPI_7CCE63E3BAA527D4-001/tempDir-001/node2/testschemaapi_shard1_replica1'
[junit4] 2> 345321 INFO (qtp4455438-3602) [n:127.0.0.1:46489_solr c:testschemaapi s:shard1 x:testschemaapi_shard1_replica2] o.a.s.c.SolrResourceLoader JNDI not configured for solr (NoInitialContextEx)
[junit4] 2> 345321 INFO (qtp7445847-3610) [n:127.0.0.1:34876_solr c:testschemaapi s:shard1 x:testschemaapi_shard1_replica1] o.a.s.c.SolrResourceLoader JNDI not configured for solr (NoInitialContextEx)
[junit4] 2> 345321 INFO (qtp4455438-3602) [n:127.0.0.1:46489_solr c:testschemaapi s:shard1 x:testschemaapi_shard1_replica2] o.a.s.c.SolrResourceLoader solr home defaulted to 'solr/' (could not find system property or JNDI)
[junit4] 2> 345321 INFO (qtp7445847-3610) [n:127.0.0.1:34876_solr c:testschemaapi s:shard1 x:testschemaapi_shard1_replica1] o.a.s.c.SolrResourceLoader solr home defaulted to 'solr/' (could not find system property or JNDI)
[junit4] 2> 345322 INFO (qtp4455438-3602) [n:127.0.0.1:46489_solr c:testschemaapi s:shard1 x:testschemaapi_shard1_replica2] o.a.s.c.Config loaded config solrconfig.xml with version 0
[junit4] 2> 345322 INFO (qtp7445847-3610) [n:127.0.0.1:34876_solr c:testschemaapi s:shard1 x:testschemaapi_shard1_replica1] o.a.s.c.Config loaded config solrconfig.xml with version 0
[junit4] 2> 345325 INFO (qtp4455438-3602) [n:127.0.0.1:46489_solr c:testschemaapi s:shard1 x:testschemaapi_shard1_replica2] o.a.s.c.SolrConfig current version of requestparams : -1
[junit4] 2> 345325 INFO (qtp7445847-3610) [n:127.0.0.1:34876_solr c:testschemaapi s:shard1 x:testschemaapi_shard1_replica1] o.a.s.c.SolrConfig current version of requestparams : -1
[junit4] 2> 345326 INFO (qtp4455438-3602) [n:127.0.0.1:46489_solr c:testschemaapi s:shard1 x:testschemaapi_shard1_replica2] o.a.s.c.SolrConfig Using Lucene MatchVersion: 5.5.3
[junit4] 2> 345326 INFO (qtp7445847-3610) [n:127.0.0.1:34876_solr c:testschemaapi s:shard1 x:testschemaapi_shard1_replica1] o.a.s.c.SolrConfig Using Lucene MatchVersion: 5.5.3
[junit4] 2> 345329 INFO (qtp4455438-3602) [n:127.0.0.1:46489_solr c:testschemaapi s:shard1 x:testschemaapi_shard1_replica2] o.a.s.c.SolrConfig Loaded SolrConfig: solrconfig.xml
[junit4] 2> 345329 INFO (qtp7445847-3610) [n:127.0.0.1:34876_solr c:testschemaapi s:shard1 x:testschemaapi_shard1_replica1] o.a.s.c.SolrConfig Loaded SolrConfig: solrconfig.xml
[junit4] 2> 345332 INFO (qtp4455438-3602) [n:127.0.0.1:46489_solr c:testschemaapi s:shard1 x:testschemaapi_shard1_replica2] o.a.s.s.IndexSchema [testschemaapi_shard1_replica2] Schema name=minimal
[junit4] 2> 345332 INFO (qtp7445847-3610) [n:127.0.0.1:34876_solr c:testschemaapi s:shard1 x:testschemaapi_shard1_replica1] o.a.s.s.IndexSchema [testschemaapi_shard1_replica1] Schema name=minimal
[junit4] 2> 345333 INFO (qtp4455438-3602) [n:127.0.0.1:46489_solr c:testschemaapi s:shard1 x:testschemaapi_shard1_replica2] o.a.s.s.IndexSchema unique key field: id
[junit4] 2> 345333 INFO (qtp7445847-3610) [n:127.0.0.1:34876_solr c:testschemaapi s:shard1 x:testschemaapi_shard1_replica1] o.a.s.s.IndexSchema unique key field: id
[junit4] 2> 345334 INFO (qtp4455438-3602) [n:127.0.0.1:46489_solr c:testschemaapi s:shard1 x:testschemaapi_shard1_replica2] o.a.s.c.ConfigSetProperties Did not find ConfigSet properties, assuming default properties: Can't find resource 'configsetprops.json' in classpath or '/configs/conf1', cwd=/home/jenkins/workspace/Lucene-Solr-5.5-Linux/solr/build/solr-core/test/J2
[junit4] 2> 345334 INFO (qtp7445847-3610) [n:127.0.0.1:34876_solr c:testschemaapi s:shard1 x:testschemaapi_shard1_replica1] o.a.s.c.ConfigSetProperties Did not find ConfigSet properties, assuming default properties: Can't find resource 'configsetprops.json' in classpath or '/configs/conf1', cwd=/home/jenkins/workspace/Lucene-Solr-5.5-Linux/solr/build/solr-core/test/J2
[junit4] 2> 345334 INFO (qtp4455438-3602) [n:127.0.0.1:46489_solr c:testschemaapi s:shard1 x:testschemaapi_shard1_replica2] o.a.s.c.CoreContainer Creating SolrCore 'testschemaapi_shard1_replica2' using configuration from collection testschemaapi
[junit4] 2> 345334 INFO (qtp7445847-3610) [n:127.0.0.1:34876_solr c:testschemaapi s:shard1 x:testschemaapi_shard1_replica1] o.a.s.c.CoreContainer Creating SolrCore 'testschemaapi_shard1_replica1' using configuration from collection testschemaapi
[junit4] 2> 345334 INFO (qtp7445847-3610) [n:127.0.0.1:34876_solr c:testschemaapi s:shard1 r:core_node1 x:testschemaapi_shard1_replica1] o.a.s.c.SolrCore org.apache.solr.core.MockDirectoryFactory
[junit4] 2> 345334 INFO (qtp4455438-3602) [n:127.0.0.1:46489_solr c:testschemaapi s:shard1 r:core_node2 x:testschemaapi_shard1_replica2] o.a.s.c.SolrCore org.apache.solr.core.MockDirectoryFactory
[junit4] 2> 345334 INFO (qtp7445847-3610) [n:127.0.0.1:34876_solr c:testschemaapi s:shard1 r:core_node1 x:testschemaapi_shard1_replica1] o.a.s.c.SolrCore [[testschemaapi_shard1_replica1] ] Opening new SolrCore at [/home/jenkins/workspace/Lucene-Solr-5.5-Linux/solr/build/solr-core/test/J2/temp/solr.schema.TestManagedSchemaAPI_7CCE63E3BAA527D4-001/tempDir-001/node2/testschemaapi_shard1_replica1], dataDir=[/home/jenkins/workspace/Lucene-Solr-5.5-Linux/solr/build/solr-core/test/J2/temp/solr.schema.TestManagedSchemaAPI_7CCE63E3BAA527D4-001/tempDir-001/node2/./testschemaapi_shard1_replica1/data/]
[junit4] 2> 345334 INFO (qtp4455438-3602) [n:127.0.0.1:46489_solr c:testschemaapi s:shard1 r:core_node2 x:testschemaapi_shard1_replica2] o.a.s.c.SolrCore [[testschemaapi_shard1_replica2] ] Opening new SolrCore at [/home/jenkins/workspace/Lucene-Solr-5.5-Linux/solr/build/solr-core/test/J2/temp/solr.schema.TestManagedSchemaAPI_7CCE63E3BAA527D4-001/tempDir-001/node1/testschemaapi_shard1_replica2], dataDir=[/home/jenkins/workspace/Lucene-Solr-5.5-Linux/solr/build/solr-core/test/J2/temp/solr.schema.TestManagedSchemaAPI_7CCE63E3BAA527D4-001/tempDir-001/node1/./testschemaapi_shard1_replica2/data/]
[junit4] 2> 345334 INFO (qtp7445847-3610) [n:127.0.0.1:34876_solr c:testschemaapi s:shard1 r:core_node1 x:testschemaapi_shard1_replica1] o.a.s.c.SolrCore JMX monitoring not detected for core: testschemaapi_shard1_replica1
[junit4] 2> 345334 INFO (qtp4455438-3602) [n:127.0.0.1:46489_solr c:testschemaapi s:shard1 r:core_node2 x:testschemaapi_shard1_replica2] o.a.s.c.SolrCore JMX monitoring not detected for core: testschemaapi_shard1_replica2
[junit4] 2> 345335 INFO (qtp7445847-3610) [n:127.0.0.1:34876_solr c:testschemaapi s:shard1 r:core_node1 x:testschemaapi_shard1_replica1] o.a.s.c.CachingDirectoryFactory return new directory for /home/jenkins/workspace/Lucene-Solr-5.5-Linux/solr/build/solr-core/test/J2/temp/solr.schema.TestManagedSchemaAPI_7CCE63E3BAA527D4-001/tempDir-001/node2/./testschemaapi_shard1_replica1/data
[junit4] 2> 345335 INFO (qtp4455438-3602) [n:127.0.0.1:46489_solr c:testschemaapi s:shard1 r:core_node2 x:testschemaapi_shard1_replica2] o.a.s.c.CachingDirectoryFactory return new directory for /home/jenkins/workspace/Lucene-Solr-5.5-Linux/solr/build/solr-core/test/J2/temp/solr.schema.TestManagedSchemaAPI_7CCE63E3BAA527D4-001/tempDir-001/node1/./testschemaapi_shard1_replica2/data
[junit4] 2> 345335 INFO (qtp7445847-3610) [n:127.0.0.1:34876_solr c:testschemaapi s:shard1 r:core_node1 x:testschemaapi_shard1_replica1] o.a.s.c.SolrCore New index directory detected: old=null new=/home/jenkins/workspace/Lucene-Solr-5.5-Linux/solr/build/solr-core/test/J2/temp/solr.schema.TestManagedSchemaAPI_7CCE63E3BAA527D4-001/tempDir-001/node2/./testschemaapi_shard1_replica1/data/index/
[junit4] 2> 345336 INFO (qtp4455438-3602) [n:127.0.0.1:46489_solr c:testschemaapi s:shard1 r:core_node2 x:testschemaapi_shard1_replica2] o.a.s.c.SolrCore New index directory detected: old=null new=/home/jenkins/workspace/Lucene-Solr-5.5-Linux/solr/build/solr-core/test/J2/temp/solr.schema.TestManagedSchemaAPI_7CCE63E3BAA527D4-001/tempDir-001/node1/./testschemaapi_shard1_replica2/data/index/
[junit4] 2> 345336 WARN (qtp7445847-3610) [n:127.0.0.1:34876_solr c:testschemaapi s:shard1 r:core_node1 x:testschemaapi_shard1_replica1] o.a.s.c.SolrCore [testschemaapi_shard1_replica1] Solr index directory '/home/jenkins/workspace/Lucene-Solr-5.5-Linux/solr/build/solr-core/test/J2/temp/solr.schema.TestManagedSchemaAPI_7CCE63E3BAA527D4-001/tempDir-001/node2/./testschemaapi_shard1_replica1/data/index' doesn't exist. Creating new index...
[junit4] 2> 345336 WARN (qtp4455438-3602) [n:127.0.0.1:46489_solr c:testschemaapi s:shard1 r:core_node2 x:testschemaapi_shard1_replica2] o.a.s.c.SolrCore [testschemaapi_shard1_replica2] Solr index directory '/home/jenkins/workspace/Lucene-Solr-5.5-Linux/solr/build/solr-core/test/J2/temp/solr.schema.TestManagedSchemaAPI_7CCE63E3BAA527D4-001/tempDir-001/node1/./testschemaapi_shard1_replica2/data/index' doesn't exist. Creating new index...
[junit4] 2> 345336 INFO (qtp7445847-3610) [n:127.0.0.1:34876_solr c:testschemaapi s:shard1 r:core_node1 x:testschemaapi_shard1_replica1] o.a.s.c.CachingDirectoryFactory return new directory for /home/jenkins/workspace/Lucene-Solr-5.5-Linux/solr/build/solr-core/test/J2/temp/solr.schema.TestManagedSchemaAPI_7CCE63E3BAA527D4-001/tempDir-001/node2/./testschemaapi_shard1_replica1/data/index
[junit4] 2> 345337 INFO (qtp4455438-3602) [n:127.0.0.1:46489_solr c:testschemaapi s:shard1 r:core_node2 x:testschemaapi_shard1_replica2] o.a.s.c.CachingDirectoryFactory return new directory for /home/jenkins/workspace/Lucene-Solr-5.5-Linux/solr/build/solr-core/test/J2/temp/solr.schema.TestManagedSchemaAPI_7CCE63E3BAA527D4-001/tempDir-001/node1/./testschemaapi_shard1_replica2/data/index
[junit4] 2> 345337 INFO (qtp4455438-3602) [n:127.0.0.1:46489_solr c:testschemaapi s:shard1 r:core_node2 x:testschemaapi_shard1_replica2] o.a.s.c.SolrDeletionPolicy SolrDeletionPolicy.onCommit: commits: num=1
[junit4] 2> commit{dir=MockDirectoryWrapper(RAMDirectory@1c6de42 lockFactory=org.apache.lucene.store.SingleInstanceLockFactory@fd830b),segFN=segments_1,generation=1}
[junit4] 2> 345337 INFO (qtp4455438-3602) [n:127.0.0.1:46489_solr c:testschemaapi s:shard1 r:core_node2 x:testschemaapi_shard1_replica2] o.a.s.c.SolrDeletionPolicy newest commit generation = 1
[junit4] 2> 345337 INFO (qtp7445847-3610) [n:127.0.0.1:34876_solr c:testschemaapi s:shard1 r:core_node1 x:testschemaapi_shard1_replica1] o.a.s.c.SolrDeletionPolicy SolrDeletionPolicy.onCommit: commits: num=1
[junit4] 2> commit{dir=MockDirectoryWrapper(RAMDirectory@1f4eb5b lockFactory=org.apache.lucene.store.SingleInstanceLockFactory@1e209b6),segFN=segments_1,generation=1}
[junit4] 2> 345337 INFO (qtp7445847-3610) [n:127.0.0.1:34876_solr c:testschemaapi s:shard1 r:core_node1 x:testschemaapi_shard1_replica1] o.a.s.c.SolrDeletionPolicy newest commit generation = 1
[junit4] 2> 345337 INFO (OldIndexDirectoryCleanupThreadForCore-testschemaapi_shard1_replica2) [n:127.0.0.1:46489_solr c:testschemaapi s:shard1 r:core_node2 x:testschemaapi_shard1_replica2] o.a.s.c.SolrCore Looking for old index directories to cleanup for core testschemaapi_shard1_replica2 in /home/jenkins/workspace/Lucene-Solr-5.5-Linux/solr/build/solr-core/test/J2/temp/solr.schema.TestManagedSchemaAPI_7CCE63E3BAA527D4-001/tempDir-001/node1/./testschemaapi_shard1_replica2/data/
[junit4] 2> 345337 INFO (OldIndexDirectoryCleanupThreadForCore-testschemaapi_shard1_replica1) [n:127.0.0.1:34876_solr c:testschemaapi s:shard1 r:core_node1 x:testschemaapi_shard1_replica1] o.a.s.c.SolrCore Looking for old index directories to cleanup for core testschemaapi_shard1_replica1 in /home/jenkins/workspace/Lucene-Solr-5.5-Linux/solr/build/solr-core/test/J2/temp/solr.schema.TestManagedSchemaAPI_7CCE63E3BAA527D4-001/tempDir-001/node2/./testschemaapi_shard1_replica1/data/
[junit4] 2> 345337 WARN (OldIndexDirectoryCleanupThreadForCore-testschemaapi_shard1_replica2) [n:127.0.0.1:46489_solr c:testschemaapi s:shard1 r:core_node2 x:testschemaapi_shard1_replica2] o.a.s.c.DirectoryFactory /home/jenkins/workspace/Lucene-Solr-5.5-Linux/solr/build/solr-core/test/J2/temp/solr.schema.TestManagedSchemaAPI_7CCE63E3BAA527D4-001/tempDir-001/node1/./testschemaapi_shard1_replica2/data/ does not point to a valid data directory; skipping clean-up of old index directories.
[junit4] 2> 345337 WARN (OldIndexDirectoryCleanupThreadForCore-testschemaapi_shard1_replica1) [n:127.0.0.1:34876_solr c:testschemaapi s:shard1 r:core_node1 x:testschemaapi_shard1_replica1] o.a.s.c.DirectoryFactory /home/jenkins/workspace/Lucene-Solr-5.5-Linux/solr/build/solr-core/test/J2/temp/solr.schema.TestManagedSchemaAPI_7CCE63E3BAA527D4-001/tempDir-001/node2/./testschemaapi_shard1_replica1/data/ does not point to a valid data directory; skipping clean-up of old index directories.
[junit4] 2> 345338 INFO (qtp4455438-3602) [n:127.0.0.1:46489_solr c:testschemaapi s:shard1 r:core_node2 x:testschemaapi_shard1_replica2] o.a.s.c.SolrCore no updateRequestProcessorChain defined as default, creating implicit default
[junit4] 2> 345338 INFO (qtp7445847-3610) [n:127.0.0.1:34876_solr c:testschemaapi s:shard1 r:core_node1 x:testschemaapi_shard1_replica1] o.a.s.c.SolrCore no updateRequestProcessorChain defined as default, creating implicit default
[junit4] 2> 345339 INFO (qtp7445847-3610) [n:127.0.0.1:34876_solr c:testschemaapi s:shard1 r:core_node1 x:testschemaapi_shard1_replica1] o.a.s.h.l.XMLLoader xsltCacheLifetimeSeconds=60
[junit4] 2> 345339 INFO (qtp4455438-3602) [n:127.0.0.1:46489_solr c:testschemaapi s:shard1 r:core_node2 x:testschemaapi_shard1_replica2] o.a.s.h.l.XMLLoader xsltCacheLifetimeSeconds=60
[junit4] 2> 345340 INFO (qtp7445847-3610) [n:127.0.0.1:34876_solr c:testschemaapi s:shard1 r:core_node1 x:testschemaapi_shard1_replica1] o.a.s.h.l.XMLLoader xsltCacheLifetimeSeconds=60
[junit4] 2> 345340 INFO (qtp4455438-3602) [n:127.0.0.1:46489_solr c:testschemaapi s:shard1 r:core_node2 x:testschemaapi_shard1_replica2] o.a.s.h.l.XMLLoader xsltCacheLifetimeSeconds=60
[junit4] 2> 345340 INFO (qtp7445847-3610) [n:127.0.0.1:34876_solr c:testschemaapi s:shard1 r:core_node1 x:testschemaapi_shard1_replica1] o.a.s.h.l.XMLLoader xsltCacheLifetimeSeconds=60
[junit4] 2> 345340 INFO (qtp4455438-3602) [n:127.0.0.1:46489_solr c:testschemaapi s:shard1 r:core_node2 x:testschemaapi_shard1_replica2] o.a.s.h.l.XMLLoader xsltCacheLifetimeSeconds=60
[junit4] 2> 345341 INFO (qtp7445847-3610) [n:127.0.0.1:34876_solr c:testschemaapi s:shard1 r:core_node1 x:testschemaapi_shard1_replica1] o.a.s.h.l.XMLLoader xsltCacheLifetimeSeconds=60
[junit4] 2> 345341 INFO (qtp4455438-3602) [n:127.0.0.1:46489_solr c:testschemaapi s:shard1 r:core_node2 x:testschemaapi_shard1_replica2] o.a.s.h.l.XMLLoader xsltCacheLifetimeSeconds=60
[junit4] 2> 345341 INFO (qtp7445847-3610) [n:127.0.0.1:34876_solr c:testschemaapi s:shard1 r:core_node1 x:testschemaapi_shard1_replica1] o.a.s.c.RequestHandlers Registered paths: /admin/mbeans,/update/csv,/update/json/docs,/admin/luke,/select,/admin/segments,/get,/admin/system,/replication,/admin/properties,/config,/schema,/admin/plugins,/admin/logging,/update/json,/admin/threads,/admin/ping,/update,/admin/file
[junit4] 2> 345341 INFO (qtp4455438-3602) [n:127.0.0.1:46489_solr c:testschemaapi s:shard1 r:core_node2 x:testschemaapi_shard1_replica2] o.a.s.c.RequestHandlers Registered paths: /admin/mbeans,/update/csv,/update/json/docs,/admin/luke,/select,/admin/segments,/get,/admin/system,/replication,/admin/properties,/config,/schema,/admin/plugins,/admin/logging,/update/json,/admin/threads,/admin/ping,/update,/admin/file
[junit4] 2> 345341 INFO (qtp7445847-3610) [n:127.0.0.1:34876_solr c:testschemaapi s:shard1 r:core_node1 x:testschemaapi_shard1_replica1] o.a.s.c.SolrCore Using default statsCache cache: org.apache.solr.search.stats.LocalStatsCache
[junit4] 2> 345341 INFO (qtp4455438-3602) [n:127.0.0.1:46489_solr c:testschemaapi s:shard1 r:core_node2 x:testschemaapi_shard1_replica2] o.a.s.c.SolrCore Using default statsCache cache: org.apache.solr.search.stats.LocalStatsCache
[junit4] 2> 345342 INFO (qtp7445847-3610) [n:127.0.0.1:34876_solr c:testschemaapi s:shard1 r:core_node1 x:testschemaapi_shard1_replica1] o.a.s.u.UpdateHandler Using UpdateLog implementation: org.apache.solr.update.UpdateLog
[junit4] 2> 345342 INFO (qtp7445847-3610) [n:127.0.0.1:34876_solr c:testschemaapi s:shard1 r:core_node1 x:testschemaapi_shard1_replica1] o.a.s.u.UpdateLog Initializing UpdateLog: dataDir=null defaultSyncLevel=FLUSH numRecordsToKeep=100 maxNumLogsToKeep=10 numVersionBuckets=65536
[junit4] 2> 345342 INFO (qtp4455438-3602) [n:127.0.0.1:46489_solr c:testschemaapi s:shard1 r:core_node2 x:testschemaapi_shard1_replica2] o.a.s.u.UpdateHandler Using UpdateLog implementation: org.apache.solr.update.UpdateLog
[junit4] 2> 345342 INFO (qtp4455438-3602) [n:127.0.0.1:46489_solr c:testschemaapi s:shard1 r:core_node2 x:testschemaapi_shard1_replica2] o.a.s.u.UpdateLog Initializing UpdateLog: dataDir=null defaultSyncLevel=FLUSH numRecordsToKeep=100 maxNumLogsToKeep=10 numVersionBuckets=65536
[junit4] 2> 345342 INFO (qtp7445847-3610) [n:127.0.0.1:34876_solr c:testschemaapi s:shard1 r:core_node1 x:testschemaapi_shard1_replica1] o.a.s.u.CommitTracker Hard AutoCommit: disabled
[junit4] 2> 345342 INFO (qtp4455438-3602) [n:127.0.0.1:46489_solr c:testschemaapi s:shard1 r:core_node2 x:testschemaapi_shard1_replica2] o.a.s.u.CommitTracker Hard AutoCommit: disabled
[junit4] 2> 345342 INFO (qtp7445847-3610) [n:127.0.0.1:34876_solr c:testschemaapi s:shard1 r:core_node1 x:testschemaapi_shard1_replica1] o.a.s.u.CommitTracker Soft AutoCommit: disabled
[junit4] 2> 345342 INFO (qtp4455438-3602) [n:127.0.0.1:46489_solr c:testschemaapi s:shard1 r:core_node2 x:testschemaapi_shard1_replica2] o.a.s.u.CommitTracker Soft AutoCommit: disabled
[junit4] 2> 345343 INFO (qtp7445847-3610) [n:127.0.0.1:34876_solr c:testschemaapi s:shard1 r:core_node1 x:testschemaapi_shard1_replica1] o.a.s.c.SolrDeletionPolicy SolrDeletionPolicy.onInit: commits: num=1
[junit4] 2> commit{dir=MockDirectoryWrapper(RAMDirectory@1f4eb5b lockFactory=org.apache.lucene.store.SingleInstanceLockFactory@1e209b6),segFN=segments_1,generation=1}
[junit4] 2> 345343 INFO (qtp4455438-3602) [n:127.0.0.1:46489_solr c:testschemaapi s:shard1 r:core_node2 x:testschemaapi_shard1_replica2] o.a.s.c.SolrDeletionPolicy SolrDeletionPolicy.onInit: commits: num=1
[junit4] 2> commit{dir=MockDirectoryWrapper(RAMDirectory@1c6de42 lockFactory=org.apache.lucene.store.SingleInstanceLockFactory@fd830b),segFN=segments_1,generation=1}
[junit4] 2> 345343 INFO (qtp4455438-3602) [n:127.0.0.1:46489_solr c:testschemaapi s:shard1 r:core_node2 x:testschemaapi_shard1_replica2] o.a.s.c.SolrDeletionPolicy newest commit generation = 1
[junit4] 2> 345343 INFO (qtp7445847-3610) [n:127.0.0.1:34876_solr c:testschemaapi s:shard1 r:core_node1 x:testschemaapi_shard1_replica1] o.a.s.c.SolrDeletionPolicy newest commit generation = 1
[junit4] 2> 345343 INFO (qtp4455438-3602) [n:127.0.0.1:46489_solr c:testschemaapi s:shard1 r:core_node2 x:testschemaapi_shard1_replica2] o.a.s.s.SolrIndexSearcher Opening Searcher@b25fcd[testschemaapi_shard1_replica2] main
[junit4] 2> 345343 INFO (qtp7445847-3610) [n:127.0.0.1:34876_solr c:testschemaapi s:shard1 r:core_node1 x:testschemaapi_shard1_replica1] o.a.s.s.SolrIndexSearcher Opening Searcher@1fb9297[testschemaapi_shard1_replica1] main
[junit4] 2> 345343 INFO (qtp4455438-3602) [n:127.0.0.1:46489_solr c:testschemaapi s:shard1 r:core_node2 x:testschemaapi_shard1_replica2] o.a.s.c.c.ZkStateReader Load collection config from: [/collections/testschemaapi]
[junit4] 2> 345343 INFO (qtp7445847-3610) [n:127.0.0.1:34876_solr c:testschemaapi s:shard1 r:core_node1 x:testschemaapi_shard1_replica1] o.a.s.c.c.ZkStateReader Load collection config from: [/collections/testschemaapi]
[junit4] 2> 345343 INFO (qtp4455438-3602) [n:127.0.0.1:46489_solr c:testschemaapi s:shard1 r:core_node2 x:testschemaapi_shard1_replica2] o.a.s.c.c.ZkStateReader path=[/collections/testschemaapi] [configName]=[conf1] specified config exists in ZooKeeper
[junit4] 2> 345343 INFO (qtp4455438-3602) [n:127.0.0.1:46489_solr c:testschemaapi s:shard1 r:core_node2 x:testschemaapi_shard1_replica2] o.a.s.r.ManagedResourceStorage Setting up ZooKeeper-based storage for the RestManager with znodeBase: /configs/conf1
[junit4] 2> 345343 INFO (qtp7445847-3610) [n:127.0.0.1:34876_solr c:testschemaapi s:shard1 r:core_node1 x:testschemaapi_shard1_replica1] o.a.s.c.c.ZkStateReader path=[/collections/testschemaapi] [configName]=[conf1] specified config exists in ZooKeeper
[junit4] 2> 345343 INFO (qtp7445847-3610) [n:127.0.0.1:34876_solr c:testschemaapi s:shard1 r:core_node1 x:testschemaapi_shard1_replica1] o.a.s.r.ManagedResourceStorage Setting up ZooKeeper-based storage for the RestManager with znodeBase: /configs/conf1
[junit4] 2> 345343 INFO (qtp4455438-3602) [n:127.0.0.1:46489_solr c:testschemaapi s:shard1 r:core_node2 x:testschemaapi_shard1_replica2] o.a.s.r.ManagedResourceStorage Configured ZooKeeperStorageIO with znodeBase: /configs/conf1
[junit4] 2> 345343 INFO (qtp4455438-3602) [n:127.0.0.1:46489_solr c:testschemaapi s:shard1 r:core_node2 x:testschemaapi_shard1_replica2] o.a.s.r.RestManager Initializing RestManager with initArgs: {}
[junit4] 2> 345343 INFO (qtp7445847-3610) [n:127.0.0.1:34876_solr c:testschemaapi s:shard1 r:core_node1 x:testschemaapi_shard1_replica1] o.a.s.r.ManagedResourceStorage Configured ZooKeeperStorageIO with znodeBase: /configs/conf1
[junit4] 2> 345343 INFO (qtp4455438-3602) [n:127.0.0.1:46489_solr c:testschemaapi s:shard1 r:core_node2 x:testschemaapi_shard1_replica2] o.a.s.r.ManagedResourceStorage Reading _rest_managed.json using ZooKeeperStorageIO:path=/configs/conf1
[junit4] 2> 345343 INFO (qtp7445847-3610) [n:127.0.0.1:34876_solr c:testschemaapi s:shard1 r:core_node1 x:testschemaapi_shard1_replica1] o.a.s.r.RestManager Initializing RestManager with initArgs: {}
[junit4] 2> 345344 INFO (qtp7445847-3610) [n:127.0.0.1:34876_solr c:testschemaapi s:shard1 r:core_node1 x:testschemaapi_shard1_replica1] o.a.s.r.ManagedResourceStorage Reading _rest_managed.json using ZooKeeperStorageIO:path=/configs/conf1
[junit4] 2> 345344 INFO (qtp4455438-3602) [n:127.0.0.1:46489_solr c:testschemaapi s:shard1 r:core_node2 x:testschemaapi_shard1_replica2] o.a.s.r.ManagedResourceStorage No data found for znode /configs/conf1/_rest_managed.json
[junit4] 2> 345344 INFO (qtp4455438-3602) [n:127.0.0.1:46489_solr c:testschemaapi s:shard1 r:core_node2 x:testschemaapi_shard1_replica2] o.a.s.r.ManagedResourceStorage Loaded null at path _rest_managed.json using ZooKeeperStorageIO:path=/configs/conf1
[junit4] 2> 345344 INFO (qtp4455438-3602) [n:127.0.0.1:46489_solr c:testschemaapi s:shard1 r:core_node2 x:testschemaapi_shard1_replica2] o.a.s.r.RestManager Initializing 0 registered ManagedResources
[junit4] 2> 345344 INFO (qtp7445847-3610) [n:127.0.0.1:34876_solr c:testschemaapi s:shard1 r:core_node1 x:testschemaapi_shard1_replica1] o.a.s.r.ManagedResourceStorage No data found for znode /configs/conf1/_rest_managed.json
[junit4] 2> 345344 INFO (qtp7445847-3610) [n:127.0.0.1:34876_solr c:testschemaapi s:shard1 r:core_node1 x:testschemaapi_shard1_replica1] o.a.s.r.ManagedResourceStorage Loaded null at path _rest_managed.json using ZooKeeperStorageIO:path=/configs/conf1
[junit4] 2> 345344 INFO (qtp7445847-3610) [n:127.0.0.1:34876_solr c:testschemaapi s:shard1 r:core_node1 x:testschemaapi_shard1_replica1] o.a.s.r.RestManager Initializing 0 registered ManagedResources
[junit4] 2> 345345 INFO (qtp7445847-3610) [n:127.0.0.1:34876_solr c:testschemaapi s:shard1 r:core_node1 x:testschemaapi_shard1_replica1] o.a.s.s.ZkIndexSchemaReader Creating ZooKeeper watch for the managed schema at /configs/conf1/managed-schema
[junit4] 2> 345345 INFO (qtp4455438-3602) [n:127.0.0.1:46489_solr c:testschemaapi s:shard1 r:core_node2 x:testschemaapi_shard1_replica2] o.a.s.s.ZkIndexSchemaReader Creating ZooKeeper watch for the managed schema at /configs/conf1/managed-schema
[junit4] 2> 345346 INFO (qtp4455438-3602) [n:127.0.0.1:46489_solr c:testschemaapi s:shard1 r:core_node2 x:testschemaapi_shard1_replica2] o.a.s.c.ZkController Added new OnReconnect listener ZkIndexSchemaReader: /configs/conf1/managed-schema, uniqueCoreId: testschemaapi_shard1_replica2:195491227195959
[junit4] 2> 345346 INFO (qtp7445847-3610) [n:127.0.0.1:34876_solr c:testschemaapi s:shard1 r:core_node1 x:testschemaapi_shard1_replica1] o.a.s.c.ZkController Added new OnReconnect listener ZkIndexSchemaReader: /configs/conf1/managed-schema, uniqueCoreId: testschemaapi_shard1_replica1:195491227224197
[junit4] 2> 345346 INFO (qtp4455438-3602) [n:127.0.0.1:46489_solr c:testschemaapi s:shard1 r:core_node2 x:testschemaapi_shard1_replica2] o.a.s.h.ReplicationHandler Commits will be reserved for 10000
[junit4] 2> 345346 INFO (qtp7445847-3610) [n:127.0.0.1:34876_solr c:testschemaapi s:shard1 r:core_node1 x:testschemaapi_shard1_replica1] o.a.s.h.ReplicationHandler Commits will be reserved for 10000
[junit4] 2> 345347 INFO (searcherExecutor-1559-thread-1-processing-n:127.0.0.1:46489_solr x:testschemaapi_shard1_replica2 s:shard1 c:testschemaapi r:core_node2) [n:127.0.0.1:46489_solr c:testschemaapi s:shard1 r:core_node2 x:testschemaapi_shard1_replica2] o.a.s.c.SolrCore [testschemaapi_shard1_replica2] Registered new searcher Searcher@b25fcd[testschemaapi_shard1_replica2] main{ExitableDirectoryReader(UninvertingDirectoryReader())}
[junit4] 2> 345347 INFO (searcherExecutor-1560-thread-1-processing-n:127.0.0.1:34876_solr x:testschemaapi_shard1_replica1 s:shard1 c:testschemaapi r:core_node1) [n:127.0.0.1:34876_solr c:testschemaapi s:shard1 r:core_node1 x:testschemaapi_shard1_replica1] o.a.s.c.SolrCore [testschemaapi_shard1_replica1] Registered new searcher Searcher@1fb9297[testschemaapi_shard1_replica1] main{ExitableDirectoryReader(UninvertingDirectoryReader())}
[junit4] 2> 345347 INFO (qtp4455438-3602) [n:127.0.0.1:46489_solr c:testschemaapi s:shard1 r:core_node2 x:testschemaapi_shard1_replica2] o.a.s.u.UpdateLog Looking up max value of version field to seed version buckets
[junit4] 2> 345347 INFO (qtp7445847-3610) [n:127.0.0.1:34876_solr c:testschemaapi s:shard1 r:core_node1 x:testschemaapi_shard1_replica1] o.a.s.u.UpdateLog Looking up max value of version field to seed version buckets
[junit4] 2> 345347 INFO (qtp4455438-3602) [n:127.0.0.1:46489_solr c:testschemaapi s:shard1 r:core_node2 x:testschemaapi_shard1_replica2] o.a.s.u.VersionInfo Refreshing highest value of _version_ for 65536 version buckets from index
[junit4] 2> 345347 INFO (qtp7445847-3610) [n:127.0.0.1:34876_solr c:testschemaapi s:shard1 r:core_node1 x:testschemaapi_shard1_replica1] o.a.s.u.VersionInfo Refreshing highest value of _version_ for 65536 version buckets from index
[junit4] 2> 345347 INFO (qtp4455438-3602) [n:127.0.0.1:46489_solr c:testschemaapi s:shard1 r:core_node2 x:testschemaapi_shard1_replica2] o.a.s.u.VersionInfo No terms found for _version_, cannot seed version bucket highest value from index
[junit4] 2> 345347 INFO (qtp7445847-3610) [n:127.0.0.1:34876_solr c:testschemaapi s:shard1 r:core_node1 x:testschemaapi_shard1_replica1] o.a.s.u.VersionInfo No terms found for _version_, cannot seed version bucket highest value from index
[junit4] 2> 345347 INFO (qtp4455438-3602) [n:127.0.0.1:46489_solr c:testschemaapi s:shard1 r:core_node2 x:testschemaapi_shard1_replica2] o.a.s.u.UpdateLog Could not find max version in index or recent updates, using new clock 1544842191782805504
[junit4] 2> 345347 INFO (qtp7445847-3610) [n:127.0.0.1:34876_solr c:testschemaapi s:shard1 r:core_node1 x:testschemaapi_shard1_replica1] o.a.s.u.UpdateLog Could not find max version in index or recent updates, using new clock 1544842191782805504
[junit4] 2> 345349 INFO (qtp4455438-3602) [n:127.0.0.1:46489_solr c:testschemaapi s:shard1 r:core_node2 x:testschemaapi_shard1_replica2] o.a.s.u.UpdateLog Took 2.0ms to seed version buckets with highest version 1544842191782805504
[junit4] 2> 345349 INFO (qtp7445847-3610) [n:127.0.0.1:34876_solr c:testschemaapi s:shard1 r:core_node1 x:testschemaapi_shard1_replica1] o.a.s.u.UpdateLog Took 2.0ms to seed version buckets with highest version 1544842191782805504
[junit4] 2> 345349 INFO (qtp4455438-3602) [n:127.0.0.1:46489_solr c:testschemaapi s:shard1 r:core_node2 x:testschemaapi_shard1_replica2] o.a.s.c.ZkController watch zkdir /configs/conf1
[junit4] 2> 345349 INFO (qtp7445847-3610) [n:127.0.0.1:34876_solr c:testschemaapi s:shard1 r:core_node1 x:testschemaapi_shard1_replica1] o.a.s.c.ZkController watch zkdir /configs/conf1
[junit4] 2> 345349 INFO (qtp7445847-3610) [n:127.0.0.1:34876_solr c:testschemaapi s:shard1 r:core_node1 x:testschemaapi_shard1_replica1] o.a.s.c.CoreContainer registering core: testschemaapi_shard1_replica1
[junit4] 2> 345349 INFO (qtp4455438-3602) [n:127.0.0.1:46489_solr c:testschemaapi s:shard1 r:core_node2 x:testschemaapi_shard1_replica2] o.a.s.c.CoreContainer registering core: testschemaapi_shard1_replica2
[junit4] 2> 345349 INFO (qtp7445847-3610) [n:127.0.0.1:34876_solr c:testschemaapi s:shard1 r:core_node1 x:testschemaapi_shard1_replica1] o.a.s.c.ZkController Register replica - core:testschemaapi_shard1_replica1 address:http://127.0.0.1:34876/solr collection:testschemaapi shard:shard1
[junit4] 2> 345349 INFO (qtp4455438-3602) [n:127.0.0.1:46489_solr c:testschemaapi s:shard1 r:core_node2 x:testschemaapi_shard1_replica2] o.a.s.c.ZkController Register replica - core:testschemaapi_shard1_replica2 address:http://127.0.0.1:46489/solr collection:testschemaapi shard:shard1
[junit4] 2> 345350 INFO (qtp4455438-3602) [n:127.0.0.1:46489_solr c:testschemaapi s:shard1 r:core_node2 x:testschemaapi_shard1_replica2] o.a.s.c.c.SolrZkClient makePath: /collections/testschemaapi/leader_elect/shard1/election
[junit4] 2> 345350 INFO (qtp7445847-3610) [n:127.0.0.1:34876_solr c:testschemaapi s:shard1 r:core_node1 x:testschemaapi_shard1_replica1] o.a.s.c.c.SolrZkClient makePath: /collections/testschemaapi/leader_elect/shard1/election
[junit4] 2> 345351 INFO (qtp4455438-3602) [n:127.0.0.1:46489_solr c:testschemaapi s:shard1 r:core_node2 x:testschemaapi_shard1_replica2] o.a.s.c.LeaderElector Joined leadership election with path: /collections/testschemaapi/leader_elect/shard1/election/96552636899917830-core_node2-n_0000000000
[junit4] 2> 345351 INFO (qtp7445847-3610) [n:127.0.0.1:34876_solr c:testschemaapi s:shard1 r:core_node1 x:testschemaapi_shard1_replica1] o.a.s.c.LeaderElector Joined leadership election with path: /collections/testschemaapi/leader_elect/shard1/election/96552636899917829-core_node1-n_0000000001
[junit4] 2> 345351 INFO (qtp4455438-3602) [n:127.0.0.1:46489_solr c:testschemaapi s:shard1 r:core_node2 x:testschemaapi_shard1_replica2] o.a.s.c.ShardLeaderElectionContext Running the leader process for shard=shard1 and weAreReplacement=false and leaderVoteWait=10000
[junit4] 2> 345351 INFO (qtp7445847-3610) [n:127.0.0.1:34876_solr c:testschemaapi s:shard1 r:core_node1 x:testschemaapi_shard1_replica1] o.a.s.c.LeaderElector Watching path /collections/testschemaapi/leader_elect/shard1/election/96552636899917830-core_node2-n_0000000000 to know if I could be the leader
[junit4] 2> 345352 INFO (qtp4455438-3602) [n:127.0.0.1:46489_solr c:testschemaapi s:shard1 r:core_node2 x:testschemaapi_shard1_replica2] o.a.s.c.ShardLeaderElectionContext Enough replicas found to continue.
[junit4] 2> 345352 INFO (qtp4455438-3602) [n:127.0.0.1:46489_solr c:testschemaapi s:shard1 r:core_node2 x:testschemaapi_shard1_replica2] o.a.s.c.ShardLeaderElectionContext I may be the new leader - try and sync
[junit4] 2> 345352 INFO (qtp4455438-3602) [n:127.0.0.1:46489_solr c:testschemaapi s:shard1 r:core_node2 x:testschemaapi_shard1_replica2] o.a.s.c.SyncStrategy Sync replicas to http://127.0.0.1:46489/solr/testschemaapi_shard1_replica2/
[junit4] 2> 345352 INFO (qtp4455438-3602) [n:127.0.0.1:46489_solr c:testschemaapi s:shard1 r:core_node2 x:testschemaapi_shard1_replica2] o.a.s.u.PeerSync PeerSync: core=testschemaapi_shard1_replica2 url=http://127.0.0.1:46489/solr START replicas=[http://127.0.0.1:34876/solr/testschemaapi_shard1_replica1/] nUpdates=100
[junit4] 2> 345352 INFO (OverseerStateUpdate-96552636899917829-127.0.0.1:34876_solr-n_0000000000) [n:127.0.0.1:34876_solr ] o.a.s.c.Overseer processMessage: queueSize: 1, message = {
[junit4] 2> "operation":"leader",
[junit4] 2> "shard":"shard1",
[junit4] 2> "collection":"testschemaapi"} current state version: 0
[junit4] 2> 345352 INFO (qtp4455438-3602) [n:127.0.0.1:46489_solr c:testschemaapi s:shard1 r:core_node2 x:testschemaapi_shard1_replica2] o.a.s.u.PeerSync PeerSync: core=testschemaapi_shard1_replica2 url=http://127.0.0.1:46489/solr DONE. We have no versions. sync failed.
[junit4] 2> 345352 INFO (qtp4455438-3602) [n:127.0.0.1:46489_solr c:testschemaapi s:shard1 r:core_node2 x:testschemaapi_shard1_replica2] o.a.s.c.SyncStrategy Leader's attempt to sync with shard failed, moving to the next candidate
[junit4] 2> 345352 INFO (qtp4455438-3602) [n:127.0.0.1:46489_solr c:testschemaapi s:shard1 r:core_node2 x:testschemaapi_shard1_replica2] o.a.s.c.ShardLeaderElectionContext We failed sync, but we have no versions - we can't sync in that case - we were active before, so become leader anyway
[junit4] 2> 345353 INFO (qtp4455438-3602) [n:127.0.0.1:46489_solr c:testschemaapi s:shard1 r:core_node2 x:testschemaapi_shard1_replica2] o.a.s.c.c.SolrZkClient makePath: /collections/testschemaapi/leaders/shard1
[junit4] 2> 345353 INFO (qtp7445847-3624) [n:127.0.0.1:34876_solr c:testschemaapi s:shard1 r:core_node1 x:testschemaapi_shard1_replica1] o.a.s.c.S.Request [testschemaapi_shard1_replica1] webapp=/solr path=/get params={distrib=false&qt=/get&fingerprint=false&getVersions=100&wt=javabin&version=2} status=0 QTime=0
[junit4] 2> 345354 INFO (qtp4455438-3602) [n:127.0.0.1:46489_solr c:testschemaapi s:shard1 r:core_node2 x:testschemaapi_shard1_replica2] o.a.s.c.ShardLeaderElectionContextBase Creating leader registration node /collections/testschemaapi/leaders/shard1/leader after winning as /collections/testschemaapi/leader_elect/shard1/election/96552636899917830-core_node2-n_0000000000
[junit4] 2> 345354 INFO (qtp4455438-3602) [n:127.0.0.1:46489_solr c:testschemaapi s:shard1 r:core_node2 x:testschemaapi_shard1_replica2] o.a.s.c.ShardLeaderElectionContext I am the new leader: http://127.0.0.1:46489/solr/testschemaapi_shard1_replica2/ shard1
[junit4] 2> 345354 INFO (OverseerStateUpdate-96552636899917829-127.0.0.1:34876_solr-n_0000000000) [n:127.0.0.1:34876_solr ] o.a.s.c.Overseer processMessage: queueSize: 1, message = {
[junit4] 2> "operation":"leader",
[junit4] 2> "shard":"shard1",
[junit4] 2> "collection":"testschemaapi",
[junit4] 2> "base_url":"http://127.0.0.1:46489/solr",
[junit4] 2> "core":"testschemaapi_shard1_replica2",
[junit4] 2> "state":"active"} current state version: 0
[junit4] 2> 345455 INFO (OverseerStateUpdate-96552636899917829-127.0.0.1:34876_solr-n_0000000000) [n:127.0.0.1:34876_solr ] o.a.s.c.o.ZkStateWriter going to update_collection /collections/testschemaapi/state.json version: 1
[junit4] 2> 345456 INFO (zkCallback-500-thread-2-processing-n:127.0.0.1:34876_solr) [n:127.0.0.1:34876_solr ] o.a.s.c.c.ZkStateReader A cluster state change: [WatchedEvent state:SyncConnected type:NodeDataChanged path:/collections/testschemaapi/state.json] for collection [testschemaapi] has occurred - updating... (live nodes size: [2])
[junit4] 2> 345456 INFO (zkCallback-501-thread-1-processing-n:127.0.0.1:46489_solr) [n:127.0.0.1:46489_solr ] o.a.s.c.c.ZkStateReader A cluster state change: [WatchedEvent state:SyncConnected type:NodeDataChanged path:/collections/testschemaapi/state.json] for collection [testschemaapi] has occurred - updating... (live nodes size: [2])
[junit4] 2> 345456 INFO (zkCallback-501-thread-1-processing-n:127.0.0.1:46489_solr) [n:127.0.0.1:46489_solr ] o.a.s.c.c.ZkStateReader Updating data for [testschemaapi] from [1] to [2]
[junit4] 2> 345456 INFO (zkCallback-500-thread-2-processing-n:127.0.0.1:34876_solr) [n:127.0.0.1:34876_solr ] o.a.s.c.c.ZkStateReader Updating data for [testschemaapi] from [1] to [2]
[junit4] 2> 345505 INFO (qtp4455438-3602) [n:127.0.0.1:46489_solr c:testschemaapi s:shard1 r:core_node2 x:testschemaapi_shard1_replica2] o.a.s.c.ZkController We are http://127.0.0.1:46489/solr/testschemaapi_shard1_replica2/ and leader is http://127.0.0.1:46489/solr/testschemaapi_shard1_replica2/
[junit4] 2> 345505 INFO (qtp4455438-3602) [n:127.0.0.1:46489_solr c:testschemaapi s:shard1 r:core_node2 x:testschemaapi_shard1_replica2] o.a.s.c.ZkController No LogReplay needed for core=testschemaapi_shard1_replica2 baseURL=http://127.0.0.1:46489/solr
[junit4] 2> 345505 INFO (qtp4455438-3602) [n:127.0.0.1:46489_solr c:testschemaapi s:shard1 r:core_node2 x:testschemaapi_shard1_replica2] o.a.s.c.ZkController I am the leader, no recovery necessary
[junit4] 2> 345505 INFO (qtp4455438-3602) [n:127.0.0.1:46489_solr c:testschemaapi s:shard1 r:core_node2 x:testschemaapi_shard1_replica2] o.a.s.c.ZkController publishing state=active
[junit4] 2> 345506 INFO (OverseerStateUpdate-96552636899917829-127.0.0.1:34876_solr-n_0000000000) [n:127.0.0.1:34876_solr ] o.a.s.c.Overseer processMessage: queueSize: 1, message = {
[junit4] 2> "core":"testschemaapi_shard1_replica2",
[junit4] 2> "core_node_name":"core_node2",
[junit4] 2> "roles":null,
[junit4] 2> "base_url":"http://127.0.0.1:46489/solr",
[junit4] 2> "node_name":"127.0.0.1:46489_solr",
[junit4] 2> "numShards":"1",
[junit4] 2> "state":"active",
[junit4] 2> "shard":"shard1",
[junit4] 2> "collection":"testschemaapi",
[junit4] 2> "operation":"state"} current state version: 0
[junit4] 2> 345506 INFO (OverseerStateUpdate-96552636899917829-127.0.0.1:34876_solr-n_0000000000) [n:127.0.0.1:34876_solr ] o.a.s.c.o.ReplicaMutator Update state numShards=1 message={
[junit4] 2> "core":"testschemaapi_shard1_replica2",
[junit4] 2> "core_node_name":"core_node2",
[junit4] 2> "roles":null,
[junit4] 2> "base_url":"http://127.0.0.1:46489/solr",
[junit4] 2> "node_name":"127.0.0.1:46489_solr",
[junit4] 2> "numShards":"1",
[junit4] 2> "state":"active",
[junit4] 2> "shard":"shard1",
[junit4] 2> "collection":"testschemaapi",
[junit4] 2> "operation":"state"}
[junit4] 2> 345506 INFO (qtp4455438-3602) [n:127.0.0.1:46489_solr c:testschemaapi s:shard1 r:core_node2 x:testschemaapi_shard1_replica2] o.a.s.s.HttpSolrCall [admin] webapp=null path=/admin/cores params={qt=/admin/cores&collection.configName=conf1&name=testschemaapi_shard1_replica2&action=CREATE&numShards=1&collection=testschemaapi&shard=shard1&wt=javabin&version=2} status=0 QTime=1188
[junit4] 2> 345607 INFO (OverseerStateUpdate-96552636899917829-127.0.0.1:34876_solr-n_0000000000) [n:127.0.0.1:34876_solr ] o.a.s.c.o.ZkStateWriter going to update_collection /collections/testschemaapi/state.json version: 2
[junit4] 2> 345607 INFO (zkCallback-500-thread-2-processing-n:127.0.0.1:34876_solr) [n:127.0.0.1:34876_solr ] o.a.s.c.c.ZkStateReader A cluster state change: [WatchedEvent state:SyncConnected type:NodeDataChanged path:/collections/testschemaapi/state.json] for collection [testschemaapi] has occurred - updating... (live nodes size: [2])
[junit4] 2> 345607 INFO (zkCallback-501-thread-1-processing-n:127.0.0.1:46489_solr) [n:127.0.0.1:46489_solr ] o.a.s.c.c.ZkStateReader A cluster state change: [WatchedEvent state:SyncConnected type:NodeDataChanged path:/collections/testschemaapi/state.json] for collection [testschemaapi] has occurred - updating... (live nodes size: [2])
[junit4] 2> 345608 INFO (zkCallback-500-thread-2-processing-n:127.0.0.1:34876_solr) [n:127.0.0.1:34876_solr ] o.a.s.c.c.ZkStateReader Updating data for [testschemaapi] from [2] to [3]
[junit4] 2> 345608 INFO (zkCallback-501-thread-1-processing-n:127.0.0.1:46489_solr) [n:127.0.0.1:46489_solr ] o.a.s.c.c.ZkStateReader Updating data for [testschemaapi] from [2] to [3]
[junit4] 2> 346352 INFO (qtp7445847-3610) [n:127.0.0.1:34876_solr c:testschemaapi s:shard1 r:core_node1 x:testschemaapi_shard1_replica1] o.a.s.c.ZkController We are http://127.0.0.1:34876/solr/testschemaapi_shard1_replica1/ and leader is http://127.0.0.1:46489/solr/testschemaapi_shard1_replica2/
[junit4] 2> 346352 INFO (qtp7445847-3610) [n:127.0.0.1:34876_solr c:testschemaapi s:shard1 r:core_node1 x:testschemaapi_shard1_replica1] o.a.s.c.ZkController No LogReplay needed for core=testschemaapi_shard1_replica1 baseURL=http://127.0.0.1:34876/solr
[junit4] 2> 346352 INFO (qtp7445847-3610) [n:127.0.0.1:34876_solr c:testschemaapi s:shard1 r:core_node1 x:testschemaapi_shard1_replica1] o.a.s.c.ZkController Core needs to recover:testschemaapi_shard1_replica1
[junit4] 2> 346353 INFO (updateExecutor-496-thread-1-processing-n:127.0.0.1:34876_solr x:testschemaapi_shard1_replica1 s:shard1 c:testschemaapi r:core_node1) [n:127.0.0.1:34876_solr c:testschemaapi s:shard1 r:core_node1 x:testschemaapi_shard1_replica1] o.a.s.u.DefaultSolrCoreState Running recovery
[junit4] 2> 346353 INFO (recoveryExecutor-497-thread-1-processing-n:127.0.0.1:34876_solr x:testschemaapi_shard1_replica1 s:shard1 c:testschemaapi r:core_node1) [n:127.0.0.1:34876_solr c:testschemaapi s:shard1 r:core_node1 x:testschemaapi_shard1_replica1] o.a.s.c.RecoveryStrategy Starting recovery process. recoveringAfterStartup=true
[junit4] 2> 346353 INFO (recoveryExecutor-497-thread-1-processing-n:127.0.0.1:34876_solr x:testschemaapi_shard1_replica1 s:shard1 c:testschemaapi r:core_node1) [n:127.0.0.1:34876_solr c:testschemaapi s:shard1 r:core_node1 x:testschemaapi_shard1_replica1] o.a.s.c.RecoveryStrategy ###### startupVersions=[[]]
[junit4] 2> 346353 INFO (recoveryExecutor-497-thread-1-processing-n:127.0.0.1:34876_solr x:testschemaapi_shard1_replica1 s:shard1 c:testschemaapi r:core_node1) [n:127.0.0.1:34876_solr c:testschemaapi s:shard1 r:core_node1 x:testschemaapi_shard1_replica1] o.a.s.c.RecoveryStrategy Begin buffering updates. core=[testschemaapi_shard1_replica1]
[junit4] 2> 346353 INFO (recoveryExecutor-497-thread-1-processing-n:127.0.0.1:34876_solr x:testschemaapi_shard1_replica1 s:shard1 c:testschemaapi r:core_node1) [n:127.0.0.1:34876_solr c:testschemaapi s:shard1 r:core_node1 x:testschemaapi_shard1_replica1] o.a.s.u.UpdateLog Starting to buffer updates. FSUpdateLog{state=ACTIVE, tlog=null}
[junit4] 2> 346353 INFO (recoveryExecutor-497-thread-1-processing-n:127.0.0.1:34876_solr x:testschemaapi_shard1_replica1 s:shard1 c:testschemaapi r:core_node1) [n:127.0.0.1:34876_solr c:testschemaapi s:shard1 r:core_node1 x:testschemaapi_shard1_replica1] o.a.s.c.RecoveryStrategy Publishing state of core [testschemaapi_shard1_replica1] as recovering, leader is [http://127.0.0.1:46489/solr/testschemaapi_shard1_replica2/] and I am [http://127.0.0.1:34876/solr/testschemaapi_shard1_replica1/]
[junit4] 2> 346353 INFO (recoveryExecutor-497-thread-1-processing-n:127.0.0.1:34876_solr x:testschemaapi_shard1_replica1 s:shard1 c:testschemaapi r:core_node1) [n:127.0.0.1:34876_solr c:testschemaapi s:shard1 r:core_node1 x:testschemaapi_shard1_replica1] o.a.s.c.ZkController publishing state=recovering
[junit4] 2> 346354 INFO (OverseerStateUpdate-96552636899917829-127.0.0.1:34876_solr-n_0000000000) [n:127.0.0.1:34876_solr ] o.a.s.c.Overseer processMessage: queueSize: 1, message = {
[junit4] 2> "core":"testschemaapi_shard1_replica1",
[junit4] 2> "core_node_name":"core_node1",
[junit4] 2> "roles":null,
[junit4] 2> "base_url":"http://127.0.0.1:34876/solr",
[junit4] 2> "node_name":"127.0.0.1:34876_solr",
[junit4] 2> "numShards":"1",
[junit4] 2> "state":"recovering",
[junit4] 2> "shard":"shard1",
[junit4] 2> "collection":"testschemaapi",
[junit4] 2> "operation":"state"} current state version: 0
[junit4] 2> 346354 INFO (qtp7445847-3610) [n:127.0.0.1:34876_solr c:testschemaapi s:shard1 r:core_node1 x:testschemaapi_shard1_replica1] o.a.s.s.HttpSolrCall [admin] webapp=null path=/admin/cores params={qt=/admin/cores&collection.configName=conf1&name=testschemaapi_shard1_replica1&action=CREATE&numShards=1&collection=testschemaapi&shard=shard1&wt=javabin&version=2} status=0 QTime=2036
[junit4] 2> 346354 INFO (OverseerStateUpdate-96552636899917829-127.0.0.1:34876_solr-n_0000000000) [n:127.0.0.1:34876_solr ] o.a.s.c.o.ReplicaMutator Update state numShards=1 message={
[junit4] 2> "core":"testschemaapi_shard1_replica1",
[junit4] 2> "core_node_name":"core_node1",
[junit4] 2> "roles":null,
[junit4] 2> "base_url":"http://127.0.0.1:34876/solr",
[junit4] 2> "node_name":"127.0.0.1:34876_solr",
[junit4] 2> "numShards":"1",
[junit4] 2> "state":"recovering",
[junit4] 2> "shard":"shard1",
[junit4] 2> "collection":"testschemaapi",
[junit4] 2> "operation":"state"}
[junit4] 2> 346356 INFO (recoveryExecutor-497-thread-1-processing-n:127.0.0.1:34876_solr x:testschemaapi_shard1_replica1 s:shard1 c:testschemaapi r:core_node1) [n:127.0.0.1:34876_solr c:testschemaapi s:shard1 r:core_node1 x:testschemaapi_shard1_
[...truncated too long message...]
7 ERROR (Thread-1313) [n:127.0.0.1:34876_solr c:testschemaapi s:shard1 r:core_node1 x:testschemaapi_shard1_replica1] o.a.s.r.ManagedResourceStorage Failed to get config name for collection testschemaapi due to: org.apache.solr.common.SolrException: Error loading config name for collection testschemaapi
[junit4] 2> 355527 INFO (Thread-1313) [n:127.0.0.1:34876_solr c:testschemaapi s:shard1 r:core_node1 x:testschemaapi_shard1_replica1] o.a.s.c.SolrCore [testschemaapi_shard1_replica1] CLOSING SolrCore org.apache.solr.core.SolrCore@96ecdd
[junit4] 2> 355527 INFO (searcherExecutor-1586-thread-1-processing-n:127.0.0.1:34876_solr x:testschemaapi_shard1_replica1 s:shard1 c:testschemaapi r:core_node1) [n:127.0.0.1:34876_solr c:testschemaapi s:shard1 r:core_node1 x:testschemaapi_shard1_replica1] o.a.s.c.SolrCore [testschemaapi_shard1_replica1] Registered new searcher Searcher@75a04[testschemaapi_shard1_replica1] main{ExitableDirectoryReader(UninvertingDirectoryReader(Uninverting(_0(5.5.3):C2)))}
[junit4] 2> 355527 INFO (Thread-1313) [n:127.0.0.1:34876_solr c:testschemaapi s:shard1 r:core_node1 x:testschemaapi_shard1_replica1] o.a.s.u.DirectUpdateHandler2 closing DirectUpdateHandler2{commits=0,autocommits=0,soft autocommits=0,optimizes=0,rollbacks=0,expungeDeletes=0,docsPending=0,adds=0,deletesById=0,deletesByQuery=0,errors=0,cumulative_adds=0,cumulative_deletesById=0,cumulative_deletesByQuery=0,cumulative_errors=0,transaction_logs_total_size=0,transaction_logs_total_number=0}
[junit4] 2> 355527 INFO (Thread-1313) [n:127.0.0.1:34876_solr c:testschemaapi s:shard1 r:core_node1 x:testschemaapi_shard1_replica1] o.a.s.u.SolrCoreState Closing SolrCoreState
[junit4] 2> 355527 WARN (Thread-1313) [n:127.0.0.1:34876_solr c:testschemaapi s:shard1 r:core_node1 x:testschemaapi_shard1_replica1] o.a.s.c.RecoveryStrategy Stopping recovery for core=[testschemaapi_shard1_replica1] coreNodeName=[core_node1]
[junit4] 2> 355527 INFO (Thread-1313) [n:127.0.0.1:34876_solr c:testschemaapi s:shard1 r:core_node1 x:testschemaapi_shard1_replica1] o.a.s.u.DefaultSolrCoreState SolrCoreState ref count has reached 0 - closing IndexWriter
[junit4] 2> 355527 INFO (Thread-1313) [n:127.0.0.1:34876_solr c:testschemaapi s:shard1 r:core_node1 x:testschemaapi_shard1_replica1] o.a.s.u.DefaultSolrCoreState closing IndexWriter with IndexWriterCloser
[junit4] 2> 355527 INFO (Thread-1313) [n:127.0.0.1:34876_solr c:testschemaapi s:shard1 r:core_node1 x:testschemaapi_shard1_replica1] o.a.s.u.DirectUpdateHandler2 Committing on IndexWriter close.
[junit4] 2> 355527 INFO (Thread-1313) [n:127.0.0.1:34876_solr c:testschemaapi s:shard1 r:core_node1 x:testschemaapi_shard1_replica1] o.a.s.c.SolrDeletionPolicy SolrDeletionPolicy.onCommit: commits: num=2
[junit4] 2> commit{dir=MockDirectoryWrapper(RAMDirectory@1f4eb5b lockFactory=org.apache.lucene.store.SingleInstanceLockFactory@1e209b6),segFN=segments_1,generation=1}
[junit4] 2> commit{dir=MockDirectoryWrapper(RAMDirectory@1f4eb5b lockFactory=org.apache.lucene.store.SingleInstanceLockFactory@1e209b6),segFN=segments_2,generation=2}
[junit4] 2> 355527 INFO (Thread-1313) [n:127.0.0.1:34876_solr c:testschemaapi s:shard1 r:core_node1 x:testschemaapi_shard1_replica1] o.a.s.c.SolrDeletionPolicy newest commit generation = 2
[junit4] 2> 355527 INFO (Thread-1313) [n:127.0.0.1:34876_solr c:testschemaapi s:shard1 r:core_node1 x:testschemaapi_shard1_replica1] o.a.s.c.SolrCore [testschemaapi_shard1_replica1] Closing main searcher on request.
[junit4] 2> 355528 INFO (Thread-1313) [n:127.0.0.1:34876_solr c:testschemaapi s:shard1 r:core_node1 x:testschemaapi_shard1_replica1] o.a.s.c.CachingDirectoryFactory Closing MockDirectoryFactory - 2 directories currently being tracked
[junit4] 2> 355528 INFO (Thread-1313) [n:127.0.0.1:34876_solr c:testschemaapi s:shard1 r:core_node1 x:testschemaapi_shard1_replica1] o.a.s.c.CachingDirectoryFactory looking to close /home/jenkins/workspace/Lucene-Solr-5.5-Linux/solr/build/solr-core/test/J2/temp/solr.schema.TestManagedSchemaAPI_7CCE63E3BAA527D4-001/tempDir-001/node2/./testschemaapi_shard1_replica1/data/index [CachedDir<<refCount=0;path=/home/jenkins/workspace/Lucene-Solr-5.5-Linux/solr/build/solr-core/test/J2/temp/solr.schema.TestManagedSchemaAPI_7CCE63E3BAA527D4-001/tempDir-001/node2/./testschemaapi_shard1_replica1/data/index;done=false>>]
[junit4] 2> 355528 INFO (Thread-1313) [n:127.0.0.1:34876_solr c:testschemaapi s:shard1 r:core_node1 x:testschemaapi_shard1_replica1] o.a.s.c.CachingDirectoryFactory Closing directory: /home/jenkins/workspace/Lucene-Solr-5.5-Linux/solr/build/solr-core/test/J2/temp/solr.schema.TestManagedSchemaAPI_7CCE63E3BAA527D4-001/tempDir-001/node2/./testschemaapi_shard1_replica1/data/index
[junit4] 2> 355528 INFO (Thread-1313) [n:127.0.0.1:34876_solr c:testschemaapi s:shard1 r:core_node1 x:testschemaapi_shard1_replica1] o.a.s.c.CachingDirectoryFactory looking to close /home/jenkins/workspace/Lucene-Solr-5.5-Linux/solr/build/solr-core/test/J2/temp/solr.schema.TestManagedSchemaAPI_7CCE63E3BAA527D4-001/tempDir-001/node2/./testschemaapi_shard1_replica1/data [CachedDir<<refCount=0;path=/home/jenkins/workspace/Lucene-Solr-5.5-Linux/solr/build/solr-core/test/J2/temp/solr.schema.TestManagedSchemaAPI_7CCE63E3BAA527D4-001/tempDir-001/node2/./testschemaapi_shard1_replica1/data;done=false>>]
[junit4] 2> 355528 INFO (Thread-1313) [n:127.0.0.1:34876_solr c:testschemaapi s:shard1 r:core_node1 x:testschemaapi_shard1_replica1] o.a.s.c.CachingDirectoryFactory Closing directory: /home/jenkins/workspace/Lucene-Solr-5.5-Linux/solr/build/solr-core/test/J2/temp/solr.schema.TestManagedSchemaAPI_7CCE63E3BAA527D4-001/tempDir-001/node2/./testschemaapi_shard1_replica1/data
[junit4] 2> 355528 WARN (Thread-1313) [n:127.0.0.1:34876_solr c:testschemaapi s:shard1 r:core_node1 x:testschemaapi_shard1_replica1] o.a.s.c.ZkController listener throws error
[junit4] 2> org.apache.solr.common.SolrException: Unable to reload core [testschemaapi_shard1_replica1]
[junit4] 2> at org.apache.solr.core.CoreContainer.reload(CoreContainer.java:927)
[junit4] 2> at org.apache.solr.core.SolrCore$11.run(SolrCore.java:2623)
[junit4] 2> at org.apache.solr.cloud.ZkController$5.run(ZkController.java:2480)
[junit4] 2> Caused by: org.apache.solr.common.SolrException: Could not find config name for collection:testschemaapi
[junit4] 2> at org.apache.solr.core.SolrCore.<init>(SolrCore.java:820)
[junit4] 2> at org.apache.solr.core.SolrCore.reload(SolrCore.java:461)
[junit4] 2> at org.apache.solr.core.CoreContainer.reload(CoreContainer.java:922)
[junit4] 2> ... 2 more
[junit4] 2> Caused by: org.apache.solr.common.SolrException: Could not find config name for collection:testschemaapi
[junit4] 2> at org.apache.solr.rest.ManagedResourceStorage.newStorageIO(ManagedResourceStorage.java:101)
[junit4] 2> at org.apache.solr.core.SolrCore.initRestManager(SolrCore.java:2417)
[junit4] 2> at org.apache.solr.core.SolrCore.<init>(SolrCore.java:796)
[junit4] 2> ... 4 more
[junit4] 2> Sep 07, 2016 7:25:31 PM com.carrotsearch.randomizedtesting.ThreadLeakControl checkThreadLeaks
[junit4] 2> WARNING: Will linger awaiting termination of 4 leaked thread(s).
[junit4] 2> NOTE: test params are: codec=Asserting(Lucene54), sim=DefaultSimilarity, locale=sr-Latn-BA, timezone=Europe/Sarajevo
[junit4] 2> NOTE: Linux 4.4.0-36-generic i386/Oracle Corporation 1.8.0_102 (32-bit)/cpus=12,threads=1,free=189965440,total=293601280
[junit4] 2> NOTE: All tests run in this JVM: [CurrencyFieldXmlFileTest, SliceStateTest, TestUniqueKeyFieldResource, DebugComponentTest, HdfsUnloadDistributedZkTest, TestSolrDeletionPolicy1, TestPostingsSolrHighlighter, TestSuggestSpellingConverter, FullSolrCloudDistribCmdsTest, DistributedDebugComponentTest, TestRequestForwarding, TestAuthorizationFramework, TestLRUStatsCache, SolrCloudExampleTest, TestSearcherReuse, AtomicUpdatesTest, DataDrivenBlockJoinTest, DirectUpdateHandlerOptimizeTest, BadComponentTest, TestDefaultSearchFieldResource, BitVectorTest, BadCopyFieldTest, TestDownShardTolerantSearch, LeaderInitiatedRecoveryOnShardRestartTest, TestStressReorder, TestClusterStateMutator, TestIndexSearcher, BinaryUpdateRequestHandlerTest, ShowFileRequestHandlerTest, CollectionsAPIAsyncDistributedZkTest, SortSpecParsingTest, TestJmxIntegration, TestTestInjection, InfoHandlerTest, TestSolr4Spatial2, TestXIncludeConfig, TestSolrJ, TestChildDocTransformer, AssignTest, TestSort, TestNamedUpdateProcessors, VMParamsZkACLAndCredentialsProvidersTest, TestSerializedLuceneMatchVersion, HdfsChaosMonkeyNothingIsSafeTest, TestTolerantSearch, TestDistribIDF, HighlighterConfigTest, TestExtendedDismaxParser, RequestHandlersTest, TermVectorComponentDistributedTest, NoCacheHeaderTest, TestFieldCollectionResource, FieldAnalysisRequestHandlerTest, TestObjectReleaseTracker, FieldMutatingUpdateProcessorTest, BlockDirectoryTest, TestCollectionAPI, TestReRankQParserPlugin, SuggesterTSTTest, TestManagedSchemaAPI]
[junit4] 2> NOTE: reproduce with: ant test -Dtestcase=TestManagedSchemaAPI -Dtests.seed=7CCE63E3BAA527D4 -Dtests.multiplier=3 -Dtests.slow=true -Dtests.locale=sr-Latn-BA -Dtests.timezone=Europe/Sarajevo -Dtests.asserts=true -Dtests.file.encoding=ISO-8859-1
[junit4] ERROR 0.00s J2 | TestManagedSchemaAPI (suite) <<<
[junit4] > Throwable #1: java.lang.AssertionError: ObjectTracker found 4 object(s) that were not released!!! [MDCAwareThreadPoolExecutor, MockDirectoryWrapper, TransactionLog, MockDirectoryWrapper]
[junit4] > at __randomizedtesting.SeedInfo.seed([7CCE63E3BAA527D4]:0)
[junit4] > at org.apache.solr.SolrTestCaseJ4.afterClass(SolrTestCaseJ4.java:238)
[junit4] > at java.lang.Thread.run(Thread.java:745)
[junit4] Completed [158/575 (1!)] on J2 in 12.31s, 1 test, 1 failure <<< FAILURES!
[...truncated 50483 lines...]
[JENKINS] Lucene-Solr-5.5-Linux (64bit/jdk1.7.0_80) - Build # 401 -
Still Unstable!
Posted by Policeman Jenkins Server <je...@thetaphi.de>.
Build: http://jenkins.thetaphi.de/job/Lucene-Solr-5.5-Linux/401/
Java: 64bit/jdk1.7.0_80 -XX:+UseCompressedOops -XX:+UseConcMarkSweepGC
2 tests failed.
FAILED: org.apache.solr.handler.TestReplicationHandler.doTestIndexFetchOnMasterRestart
Error Message:
expected:<1> but was:<2>
Stack Trace:
java.lang.AssertionError: expected:<1> but was:<2>
at __randomizedtesting.SeedInfo.seed([15E962A9ADF1A8F2:CD1EA64D062A6AAE]:0)
at org.junit.Assert.fail(Assert.java:93)
at org.junit.Assert.failNotEquals(Assert.java:647)
at org.junit.Assert.assertEquals(Assert.java:128)
at org.junit.Assert.assertEquals(Assert.java:472)
at org.junit.Assert.assertEquals(Assert.java:456)
at org.apache.solr.handler.TestReplicationHandler.doTestIndexFetchOnMasterRestart(TestReplicationHandler.java:624)
at sun.reflect.NativeMethodAccessorImpl.invoke0(Native Method)
at sun.reflect.NativeMethodAccessorImpl.invoke(NativeMethodAccessorImpl.java:57)
at sun.reflect.DelegatingMethodAccessorImpl.invoke(DelegatingMethodAccessorImpl.java:43)
at java.lang.reflect.Method.invoke(Method.java:606)
at com.carrotsearch.randomizedtesting.RandomizedRunner.invoke(RandomizedRunner.java:1764)
at com.carrotsearch.randomizedtesting.RandomizedRunner$8.evaluate(RandomizedRunner.java:871)
at com.carrotsearch.randomizedtesting.RandomizedRunner$9.evaluate(RandomizedRunner.java:907)
at com.carrotsearch.randomizedtesting.RandomizedRunner$10.evaluate(RandomizedRunner.java:921)
at com.carrotsearch.randomizedtesting.rules.SystemPropertiesRestoreRule$1.evaluate(SystemPropertiesRestoreRule.java:57)
at org.apache.lucene.util.TestRuleSetupTeardownChained$1.evaluate(TestRuleSetupTeardownChained.java:49)
at org.apache.lucene.util.AbstractBeforeAfterRule$1.evaluate(AbstractBeforeAfterRule.java:45)
at org.apache.lucene.util.TestRuleThreadAndTestName$1.evaluate(TestRuleThreadAndTestName.java:48)
at org.apache.lucene.util.TestRuleIgnoreAfterMaxFailures$1.evaluate(TestRuleIgnoreAfterMaxFailures.java:64)
at org.apache.lucene.util.TestRuleMarkFailure$1.evaluate(TestRuleMarkFailure.java:47)
at com.carrotsearch.randomizedtesting.rules.StatementAdapter.evaluate(StatementAdapter.java:36)
at com.carrotsearch.randomizedtesting.ThreadLeakControl$StatementRunner.run(ThreadLeakControl.java:367)
at com.carrotsearch.randomizedtesting.ThreadLeakControl.forkTimeoutingTask(ThreadLeakControl.java:809)
at com.carrotsearch.randomizedtesting.ThreadLeakControl$3.evaluate(ThreadLeakControl.java:460)
at com.carrotsearch.randomizedtesting.RandomizedRunner.runSingleTest(RandomizedRunner.java:880)
at com.carrotsearch.randomizedtesting.RandomizedRunner$5.evaluate(RandomizedRunner.java:781)
at com.carrotsearch.randomizedtesting.RandomizedRunner$6.evaluate(RandomizedRunner.java:816)
at com.carrotsearch.randomizedtesting.RandomizedRunner$7.evaluate(RandomizedRunner.java:827)
at com.carrotsearch.randomizedtesting.rules.StatementAdapter.evaluate(StatementAdapter.java:36)
at com.carrotsearch.randomizedtesting.rules.SystemPropertiesRestoreRule$1.evaluate(SystemPropertiesRestoreRule.java:57)
at org.apache.lucene.util.AbstractBeforeAfterRule$1.evaluate(AbstractBeforeAfterRule.java:45)
at com.carrotsearch.randomizedtesting.rules.StatementAdapter.evaluate(StatementAdapter.java:36)
at org.apache.lucene.util.TestRuleStoreClassName$1.evaluate(TestRuleStoreClassName.java:41)
at com.carrotsearch.randomizedtesting.rules.NoShadowingOrOverridesOnMethodsRule$1.evaluate(NoShadowingOrOverridesOnMethodsRule.java:40)
at com.carrotsearch.randomizedtesting.rules.NoShadowingOrOverridesOnMethodsRule$1.evaluate(NoShadowingOrOverridesOnMethodsRule.java:40)
at com.carrotsearch.randomizedtesting.rules.StatementAdapter.evaluate(StatementAdapter.java:36)
at com.carrotsearch.randomizedtesting.rules.StatementAdapter.evaluate(StatementAdapter.java:36)
at com.carrotsearch.randomizedtesting.rules.StatementAdapter.evaluate(StatementAdapter.java:36)
at org.apache.lucene.util.TestRuleAssertionsRequired$1.evaluate(TestRuleAssertionsRequired.java:53)
at org.apache.lucene.util.TestRuleMarkFailure$1.evaluate(TestRuleMarkFailure.java:47)
at org.apache.lucene.util.TestRuleIgnoreAfterMaxFailures$1.evaluate(TestRuleIgnoreAfterMaxFailures.java:64)
at org.apache.lucene.util.TestRuleIgnoreTestSuites$1.evaluate(TestRuleIgnoreTestSuites.java:54)
at com.carrotsearch.randomizedtesting.rules.StatementAdapter.evaluate(StatementAdapter.java:36)
at com.carrotsearch.randomizedtesting.ThreadLeakControl$StatementRunner.run(ThreadLeakControl.java:367)
at java.lang.Thread.run(Thread.java:745)
FAILED: org.apache.solr.schema.TestManagedSchemaAPI.test
Error Message:
Error from server at http://127.0.0.1:37750/solr/testschemaapi_shard1_replica1: ERROR: [doc=2] unknown field 'myNewField1'
Stack Trace:
org.apache.solr.client.solrj.impl.CloudSolrClient$RouteException: Error from server at http://127.0.0.1:37750/solr/testschemaapi_shard1_replica1: ERROR: [doc=2] unknown field 'myNewField1'
at __randomizedtesting.SeedInfo.seed([15E962A9ADF1A8F2:9DBD5D73030DC50A]:0)
at org.apache.solr.client.solrj.impl.CloudSolrClient.directUpdate(CloudSolrClient.java:653)
at org.apache.solr.client.solrj.impl.CloudSolrClient.sendRequest(CloudSolrClient.java:1002)
at org.apache.solr.client.solrj.impl.CloudSolrClient.requestWithRetryOnStaleState(CloudSolrClient.java:891)
at org.apache.solr.client.solrj.impl.CloudSolrClient.request(CloudSolrClient.java:827)
at org.apache.solr.schema.TestManagedSchemaAPI.testAddFieldAndDocument(TestManagedSchemaAPI.java:101)
at org.apache.solr.schema.TestManagedSchemaAPI.test(TestManagedSchemaAPI.java:69)
at sun.reflect.NativeMethodAccessorImpl.invoke0(Native Method)
at sun.reflect.NativeMethodAccessorImpl.invoke(NativeMethodAccessorImpl.java:57)
at sun.reflect.DelegatingMethodAccessorImpl.invoke(DelegatingMethodAccessorImpl.java:43)
at java.lang.reflect.Method.invoke(Method.java:606)
at com.carrotsearch.randomizedtesting.RandomizedRunner.invoke(RandomizedRunner.java:1764)
at com.carrotsearch.randomizedtesting.RandomizedRunner$8.evaluate(RandomizedRunner.java:871)
at com.carrotsearch.randomizedtesting.RandomizedRunner$9.evaluate(RandomizedRunner.java:907)
at com.carrotsearch.randomizedtesting.RandomizedRunner$10.evaluate(RandomizedRunner.java:921)
at com.carrotsearch.randomizedtesting.rules.SystemPropertiesRestoreRule$1.evaluate(SystemPropertiesRestoreRule.java:57)
at org.apache.lucene.util.TestRuleSetupTeardownChained$1.evaluate(TestRuleSetupTeardownChained.java:49)
at org.apache.lucene.util.AbstractBeforeAfterRule$1.evaluate(AbstractBeforeAfterRule.java:45)
at org.apache.lucene.util.TestRuleThreadAndTestName$1.evaluate(TestRuleThreadAndTestName.java:48)
at org.apache.lucene.util.TestRuleIgnoreAfterMaxFailures$1.evaluate(TestRuleIgnoreAfterMaxFailures.java:64)
at org.apache.lucene.util.TestRuleMarkFailure$1.evaluate(TestRuleMarkFailure.java:47)
at com.carrotsearch.randomizedtesting.rules.StatementAdapter.evaluate(StatementAdapter.java:36)
at com.carrotsearch.randomizedtesting.ThreadLeakControl$StatementRunner.run(ThreadLeakControl.java:367)
at com.carrotsearch.randomizedtesting.ThreadLeakControl.forkTimeoutingTask(ThreadLeakControl.java:809)
at com.carrotsearch.randomizedtesting.ThreadLeakControl$3.evaluate(ThreadLeakControl.java:460)
at com.carrotsearch.randomizedtesting.RandomizedRunner.runSingleTest(RandomizedRunner.java:880)
at com.carrotsearch.randomizedtesting.RandomizedRunner$5.evaluate(RandomizedRunner.java:781)
at com.carrotsearch.randomizedtesting.RandomizedRunner$6.evaluate(RandomizedRunner.java:816)
at com.carrotsearch.randomizedtesting.RandomizedRunner$7.evaluate(RandomizedRunner.java:827)
at com.carrotsearch.randomizedtesting.rules.StatementAdapter.evaluate(StatementAdapter.java:36)
at com.carrotsearch.randomizedtesting.rules.SystemPropertiesRestoreRule$1.evaluate(SystemPropertiesRestoreRule.java:57)
at org.apache.lucene.util.AbstractBeforeAfterRule$1.evaluate(AbstractBeforeAfterRule.java:45)
at com.carrotsearch.randomizedtesting.rules.StatementAdapter.evaluate(StatementAdapter.java:36)
at org.apache.lucene.util.TestRuleStoreClassName$1.evaluate(TestRuleStoreClassName.java:41)
at com.carrotsearch.randomizedtesting.rules.NoShadowingOrOverridesOnMethodsRule$1.evaluate(NoShadowingOrOverridesOnMethodsRule.java:40)
at com.carrotsearch.randomizedtesting.rules.NoShadowingOrOverridesOnMethodsRule$1.evaluate(NoShadowingOrOverridesOnMethodsRule.java:40)
at com.carrotsearch.randomizedtesting.rules.StatementAdapter.evaluate(StatementAdapter.java:36)
at com.carrotsearch.randomizedtesting.rules.StatementAdapter.evaluate(StatementAdapter.java:36)
at com.carrotsearch.randomizedtesting.rules.StatementAdapter.evaluate(StatementAdapter.java:36)
at org.apache.lucene.util.TestRuleAssertionsRequired$1.evaluate(TestRuleAssertionsRequired.java:53)
at org.apache.lucene.util.TestRuleMarkFailure$1.evaluate(TestRuleMarkFailure.java:47)
at org.apache.lucene.util.TestRuleIgnoreAfterMaxFailures$1.evaluate(TestRuleIgnoreAfterMaxFailures.java:64)
at org.apache.lucene.util.TestRuleIgnoreTestSuites$1.evaluate(TestRuleIgnoreTestSuites.java:54)
at com.carrotsearch.randomizedtesting.rules.StatementAdapter.evaluate(StatementAdapter.java:36)
at com.carrotsearch.randomizedtesting.ThreadLeakControl$StatementRunner.run(ThreadLeakControl.java:367)
at java.lang.Thread.run(Thread.java:745)
Caused by: org.apache.solr.client.solrj.impl.HttpSolrClient$RemoteSolrException: Error from server at http://127.0.0.1:37750/solr/testschemaapi_shard1_replica1: ERROR: [doc=2] unknown field 'myNewField1'
at org.apache.solr.client.solrj.impl.HttpSolrClient.executeMethod(HttpSolrClient.java:577)
at org.apache.solr.client.solrj.impl.HttpSolrClient.request(HttpSolrClient.java:241)
at org.apache.solr.client.solrj.impl.HttpSolrClient.request(HttpSolrClient.java:230)
at org.apache.solr.client.solrj.impl.LBHttpSolrClient.doRequest(LBHttpSolrClient.java:372)
at org.apache.solr.client.solrj.impl.LBHttpSolrClient.request(LBHttpSolrClient.java:325)
at org.apache.solr.client.solrj.impl.CloudSolrClient$2.call(CloudSolrClient.java:628)
at org.apache.solr.client.solrj.impl.CloudSolrClient$2.call(CloudSolrClient.java:625)
at java.util.concurrent.FutureTask.run(FutureTask.java:262)
at org.apache.solr.common.util.ExecutorUtil$MDCAwareThreadPoolExecutor$1.run(ExecutorUtil.java:231)
at java.util.concurrent.ThreadPoolExecutor.runWorker(ThreadPoolExecutor.java:1145)
at java.util.concurrent.ThreadPoolExecutor$Worker.run(ThreadPoolExecutor.java:615)
... 1 more
Build Log:
[...truncated 10949 lines...]
[junit4] Suite: org.apache.solr.handler.TestReplicationHandler
[junit4] 2> Creating dataDir: /home/jenkins/workspace/Lucene-Solr-5.5-Linux/solr/build/solr-core/test/J0/temp/solr.handler.TestReplicationHandler_15E962A9ADF1A8F2-001/init-core-data-001
[junit4] 2> 263936 INFO (TEST-TestReplicationHandler.doTestStopPoll-seed#[15E962A9ADF1A8F2]) [ ] o.a.s.SolrTestCaseJ4 ###Starting doTestStopPoll
[junit4] 2> 263936 INFO (TEST-TestReplicationHandler.doTestStopPoll-seed#[15E962A9ADF1A8F2]) [ ] o.a.s.SolrTestCaseJ4 Writing core.properties file to /home/jenkins/workspace/Lucene-Solr-5.5-Linux/solr/build/solr-core/test/J0/temp/solr.handler.TestReplicationHandler_15E962A9ADF1A8F2-001/solr-instance-001/collection1
[junit4] 2> 263941 INFO (TEST-TestReplicationHandler.doTestStopPoll-seed#[15E962A9ADF1A8F2]) [ ] o.e.j.s.Server jetty-9.2.13.v20150730
[junit4] 2> 263943 INFO (TEST-TestReplicationHandler.doTestStopPoll-seed#[15E962A9ADF1A8F2]) [ ] o.e.j.s.h.ContextHandler Started o.e.j.s.ServletContextHandler@28ed72ff{/solr,null,AVAILABLE}
[junit4] 2> 263944 INFO (TEST-TestReplicationHandler.doTestStopPoll-seed#[15E962A9ADF1A8F2]) [ ] o.e.j.s.ServerConnector Started ServerConnector@6a233643{HTTP/1.1}{127.0.0.1:37107}
[junit4] 2> 263944 INFO (TEST-TestReplicationHandler.doTestStopPoll-seed#[15E962A9ADF1A8F2]) [ ] o.e.j.s.Server Started @265615ms
[junit4] 2> 263944 INFO (TEST-TestReplicationHandler.doTestStopPoll-seed#[15E962A9ADF1A8F2]) [ ] o.a.s.c.s.e.JettySolrRunner Jetty properties: {hostContext=/solr, hostPort=37107, solr.data.dir=/home/jenkins/workspace/Lucene-Solr-5.5-Linux/solr/build/solr-core/test/J0/temp/solr.handler.TestReplicationHandler_15E962A9ADF1A8F2-001/solr-instance-001/collection1/data}
[junit4] 2> 263944 INFO (TEST-TestReplicationHandler.doTestStopPoll-seed#[15E962A9ADF1A8F2]) [ ] o.a.s.s.SolrDispatchFilter SolrDispatchFilter.init(): sun.misc.Launcher$AppClassLoader@7be84195
[junit4] 2> 263945 INFO (TEST-TestReplicationHandler.doTestStopPoll-seed#[15E962A9ADF1A8F2]) [ ] o.a.s.c.SolrResourceLoader new SolrResourceLoader for directory: '/home/jenkins/workspace/Lucene-Solr-5.5-Linux/solr/build/solr-core/test/J0/temp/solr.handler.TestReplicationHandler_15E962A9ADF1A8F2-001/solr-instance-001'
[junit4] 2> 263945 INFO (TEST-TestReplicationHandler.doTestStopPoll-seed#[15E962A9ADF1A8F2]) [ ] o.a.s.c.SolrResourceLoader JNDI not configured for solr (NoInitialContextEx)
[junit4] 2> 263945 INFO (TEST-TestReplicationHandler.doTestStopPoll-seed#[15E962A9ADF1A8F2]) [ ] o.a.s.c.SolrResourceLoader solr home defaulted to 'solr/' (could not find system property or JNDI)
[junit4] 2> 263945 INFO (TEST-TestReplicationHandler.doTestStopPoll-seed#[15E962A9ADF1A8F2]) [ ] o.a.s.c.SolrXmlConfig Loading container configuration from /home/jenkins/workspace/Lucene-Solr-5.5-Linux/solr/build/solr-core/test/J0/temp/solr.handler.TestReplicationHandler_15E962A9ADF1A8F2-001/solr-instance-001/solr.xml
[junit4] 2> 263958 INFO (TEST-TestReplicationHandler.doTestStopPoll-seed#[15E962A9ADF1A8F2]) [ ] o.a.s.c.CorePropertiesLocator Config-defined core root directory: /home/jenkins/workspace/Lucene-Solr-5.5-Linux/solr/build/solr-core/test/J0/temp/solr.handler.TestReplicationHandler_15E962A9ADF1A8F2-001/solr-instance-001/.
[junit4] 2> 263958 INFO (TEST-TestReplicationHandler.doTestStopPoll-seed#[15E962A9ADF1A8F2]) [ ] o.a.s.c.CoreContainer New CoreContainer 373889086
[junit4] 2> 263958 INFO (TEST-TestReplicationHandler.doTestStopPoll-seed#[15E962A9ADF1A8F2]) [ ] o.a.s.c.CoreContainer Loading cores into CoreContainer [instanceDir=/home/jenkins/workspace/Lucene-Solr-5.5-Linux/solr/build/solr-core/test/J0/temp/solr.handler.TestReplicationHandler_15E962A9ADF1A8F2-001/solr-instance-001]
[junit4] 2> 263958 WARN (TEST-TestReplicationHandler.doTestStopPoll-seed#[15E962A9ADF1A8F2]) [ ] o.a.s.c.CoreContainer Couldn't add files from /home/jenkins/workspace/Lucene-Solr-5.5-Linux/solr/build/solr-core/test/J0/temp/solr.handler.TestReplicationHandler_15E962A9ADF1A8F2-001/solr-instance-001/lib to classpath: /home/jenkins/workspace/Lucene-Solr-5.5-Linux/solr/build/solr-core/test/J0/temp/solr.handler.TestReplicationHandler_15E962A9ADF1A8F2-001/solr-instance-001/lib
[junit4] 2> 263959 INFO (TEST-TestReplicationHandler.doTestStopPoll-seed#[15E962A9ADF1A8F2]) [ ] o.a.s.h.c.HttpShardHandlerFactory created with socketTimeout : 90000,urlScheme : ,connTimeout : 15000,maxConnectionsPerHost : 20,maxConnections : 10000,corePoolSize : 0,maximumPoolSize : 2147483647,maxThreadIdleTime : 5,sizeOfQueue : -1,fairnessPolicy : false,useRetries : false,connectionsEvictorSleepDelay : 5000,maxConnectionIdleTime : 40000,
[junit4] 2> 263960 INFO (TEST-TestReplicationHandler.doTestStopPoll-seed#[15E962A9ADF1A8F2]) [ ] o.a.s.u.UpdateShardHandler Creating UpdateShardHandler HTTP client with params: socketTimeout=340000&connTimeout=45000&retry=true
[junit4] 2> 263961 INFO (TEST-TestReplicationHandler.doTestStopPoll-seed#[15E962A9ADF1A8F2]) [ ] o.a.s.l.LogWatcher SLF4J impl is org.slf4j.impl.Log4jLoggerFactory
[junit4] 2> 263961 INFO (TEST-TestReplicationHandler.doTestStopPoll-seed#[15E962A9ADF1A8F2]) [ ] o.a.s.l.LogWatcher Registering Log Listener [Log4j (org.slf4j.impl.Log4jLoggerFactory)]
[junit4] 2> 263961 INFO (TEST-TestReplicationHandler.doTestStopPoll-seed#[15E962A9ADF1A8F2]) [ ] o.a.s.c.CoreContainer Security conf doesn't exist. Skipping setup for authorization module.
[junit4] 2> 263961 INFO (TEST-TestReplicationHandler.doTestStopPoll-seed#[15E962A9ADF1A8F2]) [ ] o.a.s.c.CoreContainer No authentication plugin used.
[junit4] 2> 263962 INFO (TEST-TestReplicationHandler.doTestStopPoll-seed#[15E962A9ADF1A8F2]) [ ] o.a.s.c.CorePropertiesLocator Looking for core definitions underneath /home/jenkins/workspace/Lucene-Solr-5.5-Linux/solr/build/solr-core/test/J0/temp/solr.handler.TestReplicationHandler_15E962A9ADF1A8F2-001/solr-instance-001/.
[junit4] 2> 263963 INFO (TEST-TestReplicationHandler.doTestStopPoll-seed#[15E962A9ADF1A8F2]) [ ] o.a.s.c.CoreDescriptor Created CoreDescriptor: {configSetProperties=configsetprops.json, transient=false, config=solrconfig.xml, dataDir=data/, name=collection1, loadOnStartup=true, schema=schema.xml}
[junit4] 2> 263963 INFO (TEST-TestReplicationHandler.doTestStopPoll-seed#[15E962A9ADF1A8F2]) [ ] o.a.s.c.CorePropertiesLocator Found core collection1 in /home/jenkins/workspace/Lucene-Solr-5.5-Linux/solr/build/solr-core/test/J0/temp/solr.handler.TestReplicationHandler_15E962A9ADF1A8F2-001/solr-instance-001/./collection1
[junit4] 2> 263963 INFO (TEST-TestReplicationHandler.doTestStopPoll-seed#[15E962A9ADF1A8F2]) [ ] o.a.s.c.CorePropertiesLocator Found 1 core definitions
[junit4] 2> 263964 INFO (coreLoadExecutor-714-thread-1) [ ] o.a.s.c.SolrResourceLoader new SolrResourceLoader for directory: '/home/jenkins/workspace/Lucene-Solr-5.5-Linux/solr/build/solr-core/test/J0/temp/solr.handler.TestReplicationHandler_15E962A9ADF1A8F2-001/solr-instance-001/collection1'
[junit4] 2> 263964 INFO (TEST-TestReplicationHandler.doTestStopPoll-seed#[15E962A9ADF1A8F2]) [ ] o.a.s.s.SolrDispatchFilter user.dir=/home/jenkins/workspace/Lucene-Solr-5.5-Linux/solr/build/solr-core/test/J0
[junit4] 2> 263964 INFO (coreLoadExecutor-714-thread-1) [ ] o.a.s.c.SolrResourceLoader JNDI not configured for solr (NoInitialContextEx)
[junit4] 2> 263964 INFO (TEST-TestReplicationHandler.doTestStopPoll-seed#[15E962A9ADF1A8F2]) [ ] o.a.s.s.SolrDispatchFilter SolrDispatchFilter.init() done
[junit4] 2> 263964 INFO (coreLoadExecutor-714-thread-1) [ ] o.a.s.c.SolrResourceLoader solr home defaulted to 'solr/' (could not find system property or JNDI)
[junit4] 2> 263971 INFO (coreLoadExecutor-714-thread-1) [ ] o.a.s.c.SolrConfig current version of requestparams : -1
[junit4] 2> 263977 WARN (coreLoadExecutor-714-thread-1) [ ] o.a.s.c.Config Beginning with Solr 5.5, <mergePolicy> is deprecated, use <mergePolicyFactory> instead.
[junit4] 2> 263978 INFO (coreLoadExecutor-714-thread-1) [ ] o.a.s.c.SolrConfig Using Lucene MatchVersion: 5.5.3
[junit4] 2> 263993 INFO (coreLoadExecutor-714-thread-1) [ ] o.a.s.c.SolrConfig Loaded SolrConfig: solrconfig.xml
[junit4] 2> 263996 INFO (coreLoadExecutor-714-thread-1) [ ] o.a.s.s.IndexSchema [collection1] Schema name=test
[junit4] 2> 264000 INFO (coreLoadExecutor-714-thread-1) [ ] o.a.s.s.IndexSchema unique key field: id
[junit4] 2> 264001 INFO (coreLoadExecutor-714-thread-1) [ ] o.a.s.c.ConfigSetProperties Did not find ConfigSet properties, assuming default properties: Can't find resource 'configsetprops.json' in classpath or '/home/jenkins/workspace/Lucene-Solr-5.5-Linux/solr/build/solr-core/test/J0/temp/solr.handler.TestReplicationHandler_15E962A9ADF1A8F2-001/solr-instance-001/collection1'
[junit4] 2> 264001 INFO (coreLoadExecutor-714-thread-1) [ ] o.a.s.c.CoreContainer Creating SolrCore 'collection1' using configuration from instancedir /home/jenkins/workspace/Lucene-Solr-5.5-Linux/solr/build/solr-core/test/J0/temp/solr.handler.TestReplicationHandler_15E962A9ADF1A8F2-001/solr-instance-001/./collection1
[junit4] 2> 264002 INFO (coreLoadExecutor-714-thread-1) [ x:collection1] o.a.s.c.SolrCore org.apache.solr.core.MockDirectoryFactory
[junit4] 2> 264002 INFO (coreLoadExecutor-714-thread-1) [ x:collection1] o.a.s.c.SolrCore [[collection1] ] Opening new SolrCore at [/home/jenkins/workspace/Lucene-Solr-5.5-Linux/solr/build/solr-core/test/J0/temp/solr.handler.TestReplicationHandler_15E962A9ADF1A8F2-001/solr-instance-001/collection1], dataDir=[/home/jenkins/workspace/Lucene-Solr-5.5-Linux/solr/build/solr-core/test/J0/temp/solr.handler.TestReplicationHandler_15E962A9ADF1A8F2-001/solr-instance-001/./collection1/data/]
[junit4] 2> 264002 INFO (coreLoadExecutor-714-thread-1) [ x:collection1] o.a.s.c.SolrCore JMX monitoring not detected for core: collection1
[junit4] 2> 264002 INFO (coreLoadExecutor-714-thread-1) [ x:collection1] o.a.s.c.CachingDirectoryFactory return new directory for /home/jenkins/workspace/Lucene-Solr-5.5-Linux/solr/build/solr-core/test/J0/temp/solr.handler.TestReplicationHandler_15E962A9ADF1A8F2-001/solr-instance-001/./collection1/data
[junit4] 2> 264003 INFO (coreLoadExecutor-714-thread-1) [ x:collection1] o.a.s.c.SolrCore New index directory detected: old=null new=/home/jenkins/workspace/Lucene-Solr-5.5-Linux/solr/build/solr-core/test/J0/temp/solr.handler.TestReplicationHandler_15E962A9ADF1A8F2-001/solr-instance-001/./collection1/data/index/
[junit4] 2> 264003 WARN (coreLoadExecutor-714-thread-1) [ x:collection1] o.a.s.c.SolrCore [collection1] Solr index directory '/home/jenkins/workspace/Lucene-Solr-5.5-Linux/solr/build/solr-core/test/J0/temp/solr.handler.TestReplicationHandler_15E962A9ADF1A8F2-001/solr-instance-001/./collection1/data/index' doesn't exist. Creating new index...
[junit4] 2> 264003 INFO (coreLoadExecutor-714-thread-1) [ x:collection1] o.a.s.c.CachingDirectoryFactory return new directory for /home/jenkins/workspace/Lucene-Solr-5.5-Linux/solr/build/solr-core/test/J0/temp/solr.handler.TestReplicationHandler_15E962A9ADF1A8F2-001/solr-instance-001/./collection1/data/index
[junit4] 2> 264003 INFO (coreLoadExecutor-714-thread-1) [ x:collection1] o.a.s.u.RandomMergePolicy RandomMergePolicy wrapping class org.apache.lucene.index.LogByteSizeMergePolicy: [LogByteSizeMergePolicy: minMergeSize=1677721, mergeFactor=39, maxMergeSize=2147483648, maxMergeSizeForForcedMerge=9223372036854775807, calibrateSizeByDeletes=true, maxMergeDocs=2147483647, maxCFSSegmentSizeMB=8.796093022207999E12, noCFSRatio=0.8880813324520461]
[junit4] 2> 264003 INFO (coreLoadExecutor-714-thread-1) [ x:collection1] o.a.s.c.SolrDeletionPolicy SolrDeletionPolicy.onCommit: commits: num=1
[junit4] 2> commit{dir=MockDirectoryWrapper(RAMDirectory@10e4f53f lockFactory=org.apache.lucene.store.SingleInstanceLockFactory@27a103c3),segFN=segments_1,generation=1}
[junit4] 2> 264003 INFO (coreLoadExecutor-714-thread-1) [ x:collection1] o.a.s.c.SolrDeletionPolicy newest commit generation = 1
[junit4] 2> 264003 INFO (OldIndexDirectoryCleanupThreadForCore-collection1) [ x:collection1] o.a.s.c.SolrCore Looking for old index directories to cleanup for core collection1 in /home/jenkins/workspace/Lucene-Solr-5.5-Linux/solr/build/solr-core/test/J0/temp/solr.handler.TestReplicationHandler_15E962A9ADF1A8F2-001/solr-instance-001/./collection1/data/
[junit4] 2> 264005 INFO (coreLoadExecutor-714-thread-1) [ x:collection1] o.a.s.c.SolrCore no updateRequestProcessorChain defined as default, creating implicit default
[junit4] 2> 264006 INFO (coreLoadExecutor-714-thread-1) [ x:collection1] o.a.s.h.l.XMLLoader xsltCacheLifetimeSeconds=60
[junit4] 2> 264007 INFO (coreLoadExecutor-714-thread-1) [ x:collection1] o.a.s.h.l.XMLLoader xsltCacheLifetimeSeconds=60
[junit4] 2> 264008 INFO (coreLoadExecutor-714-thread-1) [ x:collection1] o.a.s.h.l.XMLLoader xsltCacheLifetimeSeconds=60
[junit4] 2> 264008 INFO (coreLoadExecutor-714-thread-1) [ x:collection1] o.a.s.h.l.XMLLoader xsltCacheLifetimeSeconds=60
[junit4] 2> 264011 INFO (coreLoadExecutor-714-thread-1) [ x:collection1] o.a.s.c.PluginBag requestHandler : 'lazy' created with startup=lazy
[junit4] 2> 264011 INFO (coreLoadExecutor-714-thread-1) [ x:collection1] o.a.s.c.RequestHandlers Registered paths: /update/json,/admin/plugins,standard,/update/json/docs,/admin/segments,/admin/logging,/admin/luke,/update/csv,/admin/threads,/update,/config,/admin/mbeans,lazy,/admin/file,defaults,/schema,/replication,/admin/system,/admin/ping,/admin/properties,/get
[junit4] 2> 264012 INFO (coreLoadExecutor-714-thread-1) [ x:collection1] o.a.s.c.SolrCore Using default statsCache cache: org.apache.solr.search.stats.LocalStatsCache
[junit4] 2> 264013 INFO (coreLoadExecutor-714-thread-1) [ x:collection1] o.a.s.u.CommitTracker Hard AutoCommit: disabled
[junit4] 2> 264013 INFO (coreLoadExecutor-714-thread-1) [ x:collection1] o.a.s.u.CommitTracker Soft AutoCommit: disabled
[junit4] 2> 264013 INFO (coreLoadExecutor-714-thread-1) [ x:collection1] o.a.s.u.RandomMergePolicy RandomMergePolicy wrapping class org.apache.lucene.index.LogByteSizeMergePolicy: [LogByteSizeMergePolicy: minMergeSize=1677721, mergeFactor=22, maxMergeSize=2147483648, maxMergeSizeForForcedMerge=9223372036854775807, calibrateSizeByDeletes=true, maxMergeDocs=2147483647, maxCFSSegmentSizeMB=8.796093022207999E12, noCFSRatio=0.43908916469851744]
[junit4] 2> 264013 INFO (coreLoadExecutor-714-thread-1) [ x:collection1] o.a.s.c.SolrDeletionPolicy SolrDeletionPolicy.onInit: commits: num=1
[junit4] 2> commit{dir=MockDirectoryWrapper(RAMDirectory@10e4f53f lockFactory=org.apache.lucene.store.SingleInstanceLockFactory@27a103c3),segFN=segments_1,generation=1}
[junit4] 2> 264013 INFO (coreLoadExecutor-714-thread-1) [ x:collection1] o.a.s.c.SolrDeletionPolicy newest commit generation = 1
[junit4] 2> 264013 INFO (coreLoadExecutor-714-thread-1) [ x:collection1] o.a.s.s.SolrIndexSearcher Opening Searcher@20cac12b[collection1] main
[junit4] 2> 264013 INFO (coreLoadExecutor-714-thread-1) [ x:collection1] o.a.s.r.ManagedResourceStorage File-based storage initialized to use dir: /home/jenkins/workspace/Lucene-Solr-5.5-Linux/solr/build/solr-core/test/J0/temp/solr.handler.TestReplicationHandler_15E962A9ADF1A8F2-001/solr-instance-001/collection1/conf
[junit4] 2> 264013 INFO (coreLoadExecutor-714-thread-1) [ x:collection1] o.a.s.r.RestManager Initializing RestManager with initArgs: {storageDir=/home/jenkins/workspace/Lucene-Solr-5.5-Linux/solr/build/solr-core/test/J0/temp/solr.handler.TestReplicationHandler_15E962A9ADF1A8F2-001/solr-instance-001/collection1/conf}
[junit4] 2> 264013 INFO (coreLoadExecutor-714-thread-1) [ x:collection1] o.a.s.r.ManagedResourceStorage Reading _rest_managed.json using file:dir=/home/jenkins/workspace/Lucene-Solr-5.5-Linux/solr/build/solr-core/test/J0/temp/solr.handler.TestReplicationHandler_15E962A9ADF1A8F2-001/solr-instance-001/collection1/conf
[junit4] 2> 264013 INFO (coreLoadExecutor-714-thread-1) [ x:collection1] o.a.s.r.RestManager Initializing 0 registered ManagedResources
[junit4] 2> 264014 INFO (coreLoadExecutor-714-thread-1) [ x:collection1] o.a.s.h.ReplicationHandler Replication enabled for following config files: schema.xml,xslt/dummy.xsl
[junit4] 2> 264014 INFO (coreLoadExecutor-714-thread-1) [ x:collection1] o.a.s.h.ReplicationHandler Commits will be reserved for 10000
[junit4] 2> 264014 INFO (searcherExecutor-715-thread-1-processing-x:collection1) [ x:collection1] o.a.s.c.SolrCore [collection1] Registered new searcher Searcher@20cac12b[collection1] main{ExitableDirectoryReader(UninvertingDirectoryReader())}
[junit4] 2> 264014 INFO (coreLoadExecutor-714-thread-1) [ x:collection1] o.a.s.c.CoreContainer registering core: collection1
[junit4] 2> 264465 INFO (TEST-TestReplicationHandler.doTestStopPoll-seed#[15E962A9ADF1A8F2]) [ ] o.a.s.SolrTestCaseJ4 Writing core.properties file to /home/jenkins/workspace/Lucene-Solr-5.5-Linux/solr/build/solr-core/test/J0/temp/solr.handler.TestReplicationHandler_15E962A9ADF1A8F2-001/solr-instance-002/collection1
[junit4] 2> 264468 INFO (TEST-TestReplicationHandler.doTestStopPoll-seed#[15E962A9ADF1A8F2]) [ ] o.e.j.s.Server jetty-9.2.13.v20150730
[junit4] 2> 264469 INFO (TEST-TestReplicationHandler.doTestStopPoll-seed#[15E962A9ADF1A8F2]) [ ] o.e.j.s.h.ContextHandler Started o.e.j.s.ServletContextHandler@5977562d{/solr,null,AVAILABLE}
[junit4] 2> 264469 INFO (TEST-TestReplicationHandler.doTestStopPoll-seed#[15E962A9ADF1A8F2]) [ ] o.e.j.s.ServerConnector Started ServerConnector@2840f9d9{HTTP/1.1}{127.0.0.1:39740}
[junit4] 2> 264469 INFO (TEST-TestReplicationHandler.doTestStopPoll-seed#[15E962A9ADF1A8F2]) [ ] o.e.j.s.Server Started @266140ms
[junit4] 2> 264469 INFO (TEST-TestReplicationHandler.doTestStopPoll-seed#[15E962A9ADF1A8F2]) [ ] o.a.s.c.s.e.JettySolrRunner Jetty properties: {solr.data.dir=/home/jenkins/workspace/Lucene-Solr-5.5-Linux/solr/build/solr-core/test/J0/temp/solr.handler.TestReplicationHandler_15E962A9ADF1A8F2-001/solr-instance-002/collection1/data, hostContext=/solr, hostPort=39740}
[junit4] 2> 264469 INFO (TEST-TestReplicationHandler.doTestStopPoll-seed#[15E962A9ADF1A8F2]) [ ] o.a.s.s.SolrDispatchFilter SolrDispatchFilter.init(): sun.misc.Launcher$AppClassLoader@7be84195
[junit4] 2> 264469 INFO (TEST-TestReplicationHandler.doTestStopPoll-seed#[15E962A9ADF1A8F2]) [ ] o.a.s.c.SolrResourceLoader new SolrResourceLoader for directory: '/home/jenkins/workspace/Lucene-Solr-5.5-Linux/solr/build/solr-core/test/J0/temp/solr.handler.TestReplicationHandler_15E962A9ADF1A8F2-001/solr-instance-002'
[junit4] 2> 264469 INFO (TEST-TestReplicationHandler.doTestStopPoll-seed#[15E962A9ADF1A8F2]) [ ] o.a.s.c.SolrResourceLoader JNDI not configured for solr (NoInitialContextEx)
[junit4] 2> 264469 INFO (TEST-TestReplicationHandler.doTestStopPoll-seed#[15E962A9ADF1A8F2]) [ ] o.a.s.c.SolrResourceLoader solr home defaulted to 'solr/' (could not find system property or JNDI)
[junit4] 2> 264470 INFO (TEST-TestReplicationHandler.doTestStopPoll-seed#[15E962A9ADF1A8F2]) [ ] o.a.s.c.SolrXmlConfig Loading container configuration from /home/jenkins/workspace/Lucene-Solr-5.5-Linux/solr/build/solr-core/test/J0/temp/solr.handler.TestReplicationHandler_15E962A9ADF1A8F2-001/solr-instance-002/solr.xml
[junit4] 2> 264484 INFO (TEST-TestReplicationHandler.doTestStopPoll-seed#[15E962A9ADF1A8F2]) [ ] o.a.s.c.CorePropertiesLocator Config-defined core root directory: /home/jenkins/workspace/Lucene-Solr-5.5-Linux/solr/build/solr-core/test/J0/temp/solr.handler.TestReplicationHandler_15E962A9ADF1A8F2-001/solr-instance-002/.
[junit4] 2> 264485 INFO (TEST-TestReplicationHandler.doTestStopPoll-seed#[15E962A9ADF1A8F2]) [ ] o.a.s.c.CoreContainer New CoreContainer 315258473
[junit4] 2> 264485 INFO (TEST-TestReplicationHandler.doTestStopPoll-seed#[15E962A9ADF1A8F2]) [ ] o.a.s.c.CoreContainer Loading cores into CoreContainer [instanceDir=/home/jenkins/workspace/Lucene-Solr-5.5-Linux/solr/build/solr-core/test/J0/temp/solr.handler.TestReplicationHandler_15E962A9ADF1A8F2-001/solr-instance-002]
[junit4] 2> 264485 WARN (TEST-TestReplicationHandler.doTestStopPoll-seed#[15E962A9ADF1A8F2]) [ ] o.a.s.c.CoreContainer Couldn't add files from /home/jenkins/workspace/Lucene-Solr-5.5-Linux/solr/build/solr-core/test/J0/temp/solr.handler.TestReplicationHandler_15E962A9ADF1A8F2-001/solr-instance-002/lib to classpath: /home/jenkins/workspace/Lucene-Solr-5.5-Linux/solr/build/solr-core/test/J0/temp/solr.handler.TestReplicationHandler_15E962A9ADF1A8F2-001/solr-instance-002/lib
[junit4] 2> 264485 INFO (TEST-TestReplicationHandler.doTestStopPoll-seed#[15E962A9ADF1A8F2]) [ ] o.a.s.h.c.HttpShardHandlerFactory created with socketTimeout : 90000,urlScheme : ,connTimeout : 15000,maxConnectionsPerHost : 20,maxConnections : 10000,corePoolSize : 0,maximumPoolSize : 2147483647,maxThreadIdleTime : 5,sizeOfQueue : -1,fairnessPolicy : false,useRetries : false,connectionsEvictorSleepDelay : 5000,maxConnectionIdleTime : 40000,
[junit4] 2> 264486 INFO (TEST-TestReplicationHandler.doTestStopPoll-seed#[15E962A9ADF1A8F2]) [ ] o.a.s.u.UpdateShardHandler Creating UpdateShardHandler HTTP client with params: socketTimeout=340000&connTimeout=45000&retry=true
[junit4] 2> 264486 INFO (TEST-TestReplicationHandler.doTestStopPoll-seed#[15E962A9ADF1A8F2]) [ ] o.a.s.l.LogWatcher SLF4J impl is org.slf4j.impl.Log4jLoggerFactory
[junit4] 2> 264486 INFO (TEST-TestReplicationHandler.doTestStopPoll-seed#[15E962A9ADF1A8F2]) [ ] o.a.s.l.LogWatcher Registering Log Listener [Log4j (org.slf4j.impl.Log4jLoggerFactory)]
[junit4] 2> 264486 INFO (TEST-TestReplicationHandler.doTestStopPoll-seed#[15E962A9ADF1A8F2]) [ ] o.a.s.c.CoreContainer Security conf doesn't exist. Skipping setup for authorization module.
[junit4] 2> 264486 INFO (TEST-TestReplicationHandler.doTestStopPoll-seed#[15E962A9ADF1A8F2]) [ ] o.a.s.c.CoreContainer No authentication plugin used.
[junit4] 2> 264487 INFO (TEST-TestReplicationHandler.doTestStopPoll-seed#[15E962A9ADF1A8F2]) [ ] o.a.s.c.CorePropertiesLocator Looking for core definitions underneath /home/jenkins/workspace/Lucene-Solr-5.5-Linux/solr/build/solr-core/test/J0/temp/solr.handler.TestReplicationHandler_15E962A9ADF1A8F2-001/solr-instance-002/.
[junit4] 2> 264488 INFO (TEST-TestReplicationHandler.doTestStopPoll-seed#[15E962A9ADF1A8F2]) [ ] o.a.s.c.CoreDescriptor Created CoreDescriptor: {config=solrconfig.xml, loadOnStartup=true, name=collection1, schema=schema.xml, transient=false, dataDir=data/, configSetProperties=configsetprops.json}
[junit4] 2> 264488 INFO (TEST-TestReplicationHandler.doTestStopPoll-seed#[15E962A9ADF1A8F2]) [ ] o.a.s.c.CorePropertiesLocator Found core collection1 in /home/jenkins/workspace/Lucene-Solr-5.5-Linux/solr/build/solr-core/test/J0/temp/solr.handler.TestReplicationHandler_15E962A9ADF1A8F2-001/solr-instance-002/./collection1
[junit4] 2> 264488 INFO (TEST-TestReplicationHandler.doTestStopPoll-seed#[15E962A9ADF1A8F2]) [ ] o.a.s.c.CorePropertiesLocator Found 1 core definitions
[junit4] 2> 264488 INFO (coreLoadExecutor-724-thread-1) [ ] o.a.s.c.SolrResourceLoader new SolrResourceLoader for directory: '/home/jenkins/workspace/Lucene-Solr-5.5-Linux/solr/build/solr-core/test/J0/temp/solr.handler.TestReplicationHandler_15E962A9ADF1A8F2-001/solr-instance-002/collection1'
[junit4] 2> 264488 INFO (TEST-TestReplicationHandler.doTestStopPoll-seed#[15E962A9ADF1A8F2]) [ ] o.a.s.s.SolrDispatchFilter user.dir=/home/jenkins/workspace/Lucene-Solr-5.5-Linux/solr/build/solr-core/test/J0
[junit4] 2> 264488 INFO (TEST-TestReplicationHandler.doTestStopPoll-seed#[15E962A9ADF1A8F2]) [ ] o.a.s.s.SolrDispatchFilter SolrDispatchFilter.init() done
[junit4] 2> 264488 INFO (coreLoadExecutor-724-thread-1) [ ] o.a.s.c.SolrResourceLoader JNDI not configured for solr (NoInitialContextEx)
[junit4] 2> 264489 INFO (coreLoadExecutor-724-thread-1) [ ] o.a.s.c.SolrResourceLoader solr home defaulted to 'solr/' (could not find system property or JNDI)
[junit4] 2> 264495 INFO (coreLoadExecutor-724-thread-1) [ ] o.a.s.c.SolrConfig current version of requestparams : -1
[junit4] 2> 264501 WARN (coreLoadExecutor-724-thread-1) [ ] o.a.s.c.Config Beginning with Solr 5.5, <mergePolicy> is deprecated, use <mergePolicyFactory> instead.
[junit4] 2> 264502 INFO (coreLoadExecutor-724-thread-1) [ ] o.a.s.c.SolrConfig Using Lucene MatchVersion: 5.5.3
[junit4] 2> 264517 INFO (coreLoadExecutor-724-thread-1) [ ] o.a.s.c.SolrConfig Loaded SolrConfig: solrconfig.xml
[junit4] 2> 264520 INFO (coreLoadExecutor-724-thread-1) [ ] o.a.s.s.IndexSchema [collection1] Schema name=test
[junit4] 2> 264524 INFO (coreLoadExecutor-724-thread-1) [ ] o.a.s.s.IndexSchema unique key field: id
[junit4] 2> 264525 INFO (coreLoadExecutor-724-thread-1) [ ] o.a.s.c.ConfigSetProperties Did not find ConfigSet properties, assuming default properties: Can't find resource 'configsetprops.json' in classpath or '/home/jenkins/workspace/Lucene-Solr-5.5-Linux/solr/build/solr-core/test/J0/temp/solr.handler.TestReplicationHandler_15E962A9ADF1A8F2-001/solr-instance-002/collection1'
[junit4] 2> 264525 INFO (coreLoadExecutor-724-thread-1) [ ] o.a.s.c.CoreContainer Creating SolrCore 'collection1' using configuration from instancedir /home/jenkins/workspace/Lucene-Solr-5.5-Linux/solr/build/solr-core/test/J0/temp/solr.handler.TestReplicationHandler_15E962A9ADF1A8F2-001/solr-instance-002/./collection1
[junit4] 2> 264525 INFO (coreLoadExecutor-724-thread-1) [ x:collection1] o.a.s.c.SolrCore org.apache.solr.core.MockDirectoryFactory
[junit4] 2> 264526 INFO (coreLoadExecutor-724-thread-1) [ x:collection1] o.a.s.c.SolrCore [[collection1] ] Opening new SolrCore at [/home/jenkins/workspace/Lucene-Solr-5.5-Linux/solr/build/solr-core/test/J0/temp/solr.handler.TestReplicationHandler_15E962A9ADF1A8F2-001/solr-instance-002/collection1], dataDir=[/home/jenkins/workspace/Lucene-Solr-5.5-Linux/solr/build/solr-core/test/J0/temp/solr.handler.TestReplicationHandler_15E962A9ADF1A8F2-001/solr-instance-002/./collection1/data/]
[junit4] 2> 264526 INFO (coreLoadExecutor-724-thread-1) [ x:collection1] o.a.s.c.SolrCore JMX monitoring not detected for core: collection1
[junit4] 2> 264526 INFO (coreLoadExecutor-724-thread-1) [ x:collection1] o.a.s.c.CachingDirectoryFactory return new directory for /home/jenkins/workspace/Lucene-Solr-5.5-Linux/solr/build/solr-core/test/J0/temp/solr.handler.TestReplicationHandler_15E962A9ADF1A8F2-001/solr-instance-002/./collection1/data
[junit4] 2> 264526 INFO (coreLoadExecutor-724-thread-1) [ x:collection1] o.a.s.c.SolrCore New index directory detected: old=null new=/home/jenkins/workspace/Lucene-Solr-5.5-Linux/solr/build/solr-core/test/J0/temp/solr.handler.TestReplicationHandler_15E962A9ADF1A8F2-001/solr-instance-002/./collection1/data/index/
[junit4] 2> 264526 WARN (coreLoadExecutor-724-thread-1) [ x:collection1] o.a.s.c.SolrCore [collection1] Solr index directory '/home/jenkins/workspace/Lucene-Solr-5.5-Linux/solr/build/solr-core/test/J0/temp/solr.handler.TestReplicationHandler_15E962A9ADF1A8F2-001/solr-instance-002/./collection1/data/index' doesn't exist. Creating new index...
[junit4] 2> 264526 INFO (coreLoadExecutor-724-thread-1) [ x:collection1] o.a.s.c.CachingDirectoryFactory return new directory for /home/jenkins/workspace/Lucene-Solr-5.5-Linux/solr/build/solr-core/test/J0/temp/solr.handler.TestReplicationHandler_15E962A9ADF1A8F2-001/solr-instance-002/./collection1/data/index
[junit4] 2> 264526 INFO (coreLoadExecutor-724-thread-1) [ x:collection1] o.a.s.u.RandomMergePolicy RandomMergePolicy wrapping class org.apache.lucene.index.LogByteSizeMergePolicy: [LogByteSizeMergePolicy: minMergeSize=1677721, mergeFactor=39, maxMergeSize=2147483648, maxMergeSizeForForcedMerge=9223372036854775807, calibrateSizeByDeletes=true, maxMergeDocs=2147483647, maxCFSSegmentSizeMB=8.796093022207999E12, noCFSRatio=0.8880813324520461]
[junit4] 2> 264527 INFO (coreLoadExecutor-724-thread-1) [ x:collection1] o.a.s.c.SolrDeletionPolicy SolrDeletionPolicy.onCommit: commits: num=1
[junit4] 2> commit{dir=MockDirectoryWrapper(RAMDirectory@429207db lockFactory=org.apache.lucene.store.SingleInstanceLockFactory@141dd02),segFN=segments_1,generation=1}
[junit4] 2> 264527 INFO (coreLoadExecutor-724-thread-1) [ x:collection1] o.a.s.c.SolrDeletionPolicy newest commit generation = 1
[junit4] 2> 264527 INFO (OldIndexDirectoryCleanupThreadForCore-collection1) [ x:collection1] o.a.s.c.SolrCore Looking for old index directories to cleanup for core collection1 in /home/jenkins/workspace/Lucene-Solr-5.5-Linux/solr/build/solr-core/test/J0/temp/solr.handler.TestReplicationHandler_15E962A9ADF1A8F2-001/solr-instance-002/./collection1/data/
[junit4] 2> 264528 INFO (coreLoadExecutor-724-thread-1) [ x:collection1] o.a.s.c.SolrCore no updateRequestProcessorChain defined as default, creating implicit default
[junit4] 2> 264530 INFO (coreLoadExecutor-724-thread-1) [ x:collection1] o.a.s.h.l.XMLLoader xsltCacheLifetimeSeconds=60
[junit4] 2> 264531 INFO (coreLoadExecutor-724-thread-1) [ x:collection1] o.a.s.h.l.XMLLoader xsltCacheLifetimeSeconds=60
[junit4] 2> 264531 INFO (coreLoadExecutor-724-thread-1) [ x:collection1] o.a.s.h.l.XMLLoader xsltCacheLifetimeSeconds=60
[junit4] 2> 264532 INFO (coreLoadExecutor-724-thread-1) [ x:collection1] o.a.s.h.l.XMLLoader xsltCacheLifetimeSeconds=60
[junit4] 2> 264533 INFO (coreLoadExecutor-724-thread-1) [ x:collection1] o.a.s.c.PluginBag requestHandler : 'lazy' created with startup=lazy
[junit4] 2> 264533 INFO (coreLoadExecutor-724-thread-1) [ x:collection1] o.a.s.c.RequestHandlers Registered paths: /update/json,/admin/plugins,standard,/update/json/docs,/admin/segments,/admin/logging,/admin/luke,/update/csv,/admin/threads,/update,/config,/admin/mbeans,lazy,/admin/file,defaults,/schema,/replication,/admin/system,/admin/ping,/admin/properties,/get
[junit4] 2> 264534 INFO (coreLoadExecutor-724-thread-1) [ x:collection1] o.a.s.c.SolrCore Using default statsCache cache: org.apache.solr.search.stats.LocalStatsCache
[junit4] 2> 264534 INFO (coreLoadExecutor-724-thread-1) [ x:collection1] o.a.s.u.CommitTracker Hard AutoCommit: disabled
[junit4] 2> 264534 INFO (coreLoadExecutor-724-thread-1) [ x:collection1] o.a.s.u.CommitTracker Soft AutoCommit: disabled
[junit4] 2> 264534 INFO (coreLoadExecutor-724-thread-1) [ x:collection1] o.a.s.u.RandomMergePolicy RandomMergePolicy wrapping class org.apache.lucene.index.LogByteSizeMergePolicy: [LogByteSizeMergePolicy: minMergeSize=1677721, mergeFactor=22, maxMergeSize=2147483648, maxMergeSizeForForcedMerge=9223372036854775807, calibrateSizeByDeletes=true, maxMergeDocs=2147483647, maxCFSSegmentSizeMB=8.796093022207999E12, noCFSRatio=0.43908916469851744]
[junit4] 2> 264534 INFO (coreLoadExecutor-724-thread-1) [ x:collection1] o.a.s.c.SolrDeletionPolicy SolrDeletionPolicy.onInit: commits: num=1
[junit4] 2> commit{dir=MockDirectoryWrapper(RAMDirectory@429207db lockFactory=org.apache.lucene.store.SingleInstanceLockFactory@141dd02),segFN=segments_1,generation=1}
[junit4] 2> 264534 INFO (coreLoadExecutor-724-thread-1) [ x:collection1] o.a.s.c.SolrDeletionPolicy newest commit generation = 1
[junit4] 2> 264535 INFO (coreLoadExecutor-724-thread-1) [ x:collection1] o.a.s.s.SolrIndexSearcher Opening Searcher@2c344ef6[collection1] main
[junit4] 2> 264535 INFO (coreLoadExecutor-724-thread-1) [ x:collection1] o.a.s.r.ManagedResourceStorage File-based storage initialized to use dir: /home/jenkins/workspace/Lucene-Solr-5.5-Linux/solr/build/solr-core/test/J0/temp/solr.handler.TestReplicationHandler_15E962A9ADF1A8F2-001/solr-instance-002/collection1/conf
[junit4] 2> 264535 INFO (coreLoadExecutor-724-thread-1) [ x:collection1] o.a.s.r.RestManager Initializing RestManager with initArgs: {storageDir=/home/jenkins/workspace/Lucene-Solr-5.5-Linux/solr/build/solr-core/test/J0/temp/solr.handler.TestReplicationHandler_15E962A9ADF1A8F2-001/solr-instance-002/collection1/conf}
[junit4] 2> 264535 INFO (coreLoadExecutor-724-thread-1) [ x:collection1] o.a.s.r.ManagedResourceStorage Reading _rest_managed.json using file:dir=/home/jenkins/workspace/Lucene-Solr-5.5-Linux/solr/build/solr-core/test/J0/temp/solr.handler.TestReplicationHandler_15E962A9ADF1A8F2-001/solr-instance-002/collection1/conf
[junit4] 2> 264535 INFO (coreLoadExecutor-724-thread-1) [ x:collection1] o.a.s.r.RestManager Initializing 0 registered ManagedResources
[junit4] 2> 264537 INFO (coreLoadExecutor-724-thread-1) [ x:collection1] o.a.s.h.ReplicationHandler Poll scheduled at an interval of 1000ms
[junit4] 2> 264537 INFO (searcherExecutor-725-thread-1-processing-x:collection1) [ x:collection1] o.a.s.c.SolrCore [collection1] Registered new searcher Searcher@2c344ef6[collection1] main{ExitableDirectoryReader(UninvertingDirectoryReader())}
[junit4] 2> 264537 INFO (coreLoadExecutor-724-thread-1) [ x:collection1] o.a.s.c.CoreContainer registering core: collection1
[junit4] 2> 264539 INFO (qtp1228411028-1741) [ x:collection1] o.a.s.c.S.Request [collection1] webapp=/solr path=/replication params={qt=/replication&wt=javabin&version=2&command=indexversion} status=0 QTime=0
[junit4] 2> 264991 INFO (qtp1228411028-1742) [ x:collection1] o.a.s.c.S.Request [collection1] webapp=/solr path=/select params={wt=javabin&q=*:*&version=2&sort=id+desc} hits=0 status=0 QTime=0
[junit4] 2> 264994 INFO (qtp1228411028-1743) [ x:collection1] o.a.s.u.p.LogUpdateProcessorFactory [collection1] webapp=/solr path=/update params={wt=javabin&version=2}{add=[0]} 0 0
[junit4] 2> 264996 INFO (qtp1228411028-1741) [ x:collection1] o.a.s.u.p.LogUpdateProcessorFactory [collection1] webapp=/solr path=/update params={wt=javabin&version=2}{add=[1]} 0 0
[junit4] 2> 264998 INFO (qtp1228411028-1742) [ x:collection1] o.a.s.u.p.LogUpdateProcessorFactory [collection1] webapp=/solr path=/update params={wt=javabin&version=2}{add=[2]} 0 0
[junit4] 2> 265001 INFO (qtp1228411028-1743) [ x:collection1] o.a.s.u.p.LogUpdateProcessorFactory [collection1] webapp=/solr path=/update params={wt=javabin&version=2}{add=[3]} 0 0
[junit4] 2> 265003 INFO (qtp1228411028-1741) [ x:collection1] o.a.s.u.p.LogUpdateProcessorFactory [collection1] webapp=/solr path=/update params={wt=javabin&version=2}{add=[4]} 0 0
[junit4] 2> 265004 INFO (qtp1228411028-1742) [ x:collection1] o.a.s.u.p.LogUpdateProcessorFactory [collection1] webapp=/solr path=/update params={wt=javabin&version=2}{add=[5]} 0 0
[junit4] 2> 265006 INFO (qtp1228411028-1743) [ x:collection1] o.a.s.u.p.LogUpdateProcessorFactory [collection1] webapp=/solr path=/update params={wt=javabin&version=2}{add=[6]} 0 0
[junit4] 2> 265008 INFO (qtp1228411028-1741) [ x:collection1] o.a.s.u.p.LogUpdateProcessorFactory [collection1] webapp=/solr path=/update params={wt=javabin&version=2}{add=[7]} 0 0
[junit4] 2> 265011 INFO (qtp1228411028-1742) [ x:collection1] o.a.s.u.p.LogUpdateProcessorFactory [collection1] webapp=/solr path=/update params={wt=javabin&version=2}{add=[8]} 0 0
[junit4] 2> 265012 INFO (qtp1228411028-1743) [ x:collection1] o.a.s.u.p.LogUpdateProcessorFactory [collection1] webapp=/solr path=/update params={wt=javabin&version=2}{add=[9]} 0 0
[junit4] 2> 265015 INFO (qtp1228411028-1741) [ x:collection1] o.a.s.u.p.LogUpdateProcessorFactory [collection1] webapp=/solr path=/update params={wt=javabin&version=2}{add=[10]} 0 0
[junit4] 2> 265016 INFO (qtp1228411028-1742) [ x:collection1] o.a.s.u.p.LogUpdateProcessorFactory [collection1] webapp=/solr path=/update params={wt=javabin&version=2}{add=[11]} 0 0
[junit4] 2> 265018 INFO (qtp1228411028-1743) [ x:collection1] o.a.s.u.p.LogUpdateProcessorFactory [collection1] webapp=/solr path=/update params={wt=javabin&version=2}{add=[12]} 0 0
[junit4] 2> 265020 INFO (qtp1228411028-1741) [ x:collection1] o.a.s.u.p.LogUpdateProcessorFactory [collection1] webapp=/solr path=/update params={wt=javabin&version=2}{add=[13]} 0 0
[junit4] 2> 265023 INFO (qtp1228411028-1742) [ x:collection1] o.a.s.u.p.LogUpdateProcessorFactory [collection1] webapp=/solr path=/update params={wt=javabin&version=2}{add=[14]} 0 0
[junit4] 2> 265025 INFO (qtp1228411028-1743) [ x:collection1] o.a.s.u.p.LogUpdateProcessorFactory [collection1] webapp=/solr path=/update params={wt=javabin&version=2}{add=[15]} 0 0
[junit4] 2> 265026 INFO (qtp1228411028-1741) [ x:collection1] o.a.s.u.p.LogUpdateProcessorFactory [collection1] webapp=/solr path=/update params={wt=javabin&version=2}{add=[16]} 0 0
[junit4] 2> 265028 INFO (qtp1228411028-1742) [ x:collection1] o.a.s.u.p.LogUpdateProcessorFactory [collection1] webapp=/solr path=/update params={wt=javabin&version=2}{add=[17]} 0 0
[junit4] 2> 265030 INFO (qtp1228411028-1743) [ x:collection1] o.a.s.u.p.LogUpdateProcessorFactory [collection1] webapp=/solr path=/update params={wt=javabin&version=2}{add=[18]} 0 0
[junit4] 2> 265032 INFO (qtp1228411028-1741) [ x:collection1] o.a.s.u.p.LogUpdateProcessorFactory [collection1] webapp=/solr path=/update params={wt=javabin&version=2}{add=[19]} 0 0
[junit4] 2> 265035 INFO (qtp1228411028-1742) [ x:collection1] o.a.s.u.p.LogUpdateProcessorFactory [collection1] webapp=/solr path=/update params={wt=javabin&version=2}{add=[20]} 0 0
[junit4] 2> 265037 INFO (qtp1228411028-1743) [ x:collection1] o.a.s.u.p.LogUpdateProcessorFactory [collection1] webapp=/solr path=/update params={wt=javabin&version=2}{add=[21]} 0 0
[junit4] 2> 265039 INFO (qtp1228411028-1741) [ x:collection1] o.a.s.u.p.LogUpdateProcessorFactory [collection1] webapp=/solr path=/update params={wt=javabin&version=2}{add=[22]} 0 0
[junit4] 2> 265040 INFO (qtp1228411028-1742) [ x:collection1] o.a.s.u.p.LogUpdateProcessorFactory [collection1] webapp=/solr path=/update params={wt=javabin&version=2}{add=[23]} 0 0
[junit4] 2> 265042 INFO (qtp1228411028-1743) [ x:collection1] o.a.s.u.p.LogUpdateProcessorFactory [collection1] webapp=/solr path=/update params={wt=javabin&version=2}{add=[24]} 0 0
[junit4] 2> 265044 INFO (qtp1228411028-1741) [ x:collection1] o.a.s.u.p.LogUpdateProcessorFactory [collection1] webapp=/solr path=/update params={wt=javabin&version=2}{add=[25]} 0 0
[junit4] 2> 265047 INFO (qtp1228411028-1742) [ x:collection1] o.a.s.u.p.LogUpdateProcessorFactory [collection1] webapp=/solr path=/update params={wt=javabin&version=2}{add=[26]} 0 0
[junit4] 2> 265048 INFO (qtp1228411028-1743) [ x:collection1] o.a.s.u.p.LogUpdateProcessorFactory [collection1] webapp=/solr path=/update params={wt=javabin&version=2}{add=[27]} 0 0
[junit4] 2> 265050 INFO (qtp1228411028-1741) [ x:collection1] o.a.s.u.p.LogUpdateProcessorFactory [collection1] webapp=/solr path=/update params={wt=javabin&version=2}{add=[28]} 0 0
[junit4] 2> 265052 INFO (qtp1228411028-1742) [ x:collection1] o.a.s.u.p.LogUpdateProcessorFactory [collection1] webapp=/solr path=/update params={wt=javabin&version=2}{add=[29]} 0 0
[junit4] 2> 265054 INFO (qtp1228411028-1743) [ x:collection1] o.a.s.u.p.LogUpdateProcessorFactory [collection1] webapp=/solr path=/update params={wt=javabin&version=2}{add=[30]} 0 0
[junit4] 2> 265056 INFO (qtp1228411028-1741) [ x:collection1] o.a.s.u.p.LogUpdateProcessorFactory [collection1] webapp=/solr path=/update params={wt=javabin&version=2}{add=[31]} 0 0
[junit4] 2> 265058 INFO (qtp1228411028-1742) [ x:collection1] o.a.s.u.p.LogUpdateProcessorFactory [collection1] webapp=/solr path=/update params={wt=javabin&version=2}{add=[32]} 0 0
[junit4] 2> 265060 INFO (qtp1228411028-1743) [ x:collection1] o.a.s.u.p.LogUpdateProcessorFactory [collection1] webapp=/solr path=/update params={wt=javabin&version=2}{add=[33]} 0 0
[junit4] 2> 265062 INFO (qtp1228411028-1741) [ x:collection1] o.a.s.u.p.LogUpdateProcessorFactory [collection1] webapp=/solr path=/update params={wt=javabin&version=2}{add=[34]} 0 0
[junit4] 2> 265064 INFO (qtp1228411028-1742) [ x:collection1] o.a.s.u.p.LogUpdateProcessorFactory [collection1] webapp=/solr path=/update params={wt=javabin&version=2}{add=[35]} 0 0
[junit4] 2> 265066 INFO (qtp1228411028-1743) [ x:collection1] o.a.s.u.p.LogUpdateProcessorFactory [collection1] webapp=/solr path=/update params={wt=javabin&version=2}{add=[36]} 0 0
[junit4] 2> 265068 INFO (qtp1228411028-1741) [ x:collection1] o.a.s.u.p.LogUpdateProcessorFactory [collection1] webapp=/solr path=/update params={wt=javabin&version=2}{add=[37]} 0 0
[junit4] 2> 265071 INFO (qtp1228411028-1742) [ x:collection1] o.a.s.u.p.LogUpdateProcessorFactory [collection1] webapp=/solr path=/update params={wt=javabin&version=2}{add=[38]} 0 0
[junit4] 2> 265073 INFO (qtp1228411028-1743) [ x:collection1] o.a.s.u.p.LogUpdateProcessorFactory [collection1] webapp=/solr path=/update params={wt=javabin&version=2}{add=[39]} 0 0
[junit4] 2> 265074 INFO (qtp1228411028-1741) [ x:collection1] o.a.s.u.p.LogUpdateProcessorFactory [collection1] webapp=/solr path=/update params={wt=javabin&version=2}{add=[40]} 0 0
[junit4] 2> 265076 INFO (qtp1228411028-1742) [ x:collection1] o.a.s.u.p.LogUpdateProcessorFactory [collection1] webapp=/solr path=/update params={wt=javabin&version=2}{add=[41]} 0 0
[junit4] 2> 265078 INFO (qtp1228411028-1743) [ x:collection1] o.a.s.u.p.LogUpdateProcessorFactory [collection1] webapp=/solr path=/update params={wt=javabin&version=2}{add=[42]} 0 0
[junit4] 2> 265080 INFO (qtp1228411028-1741) [ x:collection1] o.a.s.u.p.LogUpdateProcessorFactory [collection1] webapp=/solr path=/update params={wt=javabin&version=2}{add=[43]} 0 0
[junit4] 2> 265083 INFO (qtp1228411028-1742) [ x:collection1] o.a.s.u.p.LogUpdateProcessorFactory [collection1] webapp=/solr path=/update params={wt=javabin&version=2}{add=[44]} 0 0
[junit4] 2> 265084 INFO (qtp1228411028-1743) [ x:collection1] o.a.s.u.p.LogUpdateProcessorFactory [collection1] webapp=/solr path=/update params={wt=javabin&version=2}{add=[45]} 0 0
[junit4] 2> 265086 INFO (qtp1228411028-1741) [ x:collection1] o.a.s.u.p.LogUpdateProcessorFactory [collection1] webapp=/solr path=/update params={wt=javabin&version=2}{add=[46]} 0 0
[junit4] 2> 265088 INFO (qtp1228411028-1742) [ x:collection1] o.a.s.u.p.LogUpdateProcessorFactory [collection1] webapp=/solr path=/update params={wt=javabin&version=2}{add=[47]} 0 0
[junit4] 2> 265090 INFO (qtp1228411028-1743) [ x:collection1] o.a.s.u.p.LogUpdateProcessorFactory [collection1] webapp=/solr path=/update params={wt=javabin&version=2}{add=[48]} 0 0
[junit4] 2> 265092 INFO (qtp1228411028-1741) [ x:collection1] o.a.s.u.p.LogUpdateProcessorFactory [collection1] webapp=/solr path=/update params={wt=javabin&version=2}{add=[49]} 0 0
[junit4] 2> 265094 INFO (qtp1228411028-1742) [ x:collection1] o.a.s.u.p.LogUpdateProcessorFactory [collection1] webapp=/solr path=/update params={wt=javabin&version=2}{add=[50]} 0 0
[junit4] 2> 265096 INFO (qtp1228411028-1743) [ x:collection1] o.a.s.u.p.LogUpdateProcessorFactory [collection1] webapp=/solr path=/update params={wt=javabin&version=2}{add=[51]} 0 0
[junit4] 2> 265098 INFO (qtp1228411028-1741) [ x:collection1] o.a.s.u.p.LogUpdateProcessorFactory [collection1] webapp=/solr path=/update params={wt=javabin&version=2}{add=[52]} 0 0
[junit4] 2> 265100 INFO (qtp1228411028-1742) [ x:collection1] o.a.s.u.p.LogUpdateProcessorFactory [collection1] webapp=/solr path=/update params={wt=javabin&version=2}{add=[53]} 0 0
[junit4] 2> 265102 INFO (qtp1228411028-1743) [ x:collection1] o.a.s.u.p.LogUpdateProcessorFactory [collection1] webapp=/solr path=/update params={wt=javabin&version=2}{add=[54]} 0 0
[junit4] 2> 265104 INFO (qtp1228411028-1741) [ x:collection1] o.a.s.u.p.LogUpdateProcessorFactory [collection1] webapp=/solr path=/update params={wt=javabin&version=2}{add=[55]} 0 0
[junit4] 2> 265106 INFO (qtp1228411028-1742) [ x:collection1] o.a.s.u.p.LogUpdateProcessorFactory [collection1] webapp=/solr path=/update params={wt=javabin&version=2}{add=[56]} 0 0
[junit4] 2> 265108 INFO (qtp1228411028-1743) [ x:collection1] o.a.s.u.p.LogUpdateProcessorFactory [collection1] webapp=/solr path=/update params={wt=javabin&version=2}{add=[57]} 0 0
[junit4] 2> 265110 INFO (qtp1228411028-1741) [ x:collection1] o.a.s.u.p.LogUpdateProcessorFactory [collection1] webapp=/solr path=/update params={wt=javabin&version=2}{add=[58]} 0 0
[junit4] 2> 265112 INFO (qtp1228411028-1742) [ x:collection1] o.a.s.u.p.LogUpdateProcessorFactory [collection1] webapp=/solr path=/update params={wt=javabin&version=2}{add=[59]} 0 0
[junit4] 2> 265114 INFO (qtp1228411028-1743) [ x:collection1] o.a.s.u.p.LogUpdateProcessorFactory [collection1] webapp=/solr path=/update params={wt=javabin&version=2}{add=[60]} 0 0
[junit4] 2> 265116 INFO (qtp1228411028-1741) [ x:collection1] o.a.s.u.p.LogUpdateProcessorFactory [collection1] webapp=/solr path=/update params={wt=javabin&version=2}{add=[61]} 0 0
[junit4] 2> 265118 INFO (qtp1228411028-1742) [ x:collection1] o.a.s.u.p.LogUpdateProcessorFactory [collection1] webapp=/solr path=/update params={wt=javabin&version=2}{add=[62]} 0 0
[junit4] 2> 265120 INFO (qtp1228411028-1743) [ x:collection1] o.a.s.u.p.LogUpdateProcessorFactory [collection1] webapp=/solr path=/update params={wt=javabin&version=2}{add=[63]} 0 0
[junit4] 2> 265122 INFO (qtp1228411028-1741) [ x:collection1] o.a.s.u.p.LogUpdateProcessorFactory [collection1] webapp=/solr path=/update params={wt=javabin&version=2}{add=[64]} 0 0
[junit4] 2> 265124 INFO (qtp1228411028-1742) [ x:collection1] o.a.s.u.p.LogUpdateProcessorFactory [collection1] webapp=/solr path=/update params={wt=javabin&version=2}{add=[65]} 0 0
[junit4] 2> 265126 INFO (qtp1228411028-1743) [ x:collection1] o.a.s.u.p.LogUpdateProcessorFactory [collection1] webapp=/solr path=/update params={wt=javabin&version=2}{add=[66]} 0 0
[junit4] 2> 265128 INFO (qtp1228411028-1741) [ x:collection1] o.a.s.u.p.LogUpdateProcessorFactory [collection1] webapp=/solr path=/update params={wt=javabin&version=2}{add=[67]} 0 0
[junit4] 2> 265130 INFO (qtp1228411028-1742) [ x:collection1] o.a.s.u.p.LogUpdateProcessorFactory [collection1] webapp=/solr path=/update params={wt=javabin&version=2}{add=[68]} 0 0
[junit4] 2> 265132 INFO (qtp1228411028-1743) [ x:collection1] o.a.s.u.p.LogUpdateProcessorFactory [collection1] webapp=/solr path=/update params={wt=javabin&version=2}{add=[69]} 0 0
[junit4] 2> 265134 INFO (qtp1228411028-1741) [ x:collection1] o.a.s.u.p.LogUpdateProcessorFactory [collection1] webapp=/solr path=/update params={wt=javabin&version=2}{add=[70]} 0 0
[junit4] 2> 265136 INFO (qtp1228411028-1742) [ x:collection1] o.a.s.u.p.LogUpdateProcessorFactory [collection1] webapp=/solr path=/update params={wt=javabin&version=2}{add=[71]} 0 0
[junit4] 2> 265138 INFO (qtp1228411028-1743) [ x:collection1] o.a.s.u.p.LogUpdateProcessorFactory [collection1] webapp=/solr path=/update params={wt=javabin&version=2}{add=[72]} 0 0
[junit4] 2> 265140 INFO (qtp1228411028-1741) [ x:collection1] o.a.s.u.p.LogUpdateProcessorFactory [collection1] webapp=/solr path=/update params={wt=javabin&version=2}{add=[73]} 0 0
[junit4] 2> 265142 INFO (qtp1228411028-1742) [ x:collection1] o.a.s.u.p.LogUpdateProcessorFactory [collection1] webapp=/solr path=/update params={wt=javabin&version=2}{add=[74]} 0 0
[junit4] 2> 265144 INFO (qtp1228411028-1743) [ x:collection1] o.a.s.u.p.LogUpdateProcessorFactory [collection1] webapp=/solr path=/update params={wt=javabin&version=2}{add=[75]} 0 0
[junit4] 2> 265146 INFO (qtp1228411028-1741) [ x:collection1] o.a.s.u.p.LogUpdateProcessorFactory [collection1] webapp=/solr path=/update params={wt=javabin&version=2}{add=[76]} 0 0
[junit4] 2> 265148 INFO (qtp1228411028-1742) [ x:collection1] o.a.s.u.p.LogUpdateProcessorFactory [collection1] webapp=/solr path=/update params={wt=javabin&version=2}{add=[77]} 0 0
[junit4] 2> 265150 INFO (qtp1228411028-1743) [ x:collection1] o.a.s.u.p.LogUpdateProcessorFactory [collection1] webapp=/solr path=/update params={wt=javabin&version=2}{add=[78]} 0 0
[junit4] 2> 265152 INFO (qtp1228411028-1741) [ x:collection1] o.a.s.u.p.LogUpdateProcessorFactory [collection1] webapp=/solr path=/update params={wt=javabin&version=2}{add=[79]} 0 0
[junit4] 2> 265154 INFO (qtp1228411028-1742) [ x:collection1] o.a.s.u.p.LogUpdateProcessorFactory [collection1] webapp=/solr path=/update params={wt=javabin&version=2}{add=[80]} 0 0
[junit4] 2> 265156 INFO (qtp1228411028-1743) [ x:collection1] o.a.s.u.p.LogUpdateProcessorFactory [collection1] webapp=/solr path=/update params={wt=javabin&version=2}{add=[81]} 0 0
[junit4] 2> 265158 INFO (qtp1228411028-1741) [ x:collection1] o.a.s.u.p.LogUpdateProcessorFactory [collection1] webapp=/solr path=/update params={wt=javabin&version=2}{add=[82]} 0 0
[junit4] 2> 265160 INFO (qtp1228411028-1742) [ x:collection1] o.a.s.u.p.LogUpdateProcessorFactory [collection1] webapp=/solr path=/update params={wt=javabin&version=2}{add=[83]} 0 0
[junit4] 2> 265162 INFO (qtp1228411028-1743) [ x:collection1] o.a.s.u.p.LogUpdateProcessorFactory [collection1] webapp=/solr path=/update params={wt=javabin&version=2}{add=[84]} 0 0
[junit4] 2> 265164 INFO (qtp1228411028-1741) [ x:collection1] o.a.s.u.p.LogUpdateProcessorFactory [collection1] webapp=/solr path=/update params={wt=javabin&version=2}{add=[85]} 0 0
[junit4] 2> 265166 INFO (qtp1228411028-1742) [ x:collection1] o.a.s.u.p.LogUpdateProcessorFactory [collection1] webapp=/solr path=/update params={wt=javabin&version=2}{add=[86]} 0 0
[junit4] 2> 265168 INFO (qtp1228411028-1743) [ x:collection1] o.a.s.u.p.LogUpdateProcessorFactory [collection1] webapp=/solr path=/update params={wt=javabin&version=2}{add=[87]} 0 0
[junit4] 2> 265170 INFO (qtp1228411028-1741) [ x:collection1] o.a.s.u.p.LogUpdateProcessorFactory [collection1] webapp=/solr path=/update params={wt=javabin&version=2}{add=[88]} 0 0
[junit4] 2> 265172 INFO (qtp1228411028-1742) [ x:collection1] o.a.s.u.p.LogUpdateProcessorFactory [collection1] webapp=/solr path=/update params={wt=javabin&version=2}{add=[89]} 0 0
[junit4] 2> 265175 INFO (qtp1228411028-1743) [ x:collection1] o.a.s.u.p.LogUpdateProcessorFactory [collection1] webapp=/solr path=/update params={wt=javabin&version=2}{add=[90]} 0 0
[junit4] 2> 265177 INFO (qtp1228411028-1741) [ x:collection1] o.a.s.u.p.LogUpdateProcessorFactory [collection1] webapp=/solr path=/update params={wt=javabin&version=2}{add=[91]} 0 0
[junit4] 2> 265179 INFO (qtp1228411028-1742) [ x:collection1] o.a.s.u.p.LogUpdateProcessorFactory [collection1] webapp=/solr path=/update params={wt=javabin&version=2}{add=[92]} 0 0
[junit4] 2> 265181 INFO (qtp1228411028-1743) [ x:collection1] o.a.s.u.p.LogUpdateProcessorFactory [collection1] webapp=/solr path=/update params={wt=javabin&version=2}{add=[93]} 0 0
[junit4] 2> 265183 INFO (qtp1228411028-1741) [ x:collection1] o.a.s.u.p.LogUpdateProcessorFactory [collection1] webapp=/solr path=/update params={wt=javabin&version=2}{add=[94]} 0 0
[junit4] 2> 265185 INFO (qtp1228411028-1742) [ x:collection1] o.a.s.u.p.LogUpdateProcessorFactory [collection1] webapp=/solr path=/update params={wt=javabin&version=2}{add=[95]} 0 0
[junit4] 2> 265187 INFO (qtp1228411028-1743) [ x:collection1] o.a.s.u.p.LogUpdateProcessorFactory [collection1] webapp=/solr path=/update params={wt=javabin&version=2}{add=[96]} 0 0
[junit4] 2> 265188 INFO (qtp1228411028-1741) [ x:collection1] o.a.s.u.p.LogUpdateProcessorFactory [collection1] webapp=/solr path=/update params={wt=javabin&version=2}{add=[97]} 0 0
[junit4] 2> 265191 INFO (qtp1228411028-1742) [ x:collection1] o.a.s.u.p.LogUpdateProcessorFactory [collection1] webapp=/solr path=/update params={wt=javabin&version=2}{add=[98]} 0 0
[junit4] 2> 265192 INFO (qtp1228411028-1743) [ x:collection1] o.a.s.u.p.LogUpdateProcessorFactory [collection1] webapp=/solr path=/update params={wt=javabin&version=2}{add=[99]} 0 0
[junit4] 2> 265195 INFO (qtp1228411028-1741) [ x:collection1] o.a.s.u.p.LogUpdateProcessorFactory [collection1] webapp=/solr path=/update params={wt=javabin&version=2}{add=[100]} 0 0
[junit4] 2> 265197 INFO (qtp1228411028-1742) [ x:collection1] o.a.s.u.p.LogUpdateProcessorFactory [collection1] webapp=/solr path=/update params={wt=javabin&version=2}{add=[101]} 0 0
[junit4] 2> 265198 INFO (qtp1228411028-1743) [ x:collection1] o.a.s.u.p.LogUpdateProcessorFactory [collection1] webapp=/solr path=/update params={wt=javabin&version=2}{add=[102]} 0 0
[junit4] 2> 265200 INFO (qtp1228411028-1741) [ x:collection1] o.a.s.u.p.LogUpdateProcessorFactory [collection1] webapp=/solr path=/update params={wt=javabin&version=2}{add=[103]} 0 0
[junit4] 2> 265203 INFO (qtp1228411028-1742) [ x:collection1] o.a.s.u.p.LogUpdateProcessorFactory [collection1] webapp=/solr path=/update params={wt=javabin&version=2}{add=[104]} 0 0
[junit4] 2> 265204 INFO (qtp1228411028-1743) [ x:collection1] o.a.s.u.p.LogUpdateProcessorFactory [collection1] webapp=/solr path=/update params={wt=javabin&version=2}{add=[105]} 0 0
[junit4] 2> 265207 INFO (qtp1228411028-1741) [ x:collection1] o.a.s.u.p.LogUpdateProcessorFactory [collection1] webapp=/solr path=/update params={wt=javabin&version=2}{add=[106]} 0 0
[junit4] 2> 265208 INFO (qtp1228411028-1742) [ x:collection1] o.a.s.u.p.LogUpdateProcessorFactory [collection1] webapp=/solr path=/update params={wt=javabin&version=2}{add=[107]} 0 0
[junit4] 2> 265210 INFO (qtp1228411028-1743) [ x:collection1] o.a.s.u.p.LogUpdateProcessorFactory [collection1] webapp=/solr path=/update params={wt=javabin&version=2}{add=[108]} 0 0
[junit4] 2> 265212 INFO (qtp1228411028-1741) [ x:collection1] o.a.s.u.p.LogUpdateProcessorFactory [collection1] webapp=/solr path=/update params={wt=javabin&version=2}{add=[109]} 0 0
[junit4] 2> 265215 INFO (qtp1228411028-1742) [ x:collection1] o.a.s.u.p.LogUpdateProcessorFactory [collection1] webapp=/solr path=/update params={wt=javabin&version=2}{add=[110]} 0 0
[junit4] 2> 265217 INFO (qtp1228411028-1743) [ x:collection1] o.a.s.u.p.LogUpdateProcessorFactory [collection1] webapp=/solr path=/update params={wt=javabin&version=2}{add=[111]} 0 0
[junit4] 2> 265218 INFO (qtp1228411028-1741) [ x:collection1] o.a.s.u.p.LogUpdateProcessorFactory [collection1] webapp=/solr path=/update params={wt=javabin&version=2}{add=[112]} 0 0
[junit4] 2> 265220 INFO (qtp1228411028-1742) [ x:collection1] o.a.s.u.p.LogUpdateProcessorFactory [collection1] webapp=/solr path=/update params={wt=javabin&version=2}{add=[113]} 0 0
[junit4] 2> 265223 INFO (qtp1228411028-1743) [ x:collection1] o.a.s.u.p.LogUpdateProcessorFactory [collection1] webapp=/solr path=/update params={wt=javabin&version=2}{add=[114]} 0 0
[junit4] 2> 265225 INFO (qtp1228411028-1741) [ x:collection1] o.a.s.u.p.LogUpdateProcessorFactory [collection1] webapp=/solr path=/update params={wt=javabin&version=2}{add=[115]} 0 0
[junit4] 2> 265227 INFO (qtp1228411028-1742) [ x:collection1] o.a.s.u.p.LogUpdateProcessorFactory [collection1] webapp=/solr path=/update params={wt=javabin&version=2}{add=[116]} 0 0
[junit4] 2> 265229 INFO (qtp1228411028-1743) [ x:collection1] o.a.s.u.p.LogUpdateProcessorFactory [collection1] webapp=/solr path=/update params={wt=javabin&version=2}{add=[117]} 0 0
[junit4] 2> 265231 INFO (qtp1228411028-1741) [ x:collection1] o.a.s.u.p.LogUpdateProcessorFactory [collection1] webapp=/solr path=/update params={wt=javabin&version=2}{add=[118]} 0 0
[junit4] 2> 265232 INFO (qtp1228411028-1742) [ x:collection1] o.a.s.u.p.LogUpdateProcessorFactory [collection1] webapp=/solr path=/update params={wt=javabin&version=2}{add=[119]} 0 0
[junit4] 2> 265234 INFO (qtp1228411028-1743) [ x:collection1] o.a.s.u.p.LogUpdateProcessorFactory [collection1] webapp=/solr path=/update params={wt=javabin&version=2}{add=[120]} 0 0
[junit4] 2> 265236 INFO (qtp1228411028-1741) [ x:collection1] o.a.s.u.p.LogUpdateProcessorFactory [collection1] webapp=/solr path=/update params={wt=javabin&version=2}{add=[121]} 0 0
[junit4] 2> 265239 INFO (qtp1228411028-1742) [ x:collection1] o.a.s.u.p.LogUpdateProcessorFactory [collection1] webapp=/solr path=/update params={wt=javabin&version=2}{add=[122]} 0 0
[junit4] 2> 265241 INFO (qtp1228411028-1743) [ x:collection1] o.a.s.u.p.LogUpdateProcessorFactory [collection1] webapp=/solr path=/update params={wt=javabin&version=2}{add=[123]} 0 0
[junit4] 2> 265243 INFO (qtp1228411028-1741) [ x:collection1] o.a.s.u.p.LogUpdateProcessorFactory [collection1] webapp=/solr path=/update params={wt=javabin&version=2}{add=[124]} 0 0
[junit4] 2> 265245 INFO (qtp1228411028-1742) [ x:collection1] o.a.s.u.p.LogUpdateProcessorFactory [collection1] webapp=/solr path=/update params={wt=javabin&version=2}{add=[125]} 0 0
[junit4] 2> 265246 INFO (qtp1228411028-1743) [ x:collection1] o.a.s.u.p.LogUpdateProcessorFactory [collection1] webapp=/solr path=/update params={wt=javabin&version=2}{add=[126]} 0 0
[junit4] 2> 265248 INFO (qtp1228411028-1741) [ x:collection1] o.a.s.u.p.LogUpdateProcessorFactory [collection1] webapp=/solr path=/update params={wt=javabin&version=2}{add=[127]} 0 0
[junit4] 2> 265251 INFO (qtp1228411028-1742) [ x:collection1] o.a.s.u.p.LogUpdateProcessorFactory [collection1] webapp=/solr path=/update params={wt=javabin&version=2}{add=[128]} 0 0
[junit4] 2> 265253 INFO (qtp1228411028-1743) [ x:collection1] o.a.s.u.p.LogUpdateProcessorFactory [collection1] webapp=/solr path=/update params={wt=javabin&version=2}{add=[129]} 0 0
[junit4] 2> 265254 INFO (qtp1228411028-1741) [ x:collection1] o.a.s.u.p.LogUpdateProcessorFactory [collection1] webapp=/solr path=/update params={wt=javabin&version=2}{add=[130]} 0 0
[junit4] 2> 265256 INFO (qtp1228411028-1742) [ x:collection1] o.a.s.u.p.LogUpdateProcessorFactory [collection1] webapp=/solr path=/update params={wt=javabin&version=2}{add=[131]} 0 0
[junit4] 2> 265258 INFO (qtp1228411028-1743) [ x:collection1] o.a.s.u.p.LogUpdateProcessorFactory [collection1] webapp=/solr path=/update params={wt=javabin&version=2}{add=[132]} 0 0
[junit4] 2> 265260 INFO (qtp1228411028-1741) [ x:collection1] o.a.s.u.p.LogUpdateProcessorFactory [collection1] webapp=/solr path=/update params={wt=javabin&version=2}{add=[133]} 0 0
[junit4] 2> 265263 INFO (qtp1228411028-1742) [ x:collection1] o.a.s.u.p.LogUpdateProcessorFactory [collection1] webapp=/solr path=/update params={wt=javabin&version=2}{add=[134]} 0 0
[junit4] 2> 265265 INFO (qtp1228411028-1743) [ x:collection1] o.a.s.u.p.LogUpdateProcessorFactory [collection1] webapp=/solr path=/update params={wt=javabin&version=2}{add=[135]} 0 0
[junit4] 2> 265266 INFO (qtp1228411028-1741) [ x:collection1] o.a.s.u.p.LogUpdateProcessorFactory [collection1] webapp=/solr path=/update params={wt=javabin&version=2}{add=[136]} 0 0
[junit4] 2> 265268 INFO (qtp1228411028-1742) [ x:collection1] o.a.s.u.p.LogUpdateProcessorFactory [collection1] webapp=/solr path=/update params={wt=javabin&version=2}{add=[137]} 0 0
[junit4] 2> 265270 INFO (qtp1228411028-1743) [ x:collection1] o.a.s.u.p.LogUpdateProcessorFactory [collection1] webapp=/solr path=/update params={wt=javabin&version=2}{add=[138]} 0 0
[junit4] 2> 265272 INFO (qtp1228411028-1741) [ x:collection1] o.a.s.u.p.LogUpdateProcessorFactory [collection1] webapp=/solr path=/update params={wt=javabin&version=2}{add=[139]} 0 0
[junit4] 2> 265275 INFO (qtp1228411028-1742) [ x:collection1] o.a.s.u.p.LogUpdateProcessorFactory [collection1] webapp=/solr path=/update params={wt=javabin&version=2}{add=[140]} 0 0
[junit4] 2> 265277 INFO (qtp1228411028-1743) [ x:collection1] o.a.s.u.p.LogUpdateProcessorFactory [collection1] webapp=/solr path=/update params={wt=javabin&version=2}{add=[141]} 0 0
[junit4] 2> 265278 INFO (qtp1228411028-1741) [ x:collection1] o.a.s.u.p.LogUpdateProcessorFactory [collection1] webapp=/solr path=/update params={wt=javabin&version=2}{add=[142]} 0 0
[junit4] 2> 265280 INFO (qtp1228411028-1742) [ x:collection1] o.a.s.u.p.LogUpdateProcessorFactory [collection1] webapp=/solr path=/update params={wt=javabin&version=2}{add=[143]} 0 0
[junit4] 2> 265282 INFO (qtp1228411028-1743) [ x:collection1] o.a.s.u.p.LogUpdateProcessorFactory [collection1] webapp=/solr path=/update params={wt=javabin&version=2}{add=[144]} 0 0
[junit4] 2> 265284 INFO (qtp1228411028-1741) [ x:collection1] o.a.s.u.p.LogUpdateProcessorFactory [collection1] webapp=/solr path=/update params={wt=javabin&version=2}{add=[145]} 0 0
[junit4] 2> 265286 INFO (qtp1228411028-1742) [ x:collection1] o.a.s.u.p.LogUpdateProcessorFactory [collection1] webapp=/solr path=/update params={wt=javabin&version=2}{add=[146]} 0 0
[junit4] 2> 265288 INFO (qtp1228411028-1743) [ x:collection1] o.a.s.u.p.LogUpdateProcessorFactory [collection1] webapp=/solr path=/update params={wt=javabin&version=2}{add=[147]} 0 0
[junit4] 2> 265290 INFO (qtp1228411028-1741) [ x:collection1] o.a.s.u.p.LogUpdateProcessorFactory [collection1] webapp=/solr path=/update params={wt=javabin&version=2}{add=[148]} 0 0
[junit4] 2> 265292 INFO (qtp1228411028-1742) [ x:collection1] o.a.s.u.p.LogUpdateProcessorFactory [collection1] webapp=/solr path=/update params={wt=javabin&version=2}{add=[149]} 0 0
[junit4] 2> 265294 INFO (qtp1228411028-1743) [ x:collection1] o.a.s.u.p.LogUpdateProcessorFactory [collection1] webapp=/solr path=/update params={wt=javabin&version=2}{add=[150]} 0 0
[junit4] 2> 265296 INFO (qtp1228411028-1741) [ x:collection1] o.a.s.u.p.LogUpdateProcessorFactory [collection1] webapp=/solr path=/update params={wt=javabin&version=2}{add=[151]} 0 0
[junit4] 2> 265299 INFO (qtp1228411028-1742) [ x:collection1] o.a.s.u.p.LogUpdateProcessorFactory [collection1] webapp=/solr path=/update params={wt=javabin&version=2}{add=[152]} 0 0
[junit4] 2> 265303 INFO (qtp1228411028-1743) [ x:collection1] o.a.s.u.p.LogUpdateProcessorFactory [collection1] webapp=/solr path=/update params={wt=javabin&version=2}{add=[153]} 0 2
[junit4] 2> 265306 INFO (qtp1228411028-1741) [ x:collection1] o.a.s.u.p.LogUpdateProcessorFactory [collection1] webapp=/solr path=/update params={wt=javabin&version=2}{add=[154]} 0 0
[junit4] 2> 265308 INFO (qtp1228411028-1742) [ x:collection1] o.a.s.u.p.LogUpdateProcessorFactory [collection1] webapp=/solr path=/update params={wt=javabin&version=2}{add=[155]} 0 0
[junit4] 2> 265309 INFO (qtp1228411028-1743) [ x:collection1] o.a.s.u.p.LogUpdateProcessorFactory [collection1] webapp=/solr path=/update params={wt=javabin&version=2}{add=[156]} 0 0
[junit4] 2> 265311 INFO (qtp1228411028-1741) [ x:collection1] o.a.s.u.p.LogUpdateProcessorFactory [collection1] webapp=/solr path=/update params={wt=javabin&version=2}{add=[157]} 0 0
[junit4] 2> 265313 INFO (qtp1228411028-1742) [ x:collection1] o.a.s.u.p.LogUpdateProcessorFactory [collection1] webapp=/solr path=/update params={wt=javabin&version=2}{add=[158]} 0 0
[junit4] 2> 265315 INFO (qtp1228411028-1743) [ x:collection1] o.a.s.u.p.LogUpdateProcessorFactory [collection1] webapp=/solr path=/update params={wt=javabin&version=2}{add=[159]} 0 0
[junit4] 2> 265317 INFO (qtp1228411028-1741) [ x:collection1] o.a.s.u.p.LogUpdateProcessorFactory [collection1] webapp=/solr path=/update params={wt=javabin&version=2}{add=[160]} 0 0
[junit4] 2> 265319 INFO (qtp1228411028-1742) [ x:collection1] o.a.s.u.p.LogUpdateProcessorFactory [collection1] webapp=/solr path=/update params={wt=javabin&version=2}{add=[161]} 0 0
[junit4] 2> 265354 INFO (qtp1228411028-1743) [ x:collection1] o.a.s.u.p.LogUpdateProcessorFactory [collection1] webapp=/solr path=/update params={wt=javabin&version=2}{add=[162]} 0 0
[junit4] 2> 265356 INFO (qtp1228411028-1741) [ x:collection1] o.a.s.u.p.LogUpdateProcessorFactory [collection1] webapp=/solr path=/update params={wt=javabin&version=2}{add=[163]} 0 0
[junit4] 2> 265358 INFO (qtp1228411028-1742) [ x:collection1] o.a.s.u.p.LogUpdateProcessorFactory [collection1] webapp=/solr path=/update params={wt=javabin&version=2}{add=[164]} 0 0
[junit4] 2> 265360 INFO (qtp1228411028-1743) [ x:collection1] o.a.s.u.p.LogUpdateProcessorFactory [collection1] webapp=/solr path=/update params={wt=javabin&version=2}{add=[165]} 0 0
[junit4] 2> 265363 INFO (qtp1228411028-1741) [ x:collection1] o.a.s.u.p.LogUpdateProcessorFactory [collection1] webapp=/solr path=/update params={wt=javabin&version=2}{add=[166]} 0 0
[junit4] 2> 265365 INFO (qtp1228411028-1742) [ x:collection1] o.a.s.u.p.LogUpdateProcessorFactory [collection1] webapp=/solr path=/update params={wt=javabin&version=2}{add=[167]} 0 0
[junit4] 2> 265366 INFO (qtp1228411028-1743) [ x:collection1] o.a.s.u.p.LogUpdateProcessorFactory [collection1] webapp=/solr path=/update params={wt=javabin&version=2}{add=[168]} 0 0
[junit4] 2> 265368 INFO (qtp1228411028-1741) [ x:collection1] o.a.s.u.p.LogUpdateProcessorFactory [collection1] webapp=/solr path=/update params={wt=javabin&version=2}{add=[169]} 0 0
[junit4] 2> 265370 INFO (qtp1228411028-1742) [ x:collection1] o.a.s.u.p.LogUpdateProcessorFactory [collection1] webapp=/solr path=/update params={wt=javabin&version=2}{add=[170]} 0 0
[junit4] 2> 265372 INFO (qtp1228411028-1743) [ x:collection1] o.a.s.u.p.LogUpdateProcessorFactory [collection1] webapp=/solr path=/update params={wt=javabin&version=2}{add=[171]} 0 0
[junit4] 2> 265375 INFO (qtp1228411028-1741) [ x:collection1] o.a.s.u.p.LogUpdateProcessorFactory [collection1] webapp=/solr path=/update params={wt=javabin&version=2}{add=[172]} 0 0
[junit4] 2> 265376 INFO (qtp1228411028-1742) [ x:collection1] o.a.s.u.p.LogUpdateProcessorFactory [collection1] webapp=/solr path=/update params={wt=javabin&version=2}{add=[173]} 0 0
[junit4] 2> 265378 INFO (qtp1228411028-1743) [ x:collection1] o.a.s.u.p.LogUpdateProcessorFactory [collection1] webapp=/solr path=/update params={wt=javabin&version=2}{add=[174]} 0 0
[junit4] 2> 265380 INFO (qtp1228411028-1741) [ x:collection1] o.a.s.u.p.LogUpdateProcessorFactory [collection1] webapp=/solr path=/update params={wt=javabin&version=2}{add=[175]} 0 0
[junit4] 2> 265382 INFO (qtp1228411028-1742) [ x:collection1] o.a.s.u.p.LogUpdateProcessorFactory [collection1] webapp=/solr path=/update params={wt=javabin&version=2}{add=[176]} 0 0
[junit4] 2> 265384 INFO (qtp1228411028-1743) [ x:collection1] o.a.s.u.p.LogUpdateProcessorFactory [collection1] webapp=/solr path=/update params={wt=javabin&version=2}{add=[177]} 0 0
[junit4] 2> 265386 INFO (qtp1228411028-1741) [ x:collection1] o.a.s.u.p.LogUpdateProcessorFactory [collection1] webapp=/solr path=/update params={wt=javabin&version=2}{add=[178]} 0 0
[junit4] 2> 265388 INFO (qtp1228411028-1742) [ x:collection1] o.a.s.u.p.LogUpdateProcessorFactory [collection1] webapp=/solr path=/update params={wt=javabin&version=2}{add=[179]} 0 0
[junit4] 2> 265390 INFO (qtp1228411028-1743) [ x:collection1] o.a.s.u.p.LogUpdateProcessorFactory [collection1] webapp=/solr path=/update params={wt=javabin&version=2}{add=[180]} 0 0
[junit4] 2> 265392 INFO (qtp1228411028-1741) [ x:collection1] o.a.s.u.p.LogUpdateProcessorFactory [collection1] webapp=/solr path=/update params={wt=javabin&version=2}{add=[181]} 0 0
[junit4] 2> 265395 INFO (qtp1228411028-1742) [ x:collection1] o.a.s.u.p.LogUpdateProcessorFactory [collection1] webapp=/solr path=/update params={wt=javabin&version=2}{add=[182]} 0 0
[junit4] 2> 265397 INFO (qtp1228411028-1743) [ x:collection1] o.a.s.u.p.LogUpdateProcessorFactory [collection1] webapp=/solr path=/update params={wt=javabin&version=2}{add=[183]} 0 0
[junit4] 2> 265398 INFO (qtp1228411028-1741) [ x:collection1] o.a.s.u.p.LogUpdateProcessorFactory [collection1] webapp=/solr path=/update params={wt=javabin&version=2}{add=[184]} 0 0
[junit4] 2> 265400 INFO (qtp1228411028-1742) [ x:collection1] o.a.s.u.p.LogUpdateProcessorFactory [collection1] webapp=/solr path=/update params={wt=javabin&version=2}{add=[185]} 0 0
[junit4] 2> 265402 INFO (qtp1228411028-1743) [ x:collection1] o.a.s.u.p.LogUpdateProcessorFactory [collection1] webapp=/solr path=/update params={wt=javabin&version=2}{add=[186]} 0 0
[junit4] 2> 265404 INFO (qtp1228411028-1741) [ x:collection1] o.a.s.u.p.LogUpdateProcessorFactory [collection1] webapp=/solr path=/update params={wt=javabin&version=2}{add=[187]} 0 0
[junit4] 2> 265407 INFO (qtp1228411028-1742) [ x:collection1] o.a.s.u.p.LogUpdateProcessorFactory [collection1] webapp=/solr path=/update params={wt=javabin&version=2}{add=[188]} 0 0
[junit4] 2> 265409 INFO (qtp1228411028-1743) [ x:collection1] o.a.s.u.p.LogUpdateProcessorFactory [collection1] webapp=/solr path=/update params={wt=javabin&version=2}{add=[189]} 0 0
[junit4] 2> 265410 INFO (qtp1228411028-1741) [ x:collection1] o.a.s.u.p.LogUpdateProcessorFactory [collection1] webapp=/solr path=/update params={wt=javabin&version=2}{add=[190]} 0 0
[junit4] 2> 265413 INFO (qtp1228411028-1742) [ x:collection1] o.a.s.u.p.LogUpdateProcessorFactory [collection1] webapp=/solr path=/update params={wt=javabin&version=2}{add=[191]} 0 0
[junit4] 2> 265414 INFO (qtp1228411028-1743) [ x:collection1] o.a.s.u.p.LogUpdateProcessorFactory [collection1] webapp=/solr path=/update params={wt=javabin&version=2}{add=[192]} 0 0
[junit4] 2> 265416 INFO (qtp1228411028-1741) [ x:collection1] o.a.s.u.p.LogUpdateProcessorFactory [collection1] webapp=/solr path=/update params={wt=javabin&version=2}{add=[193]} 0 0
[junit4] 2> 265418 INFO (qtp1228411028-1742) [ x:collection1] o.a.s.u.p.LogUpdateProcessorFactory [collection1] webapp=/solr path=/update params={wt=javabin&version=2}{add=[194]} 0 0
[junit4] 2> 265420 INFO (qtp1228411028-1743) [ x:collection1] o.a.s.u.p.LogUpdateProcessorFactory [collection1] webapp=/solr path=/update params={wt=javabin&version=2}{add=[195]} 0 0
[junit4] 2> 265422 INFO (qtp1228411028-1741) [ x:collection1] o.a.s.u.p.LogUpdateProcessorFactory [collection1] webapp=/solr path=/update params={wt=javabin&version=2}{add=[196]} 0 0
[junit4] 2> 265424 INFO (qtp1228411028-1742) [ x:collection1] o.a.s.u.p.LogUpdateProcessorFactory [collection1] webapp=/solr path=/update params={wt=javabin&version=2}{add=[197]} 0 0
[junit4] 2> 265426 INFO (qtp1228411028-1743) [ x:collection1] o.a.s.u.p.LogUpdateProcessorFactory [collection1] webapp=/solr path=/update params={wt=javabin&version=2}{add=[198]} 0 0
[junit4] 2> 265452 INFO (qtp1228411028-1741) [ x:collection1] o.a.s.u.p.LogUpdateProcessorFactory [collection1] webapp=/solr path=/update params={wt=javabin&version=2}{add=[199]} 0 0
[junit4] 2> 265454 INFO (qtp1228411028-1742) [ x:collection1] o.a.s.u.p.LogUpdateProcessorFactory [collection1] webapp=/solr path=/update params={wt=javabin&version=2}{add=[200]} 0 0
[junit4] 2> 265456 INFO (qtp1228411028-1743) [ x:collection1] o.a.s.u.p.LogUpdateProcessorFactory [collection1] webapp=/solr path=/update params={wt=javabin&version=2}{add=[201]} 0 0
[junit4] 2> 265458 INFO (qtp1228411028-1741) [ x:collection1] o.a.s.u.p.LogUpdateProcessorFactory [collection1] webapp=/solr path=/update params={wt=javabin&version=2}{add=[202]} 0 0
[junit4] 2> 265460 INFO (qtp1228411028-1742) [ x:collection1] o.a.s.u.p.LogUpdateProcessorFactory [collection1] webapp=/solr path=/update params={wt=javabin&version=2}{add=[203]} 0 0
[junit4] 2> 265462 INFO (qtp1228411028-1743) [ x:collection1] o.a.s.u.p.LogUpdateProcessorFactory [collection1] webapp=/solr path=/update params={wt=javabin&version=2}{add=[204]} 0 0
[junit4] 2> 265464 INFO (qtp1228411028-1741) [ x:collection1] o.a.s.u.p.LogUpdateProcessorFactory [collection1] webapp=/solr path=/update params={wt=javabin&version=2}{add=[205]} 0 0
[junit4] 2> 265465 INFO (qtp1228411028-1742) [ x:collection1] o.a.s.u.p.LogUpdateProcessorFactory [collection1] webapp=/solr path=/update params={wt=javabin&version=2}{add=[206]} 0 0
[junit4] 2> 265467 INFO (qtp1228411028-1743) [ x:collection1] o.a.s.u.p.LogUpdateProcessorFactory [collection1] webapp=/solr path=/update params={wt=javabin&version=2}{add=[207]} 0 0
[junit4] 2> 265469 INFO (qtp1228411028-1741) [ x:collection1] o.a.s.u.p.LogUpdateProcessorFactory [collection1] webapp=/solr path=/update params={wt=javabin&version=2}{add=[208]} 0 0
[junit4] 2> 265471 INFO (qtp1228411028-1742) [ x:collection1] o.a.s.u.p.LogUpdateProcessorFactory [collection1] webapp=/solr path=/update params={wt=javabin&version=2}{add=[209]} 0 0
[junit4] 2> 265473 INFO (qtp1228411028-1743) [ x:collection1] o.a.s.u.p.LogUpdateProcessorFactory [collection1] webapp=/solr path=/update params={wt=javabin&version=2}{add=[210]} 0 0
[junit4] 2> 265475 INFO (qtp1228411028-1741) [ x:collection1] o.a.s.u.p.LogUpdateProcessorFactory [collection1] webapp=/solr path=/update params={wt=javabin&version=2}{add=[211]} 0 0
[junit4] 2> 265476 INFO (qtp1228411028-1742) [ x:collection1] o.a.s.u.p.LogUpdateProcessorFactory [collection1] webapp=/solr path=/update params={wt=javabin&version=2}{add=[212]} 0 0
[junit4] 2> 265479 INFO (qtp1228411028-1743) [ x:collection1] o.a.s.u.p.LogUpdateProcessorFactory [collection1] webapp=/solr path=/update params={wt=javabin&version=2}{add=[213]} 0 0
[junit4] 2> 265481 INFO (qtp1228411028-1741) [ x:collection1] o.a.s.u.p.LogUpdateProcessorFactory [collection1] webapp=/solr path=/update params={wt=javabin&version=2}{add=[214]} 0 0
[junit4] 2> 265483 INFO (qtp1228411028-1742) [ x:collection1] o.a.s.u.p.LogUpdateProcessorFactory [collection1] webapp=/solr path=/update params={wt=javabin&version=2}{add=[215]} 0 0
[junit4] 2> 265485 INFO (qtp1228411028-1743) [ x:collection1] o.a.s.u.p.LogUpdateProcessorFactory [collection1] webapp=/solr path=/update params={wt=javabin&version=2}{add=[216]} 0 0
[junit4] 2> 265486 INFO (qtp1228411028-1741) [ x:collection1] o.a.s.u.p.LogUpdateProcessorFactory [collection1] webapp=/solr path=/update params={wt=javabin&version=2}{add=[217]} 0 0
[junit4] 2> 265488 INFO (qtp1228411028-1742) [ x:collection1] o.a.s.u.p.LogUpdateProcessorFactory [collection1] webapp=/solr path=/update params={wt=javabin&version=2}{add=[218]} 0 0
[junit4] 2> 265491 INFO (qtp1228411028-1743) [ x:collection1] o.a.s.u.p.LogUpdateProcessorFactory [collection1] webapp=/solr path=/update params={wt=javabin&version=2}{add=[219]} 0 0
[junit4] 2> 265493 INFO (qtp1228411028-1741) [ x:collection1] o.a.s.u.p.LogUpdateProcessorFactory [collection1] webapp=/solr path=/update params={wt=javabin&version=2}{add=[220]} 0 0
[junit4] 2> 265495 INFO (qtp1228411028-1742) [ x:collection1] o.a.s.u.p.LogUpdateProcessorFactory [collection1] webapp=/solr path=/update params={wt=javabin&version=2}{add=[221]} 0 0
[junit4] 2> 265497 INFO (qtp1228411028-1743) [ x:collection1] o.a.s.u.p.LogUpdateProcessorFactory [collection1] webapp=/solr path=/update params={wt=javabin&version=2}{add=[222]} 0 0
[junit4] 2> 265499 INFO (qtp1228411028-1741) [ x:collection1] o.a.s.u.p.LogUpdateProcessorFactory [collection1] webapp=/solr path=/update params={wt=javabin&version=2}{add=[223]} 0 0
[junit4] 2> 265500 INFO (qtp1228411028-1742) [ x:collection1] o.a.s.u.p.LogUpdateProcessorFactory [collection1] webapp=/solr path=/update params={wt=javabin&version=2}{add=[224]} 0 0
[junit4] 2> 265503 INFO (qtp1228411028-1743) [ x:collection1] o.a.s.u.p.LogUpdateProcessorFactory [collection1] webapp=/solr path=/update params={wt=javabin&version=2}{add=[225]} 0 0
[junit4] 2> 265504 INFO (qtp1228411028-1741) [ x:collection1] o.a.s.u.p.LogUpdateProcessorFactory [collection1] webapp=/solr path=/update params={wt=javabin&version=2}{add=[226]} 0 0
[junit4] 2> 265506 INFO (qtp1228411028-1742) [ x:collection1] o.a.s.u.p.LogUpdateProcessorFactory [collection1] webapp=/solr path=/update params={wt=javabin&version=2}{add=[227]} 0 0
[junit4] 2> 265508 INFO (qtp1228411028-1743) [ x:collection1] o.a.s.u.p.LogUpdateProcessorFactory [collection1] webapp=/solr path=/update params={wt=javabin&version=2}{add=[228]} 0 0
[junit4] 2> 265510 INFO (qtp1228411028-1741) [ x:collection1] o.a.s.u.p.LogUpdateProcessorFactory [collection1] webapp=/solr path=/update params={wt=javabin&version=2}{add=[229]} 0 0
[junit4] 2> 265512 INFO (qtp1228411028-1742) [ x:collection1] o.a.s.u.p.LogUpdateProcessorFactory [collection1] webapp=/solr path=/update params={wt=javabin&version=2}{add=[230]} 0 0
[junit4] 2> 265515 INFO (qtp1228411028-1743) [ x:collection1] o.a.s.u.p.LogUpdateProcessorFactory [collection1] webapp=/solr path=/update params={wt=javabin&version=2}{add=[231]} 0 0
[junit4] 2> 265516 INFO (qtp1228411028-1741) [ x:collection1] o.a.s.u.p.LogUpdateProcessorFactory [collection1] webapp=/solr path=/update params={wt=javabin&version=2}{add=[232]} 0 0
[junit4] 2> 265519 INFO (qtp1228411028-1742) [ x:collection1] o.a.s.u.p.LogUpdateProcessorFactory [collection1
[...truncated too long message...]
ore
[junit4] 2> Caused by: org.apache.zookeeper.KeeperException$SessionExpiredException: KeeperErrorCode = Session expired for /configs/conf1/managed-schema
[junit4] 2> at org.apache.zookeeper.KeeperException.create(KeeperException.java:127)
[junit4] 2> at org.apache.zookeeper.KeeperException.create(KeeperException.java:51)
[junit4] 2> at org.apache.zookeeper.ZooKeeper.getData(ZooKeeper.java:1155)
[junit4] 2> at org.apache.solr.common.cloud.SolrZkClient$7.execute(SolrZkClient.java:345)
[junit4] 2> at org.apache.solr.common.cloud.SolrZkClient$7.execute(SolrZkClient.java:342)
[junit4] 2> at org.apache.solr.common.cloud.ZkCmdExecutor.retryOperation(ZkCmdExecutor.java:60)
[junit4] 2> at org.apache.solr.common.cloud.SolrZkClient.getData(SolrZkClient.java:342)
[junit4] 2> at org.apache.solr.schema.ManagedIndexSchemaFactory.create(ManagedIndexSchemaFactory.java:128)
[junit4] 2> ... 7 more
[junit4] 2> 1961502 INFO (Thread-5464) [ ] o.a.s.c.ZkTestServer connecting to 127.0.0.1:45887 45887
[junit4] 2> 1961504 WARN (Thread-5464) [ ] o.a.s.c.ZkTestServer Watch limit violations:
[junit4] 2> Maximum concurrent create/delete watches above limit:
[junit4] 2>
[junit4] 2> 6 /solr/configs/conf1/managed-schema
[junit4] 2> 6 /solr/configs/conf1
[junit4] 2> 3 /solr/aliases.json
[junit4] 2> 2 /solr/security.json
[junit4] 2>
[junit4] 2> Maximum concurrent data watches above limit:
[junit4] 2>
[junit4] 2> 3 /solr/clusterstate.json
[junit4] 2> 2 /solr/collections/testschemaapi/state.json
[junit4] 2>
[junit4] 2> Maximum concurrent children watches above limit:
[junit4] 2>
[junit4] 2> 11 /solr/overseer/queue
[junit4] 2> 9 /solr/overseer/collection-queue-work
[junit4] 2> 3 /solr/collections
[junit4] 2> 3 /solr/live_nodes
[junit4] 2> 3 /solr/overseer/queue-work
[junit4] 2>
[junit4] 2> 1961504 INFO (TEST-TestManagedSchemaAPI.test-seed#[15E962A9ADF1A8F2]) [ ] o.a.s.SolrTestCaseJ4 ###Ending test
[junit4] 2> NOTE: reproduce with: ant test -Dtestcase=TestManagedSchemaAPI -Dtests.method=test -Dtests.seed=15E962A9ADF1A8F2 -Dtests.multiplier=3 -Dtests.slow=true -Dtests.locale=en -Dtests.timezone=Israel -Dtests.asserts=true -Dtests.file.encoding=US-ASCII
[junit4] ERROR 12.0s J1 | TestManagedSchemaAPI.test <<<
[junit4] > Throwable #1: org.apache.solr.client.solrj.impl.CloudSolrClient$RouteException: Error from server at http://127.0.0.1:37750/solr/testschemaapi_shard1_replica1: ERROR: [doc=2] unknown field 'myNewField1'
[junit4] > at __randomizedtesting.SeedInfo.seed([15E962A9ADF1A8F2:9DBD5D73030DC50A]:0)
[junit4] > at org.apache.solr.client.solrj.impl.CloudSolrClient.directUpdate(CloudSolrClient.java:653)
[junit4] > at org.apache.solr.client.solrj.impl.CloudSolrClient.sendRequest(CloudSolrClient.java:1002)
[junit4] > at org.apache.solr.client.solrj.impl.CloudSolrClient.requestWithRetryOnStaleState(CloudSolrClient.java:891)
[junit4] > at org.apache.solr.client.solrj.impl.CloudSolrClient.request(CloudSolrClient.java:827)
[junit4] > at org.apache.solr.schema.TestManagedSchemaAPI.testAddFieldAndDocument(TestManagedSchemaAPI.java:101)
[junit4] > at org.apache.solr.schema.TestManagedSchemaAPI.test(TestManagedSchemaAPI.java:69)
[junit4] > at java.lang.Thread.run(Thread.java:745)
[junit4] > Caused by: org.apache.solr.client.solrj.impl.HttpSolrClient$RemoteSolrException: Error from server at http://127.0.0.1:37750/solr/testschemaapi_shard1_replica1: ERROR: [doc=2] unknown field 'myNewField1'
[junit4] > at org.apache.solr.client.solrj.impl.HttpSolrClient.executeMethod(HttpSolrClient.java:577)
[junit4] > at org.apache.solr.client.solrj.impl.HttpSolrClient.request(HttpSolrClient.java:241)
[junit4] > at org.apache.solr.client.solrj.impl.HttpSolrClient.request(HttpSolrClient.java:230)
[junit4] > at org.apache.solr.client.solrj.impl.LBHttpSolrClient.doRequest(LBHttpSolrClient.java:372)
[junit4] > at org.apache.solr.client.solrj.impl.LBHttpSolrClient.request(LBHttpSolrClient.java:325)
[junit4] > at org.apache.solr.client.solrj.impl.CloudSolrClient$2.call(CloudSolrClient.java:628)
[junit4] > at org.apache.solr.client.solrj.impl.CloudSolrClient$2.call(CloudSolrClient.java:625)
[junit4] > at java.util.concurrent.FutureTask.run(FutureTask.java:262)
[junit4] > at org.apache.solr.common.util.ExecutorUtil$MDCAwareThreadPoolExecutor$1.run(ExecutorUtil.java:231)
[junit4] > at java.util.concurrent.ThreadPoolExecutor.runWorker(ThreadPoolExecutor.java:1145)
[junit4] > at java.util.concurrent.ThreadPoolExecutor$Worker.run(ThreadPoolExecutor.java:615)
[junit4] > ... 1 more
[junit4] 2> 1961507 INFO (SUITE-TestManagedSchemaAPI-seed#[15E962A9ADF1A8F2]-worker) [ ] o.a.s.SolrTestCaseJ4 ###deleteCore
[junit4] 2> NOTE: leaving temporary files on disk at: /home/jenkins/workspace/Lucene-Solr-5.5-Linux/solr/build/solr-core/test/J1/temp/solr.schema.TestManagedSchemaAPI_15E962A9ADF1A8F2-001
[junit4] 2> Sep 07, 2016 11:33:33 PM com.carrotsearch.randomizedtesting.ThreadLeakControl checkThreadLeaks
[junit4] 2> WARNING: Will linger awaiting termination of 1 leaked thread(s).
[junit4] 2> NOTE: test params are: codec=Asserting(Lucene54), sim=RandomSimilarity(queryNorm=false,coord=crazy): {}, locale=en, timezone=Israel
[junit4] 2> NOTE: Linux 4.4.0-36-generic amd64/Oracle Corporation 1.7.0_80 (64-bit)/cpus=12,threads=1,free=227788280,total=518979584
[junit4] 2> NOTE: All tests run in this JVM: [TestCoreContainer, HdfsBasicDistributedZkTest, TestJsonFacets, DistributedFacetPivotSmallTest, DateRangeFieldTest, CloudExitableDirectoryReaderTest, MultiTermTest, FullHLLTest, TestDynamicFieldResource, TestOnReconnectListenerSupport, DistributedMLTComponentTest, TestDefaultStatsCache, TestRuleBasedAuthorizationPlugin, ZkSolrClientTest, ShardRoutingCustomTest, TestMacros, CSVRequestHandlerTest, TestStressVersions, DistanceUnitsTest, TestBlobHandler, SolrIndexConfigTest, NumericFieldsTest, ChaosMonkeySafeLeaderTest, TestSortingResponseWriter, TestFastLRUCache, SpatialRPTFieldTypeTest, ZkStateWriterTest, LeaderInitiatedRecoveryOnCommitTest, DOMUtilTest, SortByFunctionTest, LoggingHandlerTest, TestReloadDeadlock, AliasIntegrationTest, TestSolrQueryParserResource, ShardRoutingTest, DeleteLastCustomShardedReplicaTest, TestInfoStreamLogging, ExitableDirectoryReaderTest, TimeZoneUtilsTest, TestStressUserVersions, BigEndianAscendingWordSerializerTest, DocValuesTest, TestConfigOverlay, TestBM25SimilarityFactory, DistributedTermsComponentTest, TestWordDelimiterFilterFactory, TestManagedSchema, HdfsThreadLeakTest, TermsComponentTest, TestSurroundQueryParser, TestNoOpRegenerator, AnalyticsQueryTest, TestSortByMinMaxFunction, ChaosMonkeyNothingIsSafeTest, TestCursorMarkWithoutUniqueKey, TestShortCircuitedRequests, TestRawResponseWriter, TestManagedSynonymFilterFactory, TestCloudManagedSchemaConcurrent, OverseerCollectionConfigSetProcessorTest, ConjunctionSolrSpellCheckerTest, DirectSolrSpellCheckerTest, TestConfigSets, TestHashPartitioner, SolrInfoMBeanTest, RankQueryTest, BlockCacheTest, TestFileDictionaryLookup, ClusterStateUpdateTest, CreateCollectionCleanupTest, BlockJoinFacetRandomTest, TestUpdate, TestQueryUtils, OverseerTaskQueueTest, DistribJoinFromCollectionTest, SpellPossibilityIteratorTest, TestExactStatsCache, TestTrie, TestQuerySenderNoQuery, AsyncMigrateRouteKeyTest, TestReloadAndDeleteDocs, TestSolrDeletionPolicy2, TestLeaderElectionZkExpiry, FileUtilsTest, TestSimpleTrackingShardHandler, TestDFRSimilarityFactory, MultiThreadedOCPTest, SpellCheckComponentTest, SimplePostToolTest, TestMiniSolrCloudClusterBase, DistributedQueryComponentOptimizationTest, TestDocumentBuilder, DistanceFunctionTest, AnalysisErrorHandlingTest, OpenCloseCoreStressTest, OverseerTest, TestRandomDVFaceting, ZkCLITest, TestDistributedSearch, QueryParsingTest, JsonLoaderTest, TestPHPSerializedResponseWriter, HighlighterConfigTest, TestQuerySenderListener, ResponseLogComponentTest, TestDocSet, TestFuzzyAnalyzedSuggestions, NotRequiredUniqueKeyTest, TestLuceneMatchVersion, TestCharFilters, TestCodecSupport, TestJmxMonitoredMap, OpenExchangeRatesOrgProviderTest, TestSystemIdResolver, SpellingQueryConverterTest, RAMDirectoryFactoryTest, ClusterStateTest, CircularListTest, CursorPagingTest, SolrTestCaseJ4Test, TestDistributedMissingSort, TestEmbeddedSolrServerConstructors, TestJettySolrRunner, AssignTest, CollectionReloadTest, CollectionsAPISolrJTest, ConnectionManagerTest, DistribDocExpirationUpdateProcessorTest, HttpPartitionTest, SimpleCollectionCreateDeleteTest, SolrXmlInZkTest, TestAuthenticationFramework, TestLeaderInitiatedRecoveryThread, TestRequestForwarding, TestStressLiveNodes, HdfsBasicDistributedZk2Test, HdfsChaosMonkeyNothingIsSafeTest, HdfsChaosMonkeySafeLeaderTest, HdfsRecoverLeaseTest, HdfsRestartWhileUpdatingTest, StressHdfsTest, ZkStateReaderTest, CachingDirectoryFactoryTest, DirectoryFactoryTest, TestImplicitCoreProperties, TestShardHandlerFactory, TestSolrConfigHandler, TestSolrDynamicMBean, TestSolrXml, RequestLoggingTest, TestReplicationHandlerBackup, TestReqParamsAPI, TestSolrConfigHandlerCloud, CoreMergeIndexesAdminHandlerTest, InfoHandlerTest, SegmentsInfoRequestHandlerTest, DistributedFacetPivotLargeTest, DistributedFacetPivotLongTailTest, SuggestComponentContextFilterQueryTest, SuggestComponentTest, TestPivotHelperCode, TestTrackingShardHandlerFactory, TestManagedResourceStorage, TestBulkSchemaAPI, TestManagedSchemaFieldResource, TestRemoveLastDynamicCopyField, TestSchemaResource, TestSchemaVersionResource, BadCopyFieldTest, TestCloudManagedSchema, TestCollationFieldDocValues, TestManagedSchemaAPI]
[junit4] Completed [525/575 (2!)] on J1 in 12.32s, 1 test, 1 error <<< FAILURES!
[...truncated 56811 lines...]