You are viewing a plain text version of this content. The canonical link for it is here.
Posted to issues@geode.apache.org by "Bruce Schuchardt (JIRA)" <ji...@apache.org> on 2016/03/14 18:13:33 UTC
[jira] [Reopened] (GEODE-912) CI failure:
DiskStoreCommandsDUnitTest.testBackupDiskStoreBackup
[ https://issues.apache.org/jira/browse/GEODE-912?page=com.atlassian.jira.plugin.system.issuetabpanels:all-tabpanel ]
Bruce Schuchardt reopened GEODE-912:
------------------------------------
This test failed with the following exception:
java.lang.AssertionError: Suspicious strings were written to the log during this run.
Fix the strings or use DistributedTestCase.addExpectedException to ignore.
-----------------------------------------------------------------------
Found suspect string in log4j at line 1526
[error 2016/03/13 18:41:28.443 PDT <Test worker> tid=0x13] Unable to delete file
java.nio.file.DirectoryNotEmptyException: /latvia1/users/build/jenkins/blds/workspace/Geode_develop_DistributedTests/geode-core/build/distributedTest/controllerDiskDir
at sun.nio.fs.UnixFileSystemProvider.implDelete(UnixFileSystemProvider.java:242)
at sun.nio.fs.AbstractFileSystemProvider.delete(AbstractFileSystemProvider.java:103)
at java.nio.file.Files.delete(Files.java:1126)
at com.gemstone.gemfire.internal.FileUtil.delete(FileUtil.java:169)
at com.gemstone.gemfire.management.internal.cli.commands.DiskStoreCommandsDUnitTest.preTearDownCliCommandTestBase(DiskStoreCommandsDUnitTest.java:1150)
at com.gemstone.gemfire.management.internal.cli.commands.CliCommandTestBase.preTearDownCacheTestCase(CliCommandTestBase.java:85)
at com.gemstone.gemfire.cache30.CacheTestCase.preTearDown(CacheTestCase.java:391)
at com.gemstone.gemfire.test.dunit.DistributedTestCase.tearDown(DistributedTestCase.java:428)
at junit.framework.TestCase.runBare(TestCase.java:146)
at junit.framework.TestResult$1.protect(TestResult.java:122)
at junit.framework.TestResult.runProtected(TestResult.java:142)
at junit.framework.TestResult.run(TestResult.java:125)
at junit.framework.TestCase.run(TestCase.java:129)
at junit.framework.TestSuite.runTest(TestSuite.java:252)
at junit.framework.TestSuite.run(TestSuite.java:247)
at org.junit.internal.runners.JUnit38ClassRunner.run(JUnit38ClassRunner.java:86)
at org.gradle.api.internal.tasks.testing.junit.JUnitTestClassExecuter.runTestClass(JUnitTestClassExecuter.java:105)
at org.gradle.api.internal.tasks.testing.junit.JUnitTestClassExecuter.execute(JUnitTestClassExecuter.java:56)
at org.gradle.api.internal.tasks.testing.junit.JUnitTestClassProcessor.processTestClass(JUnitTestClassProcessor.java:64)
at org.gradle.api.internal.tasks.testing.SuiteTestClassProcessor.processTestClass(SuiteTestClassProcessor.java:50)
at sun.reflect.GeneratedMethodAccessor174.invoke(Unknown Source)
at sun.reflect.DelegatingMethodAccessorImpl.invoke(DelegatingMethodAccessorImpl.java:43)
at java.lang.reflect.Method.invoke(Method.java:497)
at org.gradle.messaging.dispatch.ReflectionDispatch.dispatch(ReflectionDispatch.java:35)
at org.gradle.messaging.dispatch.ReflectionDispatch.dispatch(ReflectionDispatch.java:24)
at org.gradle.messaging.dispatch.ContextClassLoaderDispatch.dispatch(ContextClassLoaderDispatch.java:32)
at org.gradle.messaging.dispatch.ProxyDispatchAdapter$DispatchingInvocationHandler.invoke(ProxyDispatchAdapter.java:93)
at com.sun.proxy.$Proxy2.processTestClass(Unknown Source)
at org.gradle.api.internal.tasks.testing.worker.TestWorker.processTestClass(TestWorker.java:106)
at sun.reflect.GeneratedMethodAccessor173.invoke(Unknown Source)
at sun.reflect.DelegatingMethodAccessorImpl.invoke(DelegatingMethodAccessorImpl.java:43)
at java.lang.reflect.Method.invoke(Method.java:497)
at org.gradle.messaging.dispatch.ReflectionDispatch.dispatch(ReflectionDispatch.java:35)
at org.gradle.messaging.dispatch.ReflectionDispatch.dispatch(ReflectionDispatch.java:24)
at org.gradle.messaging.remote.internal.hub.MessageHub$Handler.run(MessageHub.java:360)
at org.gradle.internal.concurrent.ExecutorPolicy$CatchAndRecordFailures.onExecute(ExecutorPolicy.java:54)
at org.gradle.internal.concurrent.StoppableExecutorImpl$1.run(StoppableExecutorImpl.java:40)
at java.util.concurrent.ThreadPoolExecutor.runWorker(ThreadPoolExecutor.java:1142)
at java.util.concurrent.ThreadPoolExecutor$Worker.run(ThreadPoolExecutor.java:617)
at java.lang.Thread.run(Thread.java:745)
at org.junit.Assert.fail(Assert.java:88)
at com.gemstone.gemfire.test.dunit.standalone.DUnitLauncher.closeAndCheckForSuspects(DUnitLauncher.java:355)
at com.gemstone.gemfire.test.dunit.DistributedTestCase.cleanupAllVms(DistributedTestCase.java:465)
at com.gemstone.gemfire.test.dunit.DistributedTestCase.tearDownDistributedTestCase(DistributedTestCase.java:439)
at com.gemstone.gemfire.test.dunit.DistributedTestCase.tearDown(DistributedTestCase.java:429)
at junit.framework.TestCase.runBare(TestCase.java:146)
at junit.framework.TestResult$1.protect(TestResult.java:122)
at junit.framework.TestResult.runProtected(TestResult.java:142)
at junit.framework.TestResult.run(TestResult.java:125)
at junit.framework.TestCase.run(TestCase.java:129)
at junit.framework.TestSuite.runTest(TestSuite.java:252)
at junit.framework.TestSuite.run(TestSuite.java:247)
at org.junit.internal.runners.JUnit38ClassRunner.run(JUnit38ClassRunner.java:86)
at org.gradle.api.internal.tasks.testing.junit.JUnitTestClassExecuter.runTestClass(JUnitTestClassExecuter.java:105)
at org.gradle.api.internal.tasks.testing.junit.JUnitTestClassExecuter.execute(JUnitTestClassExecuter.java:56)
at org.gradle.api.internal.tasks.testing.junit.JUnitTestClassProcessor.processTestClass(JUnitTestClassProcessor.java:64)
at org.gradle.api.internal.tasks.testing.SuiteTestClassProcessor.processTestClass(SuiteTestClassProcessor.java:50)
at sun.reflect.GeneratedMethodAccessor174.invoke(Unknown Source)
at sun.reflect.DelegatingMethodAccessorImpl.invoke(DelegatingMethodAccessorImpl.java:43)
at java.lang.reflect.Method.invoke(Method.java:497)
at org.gradle.messaging.dispatch.ReflectionDispatch.dispatch(ReflectionDispatch.java:35)
at org.gradle.messaging.dispatch.ReflectionDispatch.dispatch(ReflectionDispatch.java:24)
at org.gradle.messaging.dispatch.ContextClassLoaderDispatch.dispatch(ContextClassLoaderDispatch.java:32)
at org.gradle.messaging.dispatch.ProxyDispatchAdapter$DispatchingInvocationHandler.invoke(ProxyDispatchAdapter.java:93)
at com.sun.proxy.$Proxy2.processTestClass(Unknown Source)
at org.gradle.api.internal.tasks.testing.worker.TestWorker.processTestClass(TestWorker.java:106)
at sun.reflect.GeneratedMethodAccessor173.invoke(Unknown Source)
at sun.reflect.DelegatingMethodAccessorImpl.invoke(DelegatingMethodAccessorImpl.java:43)
at java.lang.reflect.Method.invoke(Method.java:497)
at org.gradle.messaging.dispatch.ReflectionDispatch.dispatch(ReflectionDispatch.java:35)
at org.gradle.messaging.dispatch.ReflectionDispatch.dispatch(ReflectionDispatch.java:24)
at org.gradle.messaging.remote.internal.hub.MessageHub$Handler.run(MessageHub.java:360)
at org.gradle.internal.concurrent.ExecutorPolicy$CatchAndRecordFailures.onExecute(ExecutorPolicy.java:54)
at org.gradle.internal.concurrent.StoppableExecutorImpl$1.run(StoppableExecutorImpl.java:40)
at java.util.concurrent.ThreadPoolExecutor.runWorker(ThreadPoolExecutor.java:1142)
at java.util.concurrent.ThreadPoolExecutor$Worker.run(ThreadPoolExecutor.java:617)
at java.lang.Thread.run(Thread.java:745)
> CI failure: DiskStoreCommandsDUnitTest.testBackupDiskStoreBackup
> ----------------------------------------------------------------
>
> Key: GEODE-912
> URL: https://issues.apache.org/jira/browse/GEODE-912
> Project: Geode
> Issue Type: Bug
> Components: management
> Reporter: Sai Boorlagadda
> Assignee: Jinmei Liao
> Labels: CI
>
> {noformat}
> Error Message
> java.lang.AssertionError: Suspicious strings were written to the log during this run.
> Fix the strings or use DistributedTestCase.addExpectedException to ignore.
> -----------------------------------------------------------------------
> Found suspect string in log4j at line 1536
> [error 2016/02/02 20:44:07.280 PST <Test worker> tid=0x13] Unable to delete file
> java.io.IOException: Could not delete /latvia1/users/build/jenkins/blds/workspace/Geode_develop_DistributedTests/gemfire-core/build/distributedTest/controllerDiskDir
> at com.gemstone.gemfire.internal.FileUtil.delete(FileUtil.java:166)
> at com.gemstone.gemfire.management.internal.cli.commands.DiskStoreCommandsDUnitTest.tearDown2(DiskStoreCommandsDUnitTest.java:1147)
> at com.gemstone.gemfire.test.dunit.DistributedTestCase.tearDown(DistributedTestCase.java:702)
> at junit.framework.TestCase.runBare(TestCase.java:146)
> at junit.framework.TestResult$1.protect(TestResult.java:122)
> at junit.framework.TestResult.runProtected(TestResult.java:142)
> at junit.framework.TestResult.run(TestResult.java:125)
> at junit.framework.TestCase.run(TestCase.java:129)
> at junit.framework.TestSuite.runTest(TestSuite.java:252)
> at junit.framework.TestSuite.run(TestSuite.java:247)
> at org.junit.internal.runners.JUnit38ClassRunner.run(JUnit38ClassRunner.java:86)
> at org.gradle.api.internal.tasks.testing.junit.JUnitTestClassExecuter.runTestClass(JUnitTestClassExecuter.java:105)
> at org.gradle.api.internal.tasks.testing.junit.JUnitTestClassExecuter.execute(JUnitTestClassExecuter.java:56)
> at org.gradle.api.internal.tasks.testing.junit.JUnitTestClassProcessor.processTestClass(JUnitTestClassProcessor.java:64)
> at org.gradle.api.internal.tasks.testing.SuiteTestClassProcessor.processTestClass(SuiteTestClassProcessor.java:50)
> at sun.reflect.NativeMethodAccessorImpl.invoke0(Native Method)
> at sun.reflect.NativeMethodAccessorImpl.invoke(NativeMethodAccessorImpl.java:62)
> at sun.reflect.DelegatingMethodAccessorImpl.invoke(DelegatingMethodAccessorImpl.java:43)
> at java.lang.reflect.Method.invoke(Method.java:497)
> at org.gradle.messaging.dispatch.ReflectionDispatch.dispatch(ReflectionDispatch.java:35)
> at org.gradle.messaging.dispatch.ReflectionDispatch.dispatch(ReflectionDispatch.java:24)
> at org.gradle.messaging.dispatch.ContextClassLoaderDispatch.dispatch(ContextClassLoaderDispatch.java:32)
> at org.gradle.messaging.dispatch.ProxyDispatchAdapter$DispatchingInvocationHandler.invoke(ProxyDispatchAdapter.java:93)
> at com.sun.proxy.$Proxy2.processTestClass(Unknown Source)
> at org.gradle.api.internal.tasks.testing.worker.TestWorker.processTestClass(TestWorker.java:106)
> at sun.reflect.NativeMethodAccessorImpl.invoke0(Native Method)
> at sun.reflect.NativeMethodAccessorImpl.invoke(NativeMethodAccessorImpl.java:62)
> at sun.reflect.DelegatingMethodAccessorImpl.invoke(DelegatingMethodAccessorImpl.java:43)
> at java.lang.reflect.Method.invoke(Method.java:497)
> at org.gradle.messaging.dispatch.ReflectionDispatch.dispatch(ReflectionDispatch.java:35)
> at org.gradle.messaging.dispatch.ReflectionDispatch.dispatch(ReflectionDispatch.java:24)
> at org.gradle.messaging.remote.internal.hub.MessageHub$Handler.run(MessageHub.java:360)
> at org.gradle.internal.concurrent.ExecutorPolicy$CatchAndRecordFailures.onExecute(ExecutorPolicy.java:54)
> at org.gradle.internal.concurrent.StoppableExecutorImpl$1.run(StoppableExecutorImpl.java:40)
> at java.util.concurrent.ThreadPoolExecutor.runWorker(ThreadPoolExecutor.java:1142)
> at java.util.concurrent.ThreadPoolExecutor$Worker.run(ThreadPoolExecutor.java:617)
> at java.lang.Thread.run(Thread.java:745)
> Stacktrace
> java.lang.AssertionError: Suspicious strings were written to the log during this run.
> Fix the strings or use DistributedTestCase.addExpectedException to ignore.
> -----------------------------------------------------------------------
> Found suspect string in log4j at line 1536
> [error 2016/02/02 20:44:07.280 PST <Test worker> tid=0x13] Unable to delete file
> java.io.IOException: Could not delete /latvia1/users/build/jenkins/blds/workspace/Geode_develop_DistributedTests/gemfire-core/build/distributedTest/controllerDiskDir
> at com.gemstone.gemfire.internal.FileUtil.delete(FileUtil.java:166)
> at com.gemstone.gemfire.management.internal.cli.commands.DiskStoreCommandsDUnitTest.tearDown2(DiskStoreCommandsDUnitTest.java:1147)
> at com.gemstone.gemfire.test.dunit.DistributedTestCase.tearDown(DistributedTestCase.java:702)
> at junit.framework.TestCase.runBare(TestCase.java:146)
> at junit.framework.TestResult$1.protect(TestResult.java:122)
> at junit.framework.TestResult.runProtected(TestResult.java:142)
> at junit.framework.TestResult.run(TestResult.java:125)
> at junit.framework.TestCase.run(TestCase.java:129)
> at junit.framework.TestSuite.runTest(TestSuite.java:252)
> at junit.framework.TestSuite.run(TestSuite.java:247)
> at org.junit.internal.runners.JUnit38ClassRunner.run(JUnit38ClassRunner.java:86)
> at org.gradle.api.internal.tasks.testing.junit.JUnitTestClassExecuter.runTestClass(JUnitTestClassExecuter.java:105)
> at org.gradle.api.internal.tasks.testing.junit.JUnitTestClassExecuter.execute(JUnitTestClassExecuter.java:56)
> at org.gradle.api.internal.tasks.testing.junit.JUnitTestClassProcessor.processTestClass(JUnitTestClassProcessor.java:64)
> at org.gradle.api.internal.tasks.testing.SuiteTestClassProcessor.processTestClass(SuiteTestClassProcessor.java:50)
> at sun.reflect.NativeMethodAccessorImpl.invoke0(Native Method)
> at sun.reflect.NativeMethodAccessorImpl.invoke(NativeMethodAccessorImpl.java:62)
> at sun.reflect.DelegatingMethodAccessorImpl.invoke(DelegatingMethodAccessorImpl.java:43)
> at java.lang.reflect.Method.invoke(Method.java:497)
> at org.gradle.messaging.dispatch.ReflectionDispatch.dispatch(ReflectionDispatch.java:35)
> at org.gradle.messaging.dispatch.ReflectionDispatch.dispatch(ReflectionDispatch.java:24)
> at org.gradle.messaging.dispatch.ContextClassLoaderDispatch.dispatch(ContextClassLoaderDispatch.java:32)
> at org.gradle.messaging.dispatch.ProxyDispatchAdapter$DispatchingInvocationHandler.invoke(ProxyDispatchAdapter.java:93)
> at com.sun.proxy.$Proxy2.processTestClass(Unknown Source)
> at org.gradle.api.internal.tasks.testing.worker.TestWorker.processTestClass(TestWorker.java:106)
> at sun.reflect.NativeMethodAccessorImpl.invoke0(Native Method)
> at sun.reflect.NativeMethodAccessorImpl.invoke(NativeMethodAccessorImpl.java:62)
> at sun.reflect.DelegatingMethodAccessorImpl.invoke(DelegatingMethodAccessorImpl.java:43)
> at java.lang.reflect.Method.invoke(Method.java:497)
> at org.gradle.messaging.dispatch.ReflectionDispatch.dispatch(ReflectionDispatch.java:35)
> at org.gradle.messaging.dispatch.ReflectionDispatch.dispatch(ReflectionDispatch.java:24)
> at org.gradle.messaging.remote.internal.hub.MessageHub$Handler.run(MessageHub.java:360)
> at org.gradle.internal.concurrent.ExecutorPolicy$CatchAndRecordFailures.onExecute(ExecutorPolicy.java:54)
> at org.gradle.internal.concurrent.StoppableExecutorImpl$1.run(StoppableExecutorImpl.java:40)
> at java.util.concurrent.ThreadPoolExecutor.runWorker(ThreadPoolExecutor.java:1142)
> at java.util.concurrent.ThreadPoolExecutor$Worker.run(ThreadPoolExecutor.java:617)
> at java.lang.Thread.run(Thread.java:745)
> at org.junit.Assert.fail(Assert.java:88)
> at com.gemstone.gemfire.test.dunit.standalone.DUnitLauncher.closeAndCheckForSuspects(DUnitLauncher.java:351)
> at com.gemstone.gemfire.test.dunit.DistributedTestCase.cleanupAllVms(DistributedTestCase.java:750)
> at com.gemstone.gemfire.test.dunit.DistributedTestCase.realTearDown(DistributedTestCase.java:725)
> at com.gemstone.gemfire.test.dunit.DistributedTestCase.tearDown(DistributedTestCase.java:703)
> at junit.framework.TestCase.runBare(TestCase.java:146)
> at junit.framework.TestResult$1.protect(TestResult.java:122)
> at junit.framework.TestResult.runProtected(TestResult.java:142)
> at junit.framework.TestResult.run(TestResult.java:125)
> at junit.framework.TestCase.run(TestCase.java:129)
> at junit.framework.TestSuite.runTest(TestSuite.java:252)
> at junit.framework.TestSuite.run(TestSuite.java:247)
> at org.junit.internal.runners.JUnit38ClassRunner.run(JUnit38ClassRunner.java:86)
> at org.gradle.api.internal.tasks.testing.junit.JUnitTestClassExecuter.runTestClass(JUnitTestClassExecuter.java:105)
> at org.gradle.api.internal.tasks.testing.junit.JUnitTestClassExecuter.execute(JUnitTestClassExecuter.java:56)
> at org.gradle.api.internal.tasks.testing.junit.JUnitTestClassProcessor.processTestClass(JUnitTestClassProcessor.java:64)
> at org.gradle.api.internal.tasks.testing.SuiteTestClassProcessor.processTestClass(SuiteTestClassProcessor.java:50)
> at sun.reflect.NativeMethodAccessorImpl.invoke0(Native Method)
> at sun.reflect.NativeMethodAccessorImpl.invoke(NativeMethodAccessorImpl.java:62)
> at sun.reflect.DelegatingMethodAccessorImpl.invoke(DelegatingMethodAccessorImpl.java:43)
> at java.lang.reflect.Method.invoke(Method.java:497)
> at org.gradle.messaging.dispatch.ReflectionDispatch.dispatch(ReflectionDispatch.java:35)
> at org.gradle.messaging.dispatch.ReflectionDispatch.dispatch(ReflectionDispatch.java:24)
> at org.gradle.messaging.dispatch.ContextClassLoaderDispatch.dispatch(ContextClassLoaderDispatch.java:32)
> at org.gradle.messaging.dispatch.ProxyDispatchAdapter$DispatchingInvocationHandler.invoke(ProxyDispatchAdapter.java:93)
> at com.sun.proxy.$Proxy2.processTestClass(Unknown Source)
> at org.gradle.api.internal.tasks.testing.worker.TestWorker.processTestClass(TestWorker.java:106)
> at sun.reflect.NativeMethodAccessorImpl.invoke0(Native Method)
> at sun.reflect.NativeMethodAccessorImpl.invoke(NativeMethodAccessorImpl.java:62)
> at sun.reflect.DelegatingMethodAccessorImpl.invoke(DelegatingMethodAccessorImpl.java:43)
> at java.lang.reflect.Method.invoke(Method.java:497)
> at org.gradle.messaging.dispatch.ReflectionDispatch.dispatch(ReflectionDispatch.java:35)
> at org.gradle.messaging.dispatch.ReflectionDispatch.dispatch(ReflectionDispatch.java:24)
> at org.gradle.messaging.remote.internal.hub.MessageHub$Handler.run(MessageHub.java:360)
> at org.gradle.internal.concurrent.ExecutorPolicy$CatchAndRecordFailures.onExecute(ExecutorPolicy.java:54)
> at org.gradle.internal.concurrent.StoppableExecutorImpl$1.run(StoppableExecutorImpl.java:40)
> at java.util.concurrent.ThreadPoolExecutor.runWorker(ThreadPoolExecutor.java:1142)
> at java.util.concurrent.ThreadPoolExecutor$Worker.run(ThreadPoolExecutor.java:617)
> at java.lang.Thread.run(Thread.java:745)
> Standard Output
> Previously run tests: [IndexCommandsDUnitTest, ListAndDescribeDiskStoreCommandsDUnitTest, UserCommandsDUnitTest, MiscellaneousCommandsExportLogsPart1DUnitTest, ShellCommandsDUnitTest, MiscellaneousCommandsExportLogsPart4DUnitTest, ShowMetricsDUnitTest, FunctionCommandsDUnitTest, ConfigCommandsDUnitTest, ShowStackTraceDUnitTest, MemberCommandsDUnitTest, DiskStoreCommandsDUnitTest]
> {noformat}
--
This message was sent by Atlassian JIRA
(v6.3.4#6332)