You are viewing a plain text version of this content. The canonical link for it is here.
Posted to issues@flink.apache.org by "Aljoscha Krettek (JIRA)" <ji...@apache.org> on 2016/02/04 16:53:39 UTC

[jira] [Resolved] (FLINK-2845) TimestampITCase.testWatermarkPropagation

     [ https://issues.apache.org/jira/browse/FLINK-2845?page=com.atlassian.jira.plugin.system.issuetabpanels:all-tabpanel ]

Aljoscha Krettek resolved FLINK-2845.
-------------------------------------
       Resolution: Fixed
    Fix Version/s: 1.0.0

Fixed in https://github.com/apache/flink/commit/69f7f6d92f263e7fa73fe5e396565aa87d283818

> TimestampITCase.testWatermarkPropagation
> ----------------------------------------
>
>                 Key: FLINK-2845
>                 URL: https://issues.apache.org/jira/browse/FLINK-2845
>             Project: Flink
>          Issue Type: Bug
>          Components: Streaming
>            Reporter: Matthias J. Sax
>            Assignee: Aljoscha Krettek
>            Priority: Critical
>              Labels: test-stability
>             Fix For: 1.0.0
>
>
> https://travis-ci.org/apache/flink/jobs/84479912
> {noformat}
> Tests run: 8, Failures: 1, Errors: 0, Skipped: 0, Time elapsed: 16.592 sec <<< FAILURE! - in org.apache.flink.streaming.timestamp.TimestampITCase
> testWatermarkPropagation(org.apache.flink.streaming.timestamp.TimestampITCase)  Time elapsed: 3.747 sec  <<< FAILURE!
> java.lang.AssertionError: Wrong watermark.
> 	at org.junit.Assert.fail(Assert.java:88)
> 	at org.apache.flink.streaming.timestamp.TimestampITCase.testWatermarkPropagation(TimestampITCase.java:163)
> {noformat}



--
This message was sent by Atlassian JIRA
(v6.3.4#6332)