You are viewing a plain text version of this content. The canonical link for it is here.
Posted to dev@geronimo.apache.org by ga...@apache.org on 2008/02/07 21:29:19 UTC
[BUILD] 2.2: Failed for Revision: 619615
Geronimo Revision: 619615 built with tests included
See the full build-1500.log file at http://geronimo.apache.org/maven/server/binaries/trunk/20080207/build-1500.log
See the unit test reports at http://geronimo.apache.org/maven/server/binaries/trunk/20080207/unit-test-reports
[INFO] [shitty:test {execution: default}]
[INFO] Starting 4 test build(s)
[INFO]
[INFO] -------------------------------------------------------------------------------
[INFO]
[INFO] [1mj2ee-system [0m [36mRUNNING[0m
[INFO] [1mj2ee-system [0m [32mSUCCESS[0m (0:00:15.326)
[INFO] [1mmetadatageneration [0m [36mRUNNING[0m
[INFO] [1mmetadatageneration [0m [32mSUCCESS[0m (0:00:06.828)
[INFO] [1mmetadatageneration-2[0m [36mRUNNING[0m
[INFO] [1mmetadatageneration-2[0m [31mFAILURE[0m (0:00:34.465) [31mJava returned: 1[0m
[INFO] [1mj2ee-system-2 [0m [36mRUNNING[0m
[INFO] [1mj2ee-system-2 [0m [31mFAILURE[0m (0:00:08.957) [31mJava returned: 1[0m
[INFO]
[INFO] -------------------------------------------------------------------------------
[INFO] Test Summary ([1m0:01:05.665[0m)
[INFO] Passed: [32m2[0m
[INFO] Failed: [31m2[0m
[INFO] -------------------------------------------------------------------------------
[INFO]
[INFO] The following tests [31mfailed[0m:
[INFO] * [31mmetadatageneration-2[0m - [1m/home/geronimo/geronimo/trunk/buildsupport/car-maven-plugin/src/it/metadatageneration-2/build.log[0m
[INFO] * [31mj2ee-system-2[0m - [1m/home/geronimo/geronimo/trunk/buildsupport/car-maven-plugin/src/it/j2ee-system-2/build.log[0m
[INFO]
[INFO] ------------------------------------------------------------------------
[ERROR] BUILD ERROR
[INFO] ------------------------------------------------------------------------
[INFO] 2 of 4 tests failed
[INFO] ------------------------------------------------------------------------
[INFO] Trace
org.apache.maven.lifecycle.LifecycleExecutionException: 2 of 4 tests failed
at org.apache.maven.lifecycle.DefaultLifecycleExecutor.executeGoals(DefaultLifecycleExecutor.java:564)
at org.apache.maven.lifecycle.DefaultLifecycleExecutor.executeGoalWithLifecycle(DefaultLifecycleExecutor.java:480)
at org.apache.maven.lifecycle.DefaultLifecycleExecutor.executeGoal(DefaultLifecycleExecutor.java:459)
at org.apache.maven.lifecycle.DefaultLifecycleExecutor.executeGoalAndHandleFailures(DefaultLifecycleExecutor.java:311)
at org.apache.maven.lifecycle.DefaultLifecycleExecutor.executeTaskSegments(DefaultLifecycleExecutor.java:278)
at org.apache.maven.lifecycle.DefaultLifecycleExecutor.execute(DefaultLifecycleExecutor.java:143)
at org.apache.maven.DefaultMaven.doExecute(DefaultMaven.java:334)
at org.apache.maven.DefaultMaven.execute(DefaultMaven.java:125)
at org.apache.maven.cli.MavenCli.main(MavenCli.java:280)
at sun.reflect.NativeMethodAccessorImpl.invoke0(Native Method)
at sun.reflect.NativeMethodAccessorImpl.invoke(NativeMethodAccessorImpl.java:39)
at sun.reflect.DelegatingMethodAccessorImpl.invoke(DelegatingMethodAccessorImpl.java:25)
at java.lang.reflect.Method.invoke(Method.java:585)
at org.codehaus.classworlds.Launcher.launchEnhanced(Launcher.java:315)
at org.codehaus.classworlds.Launcher.launch(Launcher.java:255)
at org.codehaus.classworlds.Launcher.mainWithExitCode(Launcher.java:430)
at org.codehaus.classworlds.Launcher.main(Launcher.java:375)
Caused by: org.apache.maven.plugin.MojoExecutionException: 2 of 4 tests failed
at sun.reflect.NativeConstructorAccessorImpl.newInstance0(Native Method)
at sun.reflect.NativeConstructorAccessorImpl.newInstance(NativeConstructorAccessorImpl.java:39)
at sun.reflect.DelegatingConstructorAccessorImpl.newInstance(DelegatingConstructorAccessorImpl.java:27)
at java.lang.reflect.Constructor.newInstance(Constructor.java:494)
at org.codehaus.groovy.runtime.MetaClassHelper.doConstructorInvoke(MetaClassHelper.java:473)
at groovy.lang.MetaClassImpl.doConstructorInvoke(MetaClassImpl.java:2284)
at groovy.lang.MetaClassImpl.invokeConstructor(MetaClassImpl.java:1179)
at groovy.lang.MetaClassImpl.invokeConstructor(MetaClassImpl.java:1109)
at org.codehaus.groovy.runtime.Invoker.invokeConstructorOf(Invoker.java:127)
at org.codehaus.groovy.runtime.InvokerHelper.invokeConstructorOf(InvokerHelper.java:95)
at org.codehaus.groovy.runtime.ScriptBytecodeAdapter.invokeNewN(ScriptBytecodeAdapter.java:225)
at org.codehaus.mojo.groovy.GroovyMojo.fail(GroovyMojo.groovy:70)
at sun.reflect.NativeMethodAccessorImpl.invoke0(Native Method)
at sun.reflect.NativeMethodAccessorImpl.invoke(NativeMethodAccessorImpl.java:39)
at sun.reflect.DelegatingMethodAccessorImpl.invoke(DelegatingMethodAccessorImpl.java:25)
at java.lang.reflect.Method.invoke(Method.java:585)
at org.codehaus.groovy.runtime.metaclass.ReflectionMetaMethod.invoke(ReflectionMetaMethod.java:56)
at org.codehaus.groovy.runtime.MetaClassHelper.doMethodInvoke(MetaClassHelper.java:546)
at groovy.lang.MetaClassImpl.invokeMethod(MetaClassImpl.java:903)
at org.codehaus.groovy.runtime.ScriptBytecodeAdapter.invokeMethodOnCurrentN(ScriptBytecodeAdapter.java:75)
at org.codehaus.mojo.shitty.TestMojo.report(TestMojo.groovy:502)
at org.codehaus.mojo.shitty.TestMojo.this$5$report(TestMojo.groovy)
at sun.reflect.NativeMethodAccessorImpl.invoke0(Native Method)
at sun.reflect.NativeMethodAccessorImpl.invoke(NativeMethodAccessorImpl.java:39)
at sun.reflect.DelegatingMethodAccessorImpl.invoke(DelegatingMethodAccessorImpl.java:25)
at java.lang.reflect.Method.invoke(Method.java:585)
at org.codehaus.groovy.runtime.metaclass.ReflectionMetaMethod.invoke(ReflectionMetaMethod.java:56)
at org.codehaus.groovy.runtime.MetaClassHelper.doMethodInvoke(MetaClassHelper.java:546)
at groovy.lang.MetaClassImpl.invokeMethod(MetaClassImpl.java:903)
at org.codehaus.groovy.runtime.ScriptBytecodeAdapter.invokeMethodOnCurrentN(ScriptBytecodeAdapter.java:75)
at org.codehaus.groovy.runtime.ScriptBytecodeAdapter.invokeMethodOnCurrent0(ScriptBytecodeAdapter.java:107)
at org.codehaus.mojo.shitty.TestMojo.runAll(TestMojo.groovy:410)
at org.codehaus.mojo.shitty.TestMojo.this$5$runAll(TestMojo.groovy)
at sun.reflect.NativeMethodAccessorImpl.invoke0(Native Method)
at sun.reflect.NativeMethodAccessorImpl.invoke(NativeMethodAccessorImpl.java:39)
at sun.reflect.DelegatingMethodAccessorImpl.invoke(DelegatingMethodAccessorImpl.java:25)
at java.lang.reflect.Method.invoke(Method.java:585)
at org.codehaus.groovy.runtime.metaclass.ReflectionMetaMethod.invoke(ReflectionMetaMethod.java:56)
at org.codehaus.groovy.runtime.MetaClassHelper.doMethodInvoke(MetaClassHelper.java:546)
at groovy.lang.MetaClassImpl.invokeMethod(MetaClassImpl.java:903)
at org.codehaus.groovy.runtime.ScriptBytecodeAdapter.invokeMethodOnCurrentN(ScriptBytecodeAdapter.java:75)
at org.codehaus.groovy.runtime.ScriptBytecodeAdapter.invokeMethodOnCurrent0(ScriptBytecodeAdapter.java:107)
at org.codehaus.mojo.shitty.TestMojo.execute(TestMojo.groovy:238)
at org.apache.maven.plugin.DefaultPluginManager.executeMojo(DefaultPluginManager.java:443)
at org.apache.maven.lifecycle.DefaultLifecycleExecutor.executeGoals(DefaultLifecycleExecutor.java:539)
... 16 more
[INFO] ------------------------------------------------------------------------
[INFO] Total time: 6 minutes 35 seconds
[INFO] Finished at: Thu Feb 07 15:23:51 EST 2008
[INFO] Final Memory: 139M/545M
[INFO] ------------------------------------------------------------------------