You are viewing a plain text version of this content. The canonical link for it is here.
Posted to hdfs-dev@hadoop.apache.org by Apache Jenkins Server <je...@builds.apache.org> on 2012/05/22 14:42:29 UTC

Jenkins build became unstable: Hadoop-Hdfs-0.23-Build #264

See <https://builds.apache.org/job/Hadoop-Hdfs-0.23-Build/264/changes>


Hadoop-Hdfs-0.23-Build - Build # 265 - Failure

Posted by Apache Jenkins Server <je...@builds.apache.org>.
See https://builds.apache.org/job/Hadoop-Hdfs-0.23-Build/265/

###################################################################################
########################## LAST 60 LINES OF THE CONSOLE ###########################
[...truncated 13895 lines...]
[INFO] Rendering site with org.apache.maven.skins:maven-stylus-skin:jar:1.2 skin.
[INFO] 
[INFO] --- maven-war-plugin:2.1:war (default-war) @ hadoop-hdfs-httpfs ---
[INFO] Packaging webapp
[INFO] Assembling webapp [hadoop-hdfs-httpfs] in [/home/jenkins/jenkins-slave/workspace/Hadoop-Hdfs-0.23-Build/trunk/hadoop-hdfs-project/hadoop-hdfs-httpfs/target/webhdfs]
[INFO] Processing war project
[INFO] Copying webapp resources [/home/jenkins/jenkins-slave/workspace/Hadoop-Hdfs-0.23-Build/trunk/hadoop-hdfs-project/hadoop-hdfs-httpfs/src/main/webapp]
[INFO] Webapp assembled in [825 msecs]
[INFO] Building war: /home/jenkins/jenkins-slave/workspace/Hadoop-Hdfs-0.23-Build/trunk/hadoop-hdfs-project/hadoop-hdfs-httpfs/target/webhdfs.war
[INFO] WEB-INF/web.xml already added, skipping
[INFO] 
[INFO] --- maven-source-plugin:2.1.2:jar-no-fork (hadoop-java-sources) @ hadoop-hdfs-httpfs ---
[INFO] Building jar: /home/jenkins/jenkins-slave/workspace/Hadoop-Hdfs-0.23-Build/trunk/hadoop-hdfs-project/hadoop-hdfs-httpfs/target/hadoop-hdfs-httpfs-0.23.3-SNAPSHOT-sources.jar
[INFO] 
[INFO] --- maven-site-plugin:3.0:attach-descriptor (attach-descriptor) @ hadoop-hdfs-httpfs ---
[INFO] 
[INFO] --- maven-assembly-plugin:2.3:single (dist) @ hadoop-hdfs-httpfs ---
[INFO] Copying files to /home/jenkins/jenkins-slave/workspace/Hadoop-Hdfs-0.23-Build/trunk/hadoop-hdfs-project/hadoop-hdfs-httpfs/target/hadoop-hdfs-httpfs-0.23.3-SNAPSHOT
[INFO] 
[INFO] --- maven-antrun-plugin:1.6:run (dist) @ hadoop-hdfs-httpfs ---
[INFO] Executing tasks

main:
    [mkdir] Created dir: /home/jenkins/jenkins-slave/workspace/Hadoop-Hdfs-0.23-Build/trunk/hadoop-hdfs-project/hadoop-hdfs-httpfs/downloads
      [get] Getting: http://archive.apache.org/dist/tomcat/tomcat-6/v6.0.32/bin/apache-tomcat-6.0.32.tar.gz
      [get] To: /home/jenkins/jenkins-slave/workspace/Hadoop-Hdfs-0.23-Build/trunk/hadoop-hdfs-project/hadoop-hdfs-httpfs/downloads/tomcat.tar.gz
      [get] Error getting http://archive.apache.org/dist/tomcat/tomcat-6/v6.0.32/bin/apache-tomcat-6.0.32.tar.gz to /home/jenkins/jenkins-slave/workspace/Hadoop-Hdfs-0.23-Build/trunk/hadoop-hdfs-project/hadoop-hdfs-httpfs/downloads/tomcat.tar.gz
[INFO] ------------------------------------------------------------------------
[INFO] Reactor Summary:
[INFO] 
[INFO] Apache Hadoop HDFS ................................ SUCCESS [25:46.311s]
[INFO] Apache Hadoop HttpFS .............................. FAILURE [55.138s]
[INFO] Apache Hadoop HDFS Project ........................ SKIPPED
[INFO] ------------------------------------------------------------------------
[INFO] BUILD FAILURE
[INFO] ------------------------------------------------------------------------
[INFO] Total time: 26:44.208s
[INFO] Finished at: Wed May 23 12:12:32 UTC 2012
[INFO] Final Memory: 72M/747M
[INFO] ------------------------------------------------------------------------
[ERROR] Failed to execute goal org.apache.maven.plugins:maven-antrun-plugin:1.6:run (dist) on project hadoop-hdfs-httpfs: An Ant BuildException has occured: java.net.ConnectException: Connection timed out -> [Help 1]
[ERROR] 
[ERROR] To see the full stack trace of the errors, re-run Maven with the -e switch.
[ERROR] Re-run Maven using the -X switch to enable full debug logging.
[ERROR] 
[ERROR] For more information about the errors and possible solutions, please read the following articles:
[ERROR] [Help 1] http://cwiki.apache.org/confluence/display/MAVEN/MojoExecutionException
[ERROR] 
[ERROR] After correcting the problems, you can resume the build with the command
[ERROR]   mvn <goals> -rf :hadoop-hdfs-httpfs
+ /home/jenkins/tools/maven/latest/bin/mvn test -Dmaven.test.failure.ignore=true -Pclover -DcloverLicenseLocation=/home/jenkins/tools/clover/latest/lib/clover.license
Build step 'Execute shell' marked build as failure
Archiving artifacts
Recording test results
Publishing Javadoc
Recording fingerprints
Sending e-mails to: hdfs-dev@hadoop.apache.org
Email was triggered for: Failure
Sending email for trigger: Failure



###################################################################################
############################## FAILED TESTS (if any) ##############################
13 tests failed.
REGRESSION:  org.apache.hadoop.hdfs.TestDatanodeBlockScanner.testBlockCorruptionRecoveryPolicy1

Error Message:
Timed out waiting for corrupt replicas. Waiting for 1, but only found 0

Stack Trace:
java.util.concurrent.TimeoutException: Timed out waiting for corrupt replicas. Waiting for 1, but only found 0
	at org.apache.hadoop.hdfs.DFSTestUtil.waitCorruptReplicas(DFSTestUtil.java:329)
	at org.apache.hadoop.hdfs.TestDatanodeBlockScanner.blockCorruptionRecoveryPolicy(TestDatanodeBlockScanner.java:288)
	at org.apache.hadoop.hdfs.TestDatanodeBlockScanner.__CLR3_0_2wadu2tz5r(TestDatanodeBlockScanner.java:236)
	at org.apache.hadoop.hdfs.TestDatanodeBlockScanner.testBlockCorruptionRecoveryPolicy1(TestDatanodeBlockScanner.java:233)
	at sun.reflect.NativeMethodAccessorImpl.invoke0(Native Method)
	at sun.reflect.NativeMethodAccessorImpl.invoke(NativeMethodAccessorImpl.java:39)
	at sun.reflect.DelegatingMethodAccessorImpl.invoke(DelegatingMethodAccessorImpl.java:25)
	at java.lang.reflect.Method.invoke(Method.java:597)
	at junit.framework.TestCase.runTest(TestCase.java:168)
	at junit.framework.TestCase.runBare(TestCase.java:134)
	at junit.framework.TestResult$1.protect(TestResult.java:110)
	at junit.framework.TestResult.runProtected(TestResult.java:128)
	at junit.framework.TestResult.run(TestResult.java:113)
	at junit.framework.TestCase.run(TestCase.java:124)
	at junit.framework.TestSuite.runTest(TestSuite.java:243)
	at junit.framework.TestSuite.run(TestSuite.java:238)
	at org.junit.internal.runners.JUnit38ClassRunner.run(JUnit38ClassRunner.java:83)
	at org.apache.maven.surefire.junit4.JUnit4TestSet.execute(JUnit4TestSet.java:53)
	at org.apache.maven.surefire.junit4.JUnit4Provider.executeTestSet(JUnit4Provider.java:123)
	at org.apache.maven.surefire.junit4.JUnit4Provider.invoke(JUnit4Provider.java:104)
	at sun.reflect.NativeMethodAccessorImpl.invoke0(Native Method)
	at sun.reflect.NativeMethodAccessorImpl.invoke(NativeMethodAccessorImpl.java:39)
	at sun.reflect.DelegatingMethodAccessorImpl.invoke(DelegatingMethodAccessorImpl.java:25)
	at java.lang.reflect.Method.invoke(Method.java:597)
	at org.apache.maven.surefire.util.ReflectionUtils.invokeMethodWithArray(ReflectionUtils.java:164)
	at org.apache.maven.surefire.booter.ProviderFactory$ProviderProxy.invoke(ProviderFactory.java:110)
	at org.apache.maven.surefire.booter.SurefireStarter.invokeProvider(SurefireStarter.java:175)
	at org.apache.maven.surefire.booter.SurefireStarter.runSuitesInProcessWhenForked(SurefireStarter.java:81)
	at org.apache.maven.surefire.booter.ForkedBooter.main(ForkedBooter.java:68)


REGRESSION:  org.apache.hadoop.hdfs.TestDatanodeBlockScanner.testBlockCorruptionRecoveryPolicy2

Error Message:
Cannot lock storage /home/jenkins/jenkins-slave/workspace/Hadoop-Hdfs-0.23-Build/trunk/hadoop-hdfs-project/hadoop-hdfs/target/test/data/dfs/name1. The directory is already locked.

Stack Trace:
java.io.IOException: Cannot lock storage /home/jenkins/jenkins-slave/workspace/Hadoop-Hdfs-0.23-Build/trunk/hadoop-hdfs-project/hadoop-hdfs/target/test/data/dfs/name1. The directory is already locked.
	at org.apache.hadoop.hdfs.server.common.Storage$StorageDirectory.lock(Storage.java:586)
	at org.apache.hadoop.hdfs.server.common.Storage$StorageDirectory.analyzeStorage(Storage.java:435)
	at org.apache.hadoop.hdfs.server.namenode.FSImage.recoverStorageDirs(FSImage.java:294)
	at org.apache.hadoop.hdfs.server.namenode.FSImage.recoverTransitionRead(FSImage.java:210)
	at org.apache.hadoop.hdfs.server.namenode.FSDirectory.loadFSImage(FSDirectory.java:175)
	at org.apache.hadoop.hdfs.server.namenode.FSNamesystem.initialize(FSNamesystem.java:331)
	at org.apache.hadoop.hdfs.server.namenode.FSNamesystem.<init>(FSNamesystem.java:303)
	at org.apache.hadoop.hdfs.server.namenode.NameNode.loadNamesystem(NameNode.java:299)
	at org.apache.hadoop.hdfs.server.namenode.NameNode.initialize(NameNode.java:333)
	at org.apache.hadoop.hdfs.server.namenode.NameNode.<init>(NameNode.java:459)
	at org.apache.hadoop.hdfs.server.namenode.NameNode.<init>(NameNode.java:451)
	at org.apache.hadoop.hdfs.server.namenode.NameNode.createNameNode(NameNode.java:752)
	at org.apache.hadoop.hdfs.MiniDFSCluster.createNameNode(MiniDFSCluster.java:642)
	at org.apache.hadoop.hdfs.MiniDFSCluster.initMiniDFSCluster(MiniDFSCluster.java:546)
	at org.apache.hadoop.hdfs.MiniDFSCluster.<init>(MiniDFSCluster.java:262)
	at org.apache.hadoop.hdfs.MiniDFSCluster.<init>(MiniDFSCluster.java:86)
	at org.apache.hadoop.hdfs.MiniDFSCluster$Builder.build(MiniDFSCluster.java:248)
	at org.apache.hadoop.hdfs.TestDatanodeBlockScanner.blockCorruptionRecoveryPolicy(TestDatanodeBlockScanner.java:255)
	at org.apache.hadoop.hdfs.TestDatanodeBlockScanner.__CLR3_0_2t1dvacz5u(TestDatanodeBlockScanner.java:242)
	at org.apache.hadoop.hdfs.TestDatanodeBlockScanner.testBlockCorruptionRecoveryPolicy2(TestDatanodeBlockScanner.java:239)
	at sun.reflect.NativeMethodAccessorImpl.invoke0(Native Method)
	at sun.reflect.NativeMethodAccessorImpl.invoke(NativeMethodAccessorImpl.java:39)
	at sun.reflect.DelegatingMethodAccessorImpl.invoke(DelegatingMethodAccessorImpl.java:25)
	at java.lang.reflect.Method.invoke(Method.java:597)
	at junit.framework.TestCase.runTest(TestCase.java:168)
	at junit.framework.TestCase.runBare(TestCase.java:134)
	at junit.framework.TestResult$1.protect(TestResult.java:110)
	at junit.framework.TestResult.runProtected(TestResult.java:128)
	at junit.framework.TestResult.run(TestResult.java:113)
	at junit.framework.TestCase.run(TestCase.java:124)
	at junit.framework.TestSuite.runTest(TestSuite.java:243)
	at junit.framework.TestSuite.run(TestSuite.java:238)
	at org.junit.internal.runners.JUnit38ClassRunner.run(JUnit38ClassRunner.java:83)
	at org.apache.maven.surefire.junit4.JUnit4TestSet.execute(JUnit4TestSet.java:53)
	at org.apache.maven.surefire.junit4.JUnit4Provider.executeTestSet(JUnit4Provider.java:123)
	at org.apache.maven.surefire.junit4.JUnit4Provider.invoke(JUnit4Provider.java:104)
	at sun.reflect.NativeMethodAccessorImpl.invoke0(Native Method)
	at sun.reflect.NativeMethodAccessorImpl.invoke(NativeMethodAccessorImpl.java:39)
	at sun.reflect.DelegatingMethodAccessorImpl.invoke(DelegatingMethodAccessorImpl.java:25)
	at java.lang.reflect.Method.invoke(Method.java:597)
	at org.apache.maven.surefire.util.ReflectionUtils.invokeMethodWithArray(ReflectionUtils.java:164)
	at org.apache.maven.surefire.booter.ProviderFactory$ProviderProxy.invoke(ProviderFactory.java:110)
	at org.apache.maven.surefire.booter.SurefireStarter.invokeProvider(SurefireStarter.java:175)
	at org.apache.maven.surefire.booter.SurefireStarter.runSuitesInProcessWhenForked(SurefireStarter.java:81)
	at org.apache.maven.surefire.booter.ForkedBooter.main(ForkedBooter.java:68)


REGRESSION:  org.apache.hadoop.hdfs.TestDatanodeBlockScanner.testTruncatedBlockReport

Error Message:
Cannot lock storage /home/jenkins/jenkins-slave/workspace/Hadoop-Hdfs-0.23-Build/trunk/hadoop-hdfs-project/hadoop-hdfs/target/test/data/dfs/name1. The directory is already locked.

Stack Trace:
java.io.IOException: Cannot lock storage /home/jenkins/jenkins-slave/workspace/Hadoop-Hdfs-0.23-Build/trunk/hadoop-hdfs-project/hadoop-hdfs/target/test/data/dfs/name1. The directory is already locked.
	at org.apache.hadoop.hdfs.server.common.Storage$StorageDirectory.lock(Storage.java:586)
	at org.apache.hadoop.hdfs.server.common.Storage$StorageDirectory.analyzeStorage(Storage.java:435)
	at org.apache.hadoop.hdfs.server.namenode.FSImage.recoverStorageDirs(FSImage.java:294)
	at org.apache.hadoop.hdfs.server.namenode.FSImage.recoverTransitionRead(FSImage.java:210)
	at org.apache.hadoop.hdfs.server.namenode.FSDirectory.loadFSImage(FSDirectory.java:175)
	at org.apache.hadoop.hdfs.server.namenode.FSNamesystem.initialize(FSNamesystem.java:331)
	at org.apache.hadoop.hdfs.server.namenode.FSNamesystem.<init>(FSNamesystem.java:303)
	at org.apache.hadoop.hdfs.server.namenode.NameNode.loadNamesystem(NameNode.java:299)
	at org.apache.hadoop.hdfs.server.namenode.NameNode.initialize(NameNode.java:333)
	at org.apache.hadoop.hdfs.server.namenode.NameNode.<init>(NameNode.java:459)
	at org.apache.hadoop.hdfs.server.namenode.NameNode.<init>(NameNode.java:451)
	at org.apache.hadoop.hdfs.server.namenode.NameNode.createNameNode(NameNode.java:752)
	at org.apache.hadoop.hdfs.MiniDFSCluster.createNameNode(MiniDFSCluster.java:642)
	at org.apache.hadoop.hdfs.MiniDFSCluster.initMiniDFSCluster(MiniDFSCluster.java:546)
	at org.apache.hadoop.hdfs.MiniDFSCluster.<init>(MiniDFSCluster.java:262)
	at org.apache.hadoop.hdfs.MiniDFSCluster.<init>(MiniDFSCluster.java:86)
	at org.apache.hadoop.hdfs.MiniDFSCluster$Builder.build(MiniDFSCluster.java:248)
	at org.apache.hadoop.hdfs.TestDatanodeBlockScanner.__CLR3_0_226b7dwz6t(TestDatanodeBlockScanner.java:314)
	at org.apache.hadoop.hdfs.TestDatanodeBlockScanner.testTruncatedBlockReport(TestDatanodeBlockScanner.java:303)
	at sun.reflect.NativeMethodAccessorImpl.invoke0(Native Method)
	at sun.reflect.NativeMethodAccessorImpl.invoke(NativeMethodAccessorImpl.java:39)
	at sun.reflect.DelegatingMethodAccessorImpl.invoke(DelegatingMethodAccessorImpl.java:25)
	at java.lang.reflect.Method.invoke(Method.java:597)
	at junit.framework.TestCase.runTest(TestCase.java:168)
	at junit.framework.TestCase.runBare(TestCase.java:134)
	at junit.framework.TestResult$1.protect(TestResult.java:110)
	at junit.framework.TestResult.runProtected(TestResult.java:128)
	at junit.framework.TestResult.run(TestResult.java:113)
	at junit.framework.TestCase.run(TestCase.java:124)
	at junit.framework.TestSuite.runTest(TestSuite.java:243)
	at junit.framework.TestSuite.run(TestSuite.java:238)
	at org.junit.internal.runners.JUnit38ClassRunner.run(JUnit38ClassRunner.java:83)
	at org.apache.maven.surefire.junit4.JUnit4TestSet.execute(JUnit4TestSet.java:53)
	at org.apache.maven.surefire.junit4.JUnit4Provider.executeTestSet(JUnit4Provider.java:123)
	at org.apache.maven.surefire.junit4.JUnit4Provider.invoke(JUnit4Provider.java:104)
	at sun.reflect.NativeMethodAccessorImpl.invoke0(Native Method)
	at sun.reflect.NativeMethodAccessorImpl.invoke(NativeMethodAccessorImpl.java:39)
	at sun.reflect.DelegatingMethodAccessorImpl.invoke(DelegatingMethodAccessorImpl.java:25)
	at java.lang.reflect.Method.invoke(Method.java:597)
	at org.apache.maven.surefire.util.ReflectionUtils.invokeMethodWithArray(ReflectionUtils.java:164)
	at org.apache.maven.surefire.booter.ProviderFactory$ProviderProxy.invoke(ProviderFactory.java:110)
	at org.apache.maven.surefire.booter.SurefireStarter.invokeProvider(SurefireStarter.java:175)
	at org.apache.maven.surefire.booter.SurefireStarter.runSuitesInProcessWhenForked(SurefireStarter.java:81)
	at org.apache.maven.surefire.booter.ForkedBooter.main(ForkedBooter.java:68)


REGRESSION:  org.apache.hadoop.hdfs.TestDecommission.testDecommission

Error Message:
Cannot lock storage /home/jenkins/jenkins-slave/workspace/Hadoop-Hdfs-0.23-Build/trunk/hadoop-hdfs-project/hadoop-hdfs/target/test/data/dfs/name1. The directory is already locked.

Stack Trace:
java.io.IOException: Cannot lock storage /home/jenkins/jenkins-slave/workspace/Hadoop-Hdfs-0.23-Build/trunk/hadoop-hdfs-project/hadoop-hdfs/target/test/data/dfs/name1. The directory is already locked.
	at org.apache.hadoop.hdfs.server.common.Storage$StorageDirectory.lock(Storage.java:586)
	at org.apache.hadoop.hdfs.server.common.Storage$StorageDirectory.analyzeStorage(Storage.java:435)
	at org.apache.hadoop.hdfs.server.namenode.FSImage.recoverStorageDirs(FSImage.java:294)
	at org.apache.hadoop.hdfs.server.namenode.FSImage.recoverTransitionRead(FSImage.java:210)
	at org.apache.hadoop.hdfs.server.namenode.FSDirectory.loadFSImage(FSDirectory.java:175)
	at org.apache.hadoop.hdfs.server.namenode.FSNamesystem.initialize(FSNamesystem.java:331)
	at org.apache.hadoop.hdfs.server.namenode.FSNamesystem.<init>(FSNamesystem.java:303)
	at org.apache.hadoop.hdfs.server.namenode.NameNode.loadNamesystem(NameNode.java:299)
	at org.apache.hadoop.hdfs.server.namenode.NameNode.initialize(NameNode.java:333)
	at org.apache.hadoop.hdfs.server.namenode.NameNode.<init>(NameNode.java:459)
	at org.apache.hadoop.hdfs.server.namenode.NameNode.<init>(NameNode.java:451)
	at org.apache.hadoop.hdfs.server.namenode.NameNode.createNameNode(NameNode.java:752)
	at org.apache.hadoop.hdfs.MiniDFSCluster.createNameNode(MiniDFSCluster.java:642)
	at org.apache.hadoop.hdfs.MiniDFSCluster.initMiniDFSCluster(MiniDFSCluster.java:546)
	at org.apache.hadoop.hdfs.MiniDFSCluster.<init>(MiniDFSCluster.java:262)
	at org.apache.hadoop.hdfs.MiniDFSCluster.<init>(MiniDFSCluster.java:86)
	at org.apache.hadoop.hdfs.MiniDFSCluster$Builder.build(MiniDFSCluster.java:248)
	at org.apache.hadoop.hdfs.TestDecommission.startCluster(TestDecommission.java:281)
	at org.apache.hadoop.hdfs.TestDecommission.testDecommission(TestDecommission.java:348)
	at org.apache.hadoop.hdfs.TestDecommission.__CLR3_0_2vwkiajzlt(TestDecommission.java:326)
	at org.apache.hadoop.hdfs.TestDecommission.testDecommission(TestDecommission.java:325)
	at sun.reflect.NativeMethodAccessorImpl.invoke0(Native Method)
	at sun.reflect.NativeMethodAccessorImpl.invoke(NativeMethodAccessorImpl.java:39)
	at sun.reflect.DelegatingMethodAccessorImpl.invoke(DelegatingMethodAccessorImpl.java:25)
	at java.lang.reflect.Method.invoke(Method.java:597)
	at org.junit.runners.model.FrameworkMethod$1.runReflectiveCall(FrameworkMethod.java:44)
	at org.junit.internal.runners.model.ReflectiveCallable.run(ReflectiveCallable.java:15)
	at org.junit.runners.model.FrameworkMethod.invokeExplosively(FrameworkMethod.java:41)
	at org.junit.internal.runners.statements.InvokeMethod.evaluate(InvokeMethod.java:20)
	at org.junit.internal.runners.statements.RunBefores.evaluate(RunBefores.java:28)
	at org.junit.internal.runners.statements.RunAfters.evaluate(RunAfters.java:31)
	at org.junit.runners.BlockJUnit4ClassRunner.runNotIgnored(BlockJUnit4ClassRunner.java:79)
	at org.junit.runners.BlockJUnit4ClassRunner.runChild(BlockJUnit4ClassRunner.java:71)
	at org.junit.runners.BlockJUnit4ClassRunner.runChild(BlockJUnit4ClassRunner.java:49)
	at org.junit.runners.ParentRunner$3.run(ParentRunner.java:193)
	at org.junit.runners.ParentRunner$1.schedule(ParentRunner.java:52)
	at org.junit.runners.ParentRunner.runChildren(ParentRunner.java:191)
	at org.junit.runners.ParentRunner.access$000(ParentRunner.java:42)
	at org.junit.runners.ParentRunner$2.evaluate(ParentRunner.java:184)
	at org.junit.runners.ParentRunner.run(ParentRunner.java:236)
	at org.apache.maven.surefire.junit4.JUnit4TestSet.execute(JUnit4TestSet.java:53)
	at org.apache.maven.surefire.junit4.JUnit4Provider.executeTestSet(JUnit4Provider.java:123)
	at org.apache.maven.surefire.junit4.JUnit4Provider.invoke(JUnit4Provider.java:104)
	at sun.reflect.NativeMethodAccessorImpl.invoke0(Native Method)
	at sun.reflect.NativeMethodAccessorImpl.invoke(NativeMethodAccessorImpl.java:39)
	at sun.reflect.DelegatingMethodAccessorImpl.invoke(DelegatingMethodAccessorImpl.java:25)
	at java.lang.reflect.Method.invoke(Method.java:597)
	at org.apache.maven.surefire.util.ReflectionUtils.invokeMethodWithArray(ReflectionUtils.java:164)
	at org.apache.maven.surefire.booter.ProviderFactory$ProviderProxy.invoke(ProviderFactory.java:110)
	at org.apache.maven.surefire.booter.SurefireStarter.invokeProvider(SurefireStarter.java:175)
	at org.apache.maven.surefire.booter.SurefireStarter.runSuitesInProcessWhenForked(SurefireStarter.java:81)
	at org.apache.maven.surefire.booter.ForkedBooter.main(ForkedBooter.java:68)


REGRESSION:  org.apache.hadoop.hdfs.TestDecommission.testRecommission

Error Message:
Cannot lock storage /home/jenkins/jenkins-slave/workspace/Hadoop-Hdfs-0.23-Build/trunk/hadoop-hdfs-project/hadoop-hdfs/target/test/data/dfs/name1. The directory is already locked.

Stack Trace:
java.io.IOException: Cannot lock storage /home/jenkins/jenkins-slave/workspace/Hadoop-Hdfs-0.23-Build/trunk/hadoop-hdfs-project/hadoop-hdfs/target/test/data/dfs/name1. The directory is already locked.
	at org.apache.hadoop.hdfs.server.common.Storage$StorageDirectory.lock(Storage.java:586)
	at org.apache.hadoop.hdfs.server.common.Storage$StorageDirectory.analyzeStorage(Storage.java:435)
	at org.apache.hadoop.hdfs.server.namenode.FSImage.recoverStorageDirs(FSImage.java:294)
	at org.apache.hadoop.hdfs.server.namenode.FSImage.recoverTransitionRead(FSImage.java:210)
	at org.apache.hadoop.hdfs.server.namenode.FSDirectory.loadFSImage(FSDirectory.java:175)
	at org.apache.hadoop.hdfs.server.namenode.FSNamesystem.initialize(FSNamesystem.java:331)
	at org.apache.hadoop.hdfs.server.namenode.FSNamesystem.<init>(FSNamesystem.java:303)
	at org.apache.hadoop.hdfs.server.namenode.NameNode.loadNamesystem(NameNode.java:299)
	at org.apache.hadoop.hdfs.server.namenode.NameNode.initialize(NameNode.java:333)
	at org.apache.hadoop.hdfs.server.namenode.NameNode.<init>(NameNode.java:459)
	at org.apache.hadoop.hdfs.server.namenode.NameNode.<init>(NameNode.java:451)
	at org.apache.hadoop.hdfs.server.namenode.NameNode.createNameNode(NameNode.java:752)
	at org.apache.hadoop.hdfs.MiniDFSCluster.createNameNode(MiniDFSCluster.java:642)
	at org.apache.hadoop.hdfs.MiniDFSCluster.initMiniDFSCluster(MiniDFSCluster.java:546)
	at org.apache.hadoop.hdfs.MiniDFSCluster.<init>(MiniDFSCluster.java:262)
	at org.apache.hadoop.hdfs.MiniDFSCluster.<init>(MiniDFSCluster.java:86)
	at org.apache.hadoop.hdfs.MiniDFSCluster$Builder.build(MiniDFSCluster.java:248)
	at org.apache.hadoop.hdfs.TestDecommission.startCluster(TestDecommission.java:281)
	at org.apache.hadoop.hdfs.TestDecommission.testRecommission(TestDecommission.java:391)
	at org.apache.hadoop.hdfs.TestDecommission.__CLR3_0_29t4815zlv(TestDecommission.java:334)
	at org.apache.hadoop.hdfs.TestDecommission.testRecommission(TestDecommission.java:333)
	at sun.reflect.NativeMethodAccessorImpl.invoke0(Native Method)
	at sun.reflect.NativeMethodAccessorImpl.invoke(NativeMethodAccessorImpl.java:39)
	at sun.reflect.DelegatingMethodAccessorImpl.invoke(DelegatingMethodAccessorImpl.java:25)
	at java.lang.reflect.Method.invoke(Method.java:597)
	at org.junit.runners.model.FrameworkMethod$1.runReflectiveCall(FrameworkMethod.java:44)
	at org.junit.internal.runners.model.ReflectiveCallable.run(ReflectiveCallable.java:15)
	at org.junit.runners.model.FrameworkMethod.invokeExplosively(FrameworkMethod.java:41)
	at org.junit.internal.runners.statements.InvokeMethod.evaluate(InvokeMethod.java:20)
	at org.junit.internal.runners.statements.RunBefores.evaluate(RunBefores.java:28)
	at org.junit.internal.runners.statements.RunAfters.evaluate(RunAfters.java:31)
	at org.junit.runners.BlockJUnit4ClassRunner.runNotIgnored(BlockJUnit4ClassRunner.java:79)
	at org.junit.runners.BlockJUnit4ClassRunner.runChild(BlockJUnit4ClassRunner.java:71)
	at org.junit.runners.BlockJUnit4ClassRunner.runChild(BlockJUnit4ClassRunner.java:49)
	at org.junit.runners.ParentRunner$3.run(ParentRunner.java:193)
	at org.junit.runners.ParentRunner$1.schedule(ParentRunner.java:52)
	at org.junit.runners.ParentRunner.runChildren(ParentRunner.java:191)
	at org.junit.runners.ParentRunner.access$000(ParentRunner.java:42)
	at org.junit.runners.ParentRunner$2.evaluate(ParentRunner.java:184)
	at org.junit.runners.ParentRunner.run(ParentRunner.java:236)
	at org.apache.maven.surefire.junit4.JUnit4TestSet.execute(JUnit4TestSet.java:53)
	at org.apache.maven.surefire.junit4.JUnit4Provider.executeTestSet(JUnit4Provider.java:123)
	at org.apache.maven.surefire.junit4.JUnit4Provider.invoke(JUnit4Provider.java:104)
	at sun.reflect.NativeMethodAccessorImpl.invoke0(Native Method)
	at sun.reflect.NativeMethodAccessorImpl.invoke(NativeMethodAccessorImpl.java:39)
	at sun.reflect.DelegatingMethodAccessorImpl.invoke(DelegatingMethodAccessorImpl.java:25)
	at java.lang.reflect.Method.invoke(Method.java:597)
	at org.apache.maven.surefire.util.ReflectionUtils.invokeMethodWithArray(ReflectionUtils.java:164)
	at org.apache.maven.surefire.booter.ProviderFactory$ProviderProxy.invoke(ProviderFactory.java:110)
	at org.apache.maven.surefire.booter.SurefireStarter.invokeProvider(SurefireStarter.java:175)
	at org.apache.maven.surefire.booter.SurefireStarter.runSuitesInProcessWhenForked(SurefireStarter.java:81)
	at org.apache.maven.surefire.booter.ForkedBooter.main(ForkedBooter.java:68)


REGRESSION:  org.apache.hadoop.hdfs.TestDecommission.testDecommissionFederation

Error Message:
Cannot lock storage /home/jenkins/jenkins-slave/workspace/Hadoop-Hdfs-0.23-Build/trunk/hadoop-hdfs-project/hadoop-hdfs/target/test/data/dfs/name1. The directory is already locked.

Stack Trace:
java.io.IOException: Cannot lock storage /home/jenkins/jenkins-slave/workspace/Hadoop-Hdfs-0.23-Build/trunk/hadoop-hdfs-project/hadoop-hdfs/target/test/data/dfs/name1. The directory is already locked.
	at org.apache.hadoop.hdfs.server.common.Storage$StorageDirectory.lock(Storage.java:586)
	at org.apache.hadoop.hdfs.server.common.Storage$StorageDirectory.analyzeStorage(Storage.java:435)
	at org.apache.hadoop.hdfs.server.namenode.FSImage.recoverStorageDirs(FSImage.java:294)
	at org.apache.hadoop.hdfs.server.namenode.FSImage.recoverTransitionRead(FSImage.java:210)
	at org.apache.hadoop.hdfs.server.namenode.FSDirectory.loadFSImage(FSDirectory.java:175)
	at org.apache.hadoop.hdfs.server.namenode.FSNamesystem.initialize(FSNamesystem.java:331)
	at org.apache.hadoop.hdfs.server.namenode.FSNamesystem.<init>(FSNamesystem.java:303)
	at org.apache.hadoop.hdfs.server.namenode.NameNode.loadNamesystem(NameNode.java:299)
	at org.apache.hadoop.hdfs.server.namenode.NameNode.initialize(NameNode.java:333)
	at org.apache.hadoop.hdfs.server.namenode.NameNode.<init>(NameNode.java:459)
	at org.apache.hadoop.hdfs.server.namenode.NameNode.<init>(NameNode.java:451)
	at org.apache.hadoop.hdfs.server.namenode.NameNode.createNameNode(NameNode.java:752)
	at org.apache.hadoop.hdfs.MiniDFSCluster.createNameNode(MiniDFSCluster.java:642)
	at org.apache.hadoop.hdfs.MiniDFSCluster.createFederatedNameNode(MiniDFSCluster.java:650)
	at org.apache.hadoop.hdfs.MiniDFSCluster.createFederationNamenodes(MiniDFSCluster.java:611)
	at org.apache.hadoop.hdfs.MiniDFSCluster.initMiniDFSCluster(MiniDFSCluster.java:557)
	at org.apache.hadoop.hdfs.MiniDFSCluster.<init>(MiniDFSCluster.java:262)
	at org.apache.hadoop.hdfs.MiniDFSCluster.<init>(MiniDFSCluster.java:86)
	at org.apache.hadoop.hdfs.MiniDFSCluster$Builder.build(MiniDFSCluster.java:248)
	at org.apache.hadoop.hdfs.TestDecommission.startCluster(TestDecommission.java:281)
	at org.apache.hadoop.hdfs.TestDecommission.testDecommission(TestDecommission.java:348)
	at org.apache.hadoop.hdfs.TestDecommission.__CLR3_0_2idcfzczlx(TestDecommission.java:342)
	at org.apache.hadoop.hdfs.TestDecommission.testDecommissionFederation(TestDecommission.java:341)
	at sun.reflect.NativeMethodAccessorImpl.invoke0(Native Method)
	at sun.reflect.NativeMethodAccessorImpl.invoke(NativeMethodAccessorImpl.java:39)
	at sun.reflect.DelegatingMethodAccessorImpl.invoke(DelegatingMethodAccessorImpl.java:25)
	at java.lang.reflect.Method.invoke(Method.java:597)
	at org.junit.runners.model.FrameworkMethod$1.runReflectiveCall(FrameworkMethod.java:44)
	at org.junit.internal.runners.model.ReflectiveCallable.run(ReflectiveCallable.java:15)
	at org.junit.runners.model.FrameworkMethod.invokeExplosively(FrameworkMethod.java:41)
	at org.junit.internal.runners.statements.InvokeMethod.evaluate(InvokeMethod.java:20)
	at org.junit.internal.runners.statements.RunBefores.evaluate(RunBefores.java:28)
	at org.junit.internal.runners.statements.RunAfters.evaluate(RunAfters.java:31)
	at org.junit.runners.BlockJUnit4ClassRunner.runNotIgnored(BlockJUnit4ClassRunner.java:79)
	at org.junit.runners.BlockJUnit4ClassRunner.runChild(BlockJUnit4ClassRunner.java:71)
	at org.junit.runners.BlockJUnit4ClassRunner.runChild(BlockJUnit4ClassRunner.java:49)
	at org.junit.runners.ParentRunner$3.run(ParentRunner.java:193)
	at org.junit.runners.ParentRunner$1.schedule(ParentRunner.java:52)
	at org.junit.runners.ParentRunner.runChildren(ParentRunner.java:191)
	at org.junit.runners.ParentRunner.access$000(ParentRunner.java:42)
	at org.junit.runners.ParentRunner$2.evaluate(ParentRunner.java:184)
	at org.junit.runners.ParentRunner.run(ParentRunner.java:236)
	at org.apache.maven.surefire.junit4.JUnit4TestSet.execute(JUnit4TestSet.java:53)
	at org.apache.maven.surefire.junit4.JUnit4Provider.executeTestSet(JUnit4Provider.java:123)
	at org.apache.maven.surefire.junit4.JUnit4Provider.invoke(JUnit4Provider.java:104)
	at sun.reflect.NativeMethodAccessorImpl.invoke0(Native Method)
	at sun.reflect.NativeMethodAccessorImpl.invoke(NativeMethodAccessorImpl.java:39)
	at sun.reflect.DelegatingMethodAccessorImpl.invoke(DelegatingMethodAccessorImpl.java:25)
	at java.lang.reflect.Method.invoke(Method.java:597)
	at org.apache.maven.surefire.util.ReflectionUtils.invokeMethodWithArray(ReflectionUtils.java:164)
	at org.apache.maven.surefire.booter.ProviderFactory$ProviderProxy.invoke(ProviderFactory.java:110)
	at org.apache.maven.surefire.booter.SurefireStarter.invokeProvider(SurefireStarter.java:175)
	at org.apache.maven.surefire.booter.SurefireStarter.runSuitesInProcessWhenForked(SurefireStarter.java:81)
	at org.apache.maven.surefire.booter.ForkedBooter.main(ForkedBooter.java:68)


REGRESSION:  org.apache.hadoop.hdfs.TestDecommission.testClusterStats

Error Message:
Cannot lock storage /home/jenkins/jenkins-slave/workspace/Hadoop-Hdfs-0.23-Build/trunk/hadoop-hdfs-project/hadoop-hdfs/target/test/data/dfs/name1. The directory is already locked.

Stack Trace:
java.io.IOException: Cannot lock storage /home/jenkins/jenkins-slave/workspace/Hadoop-Hdfs-0.23-Build/trunk/hadoop-hdfs-project/hadoop-hdfs/target/test/data/dfs/name1. The directory is already locked.
	at org.apache.hadoop.hdfs.server.common.Storage$StorageDirectory.lock(Storage.java:586)
	at org.apache.hadoop.hdfs.server.common.Storage$StorageDirectory.analyzeStorage(Storage.java:435)
	at org.apache.hadoop.hdfs.server.namenode.FSImage.recoverStorageDirs(FSImage.java:294)
	at org.apache.hadoop.hdfs.server.namenode.FSImage.recoverTransitionRead(FSImage.java:210)
	at org.apache.hadoop.hdfs.server.namenode.FSDirectory.loadFSImage(FSDirectory.java:175)
	at org.apache.hadoop.hdfs.server.namenode.FSNamesystem.initialize(FSNamesystem.java:331)
	at org.apache.hadoop.hdfs.server.namenode.FSNamesystem.<init>(FSNamesystem.java:303)
	at org.apache.hadoop.hdfs.server.namenode.NameNode.loadNamesystem(NameNode.java:299)
	at org.apache.hadoop.hdfs.server.namenode.NameNode.initialize(NameNode.java:333)
	at org.apache.hadoop.hdfs.server.namenode.NameNode.<init>(NameNode.java:459)
	at org.apache.hadoop.hdfs.server.namenode.NameNode.<init>(NameNode.java:451)
	at org.apache.hadoop.hdfs.server.namenode.NameNode.createNameNode(NameNode.java:752)
	at org.apache.hadoop.hdfs.MiniDFSCluster.createNameNode(MiniDFSCluster.java:642)
	at org.apache.hadoop.hdfs.MiniDFSCluster.initMiniDFSCluster(MiniDFSCluster.java:546)
	at org.apache.hadoop.hdfs.MiniDFSCluster.<init>(MiniDFSCluster.java:262)
	at org.apache.hadoop.hdfs.MiniDFSCluster.<init>(MiniDFSCluster.java:86)
	at org.apache.hadoop.hdfs.MiniDFSCluster$Builder.build(MiniDFSCluster.java:248)
	at org.apache.hadoop.hdfs.TestDecommission.startCluster(TestDecommission.java:281)
	at org.apache.hadoop.hdfs.TestDecommission.testClusterStats(TestDecommission.java:460)
	at org.apache.hadoop.hdfs.TestDecommission.__CLR3_0_2jz2dpaznr(TestDecommission.java:444)
	at org.apache.hadoop.hdfs.TestDecommission.testClusterStats(TestDecommission.java:443)
	at sun.reflect.NativeMethodAccessorImpl.invoke0(Native Method)
	at sun.reflect.NativeMethodAccessorImpl.invoke(NativeMethodAccessorImpl.java:39)
	at sun.reflect.DelegatingMethodAccessorImpl.invoke(DelegatingMethodAccessorImpl.java:25)
	at java.lang.reflect.Method.invoke(Method.java:597)
	at org.junit.runners.model.FrameworkMethod$1.runReflectiveCall(FrameworkMethod.java:44)
	at org.junit.internal.runners.model.ReflectiveCallable.run(ReflectiveCallable.java:15)
	at org.junit.runners.model.FrameworkMethod.invokeExplosively(FrameworkMethod.java:41)
	at org.junit.internal.runners.statements.InvokeMethod.evaluate(InvokeMethod.java:20)
	at org.junit.internal.runners.statements.RunBefores.evaluate(RunBefores.java:28)
	at org.junit.internal.runners.statements.RunAfters.evaluate(RunAfters.java:31)
	at org.junit.runners.BlockJUnit4ClassRunner.runNotIgnored(BlockJUnit4ClassRunner.java:79)
	at org.junit.runners.BlockJUnit4ClassRunner.runChild(BlockJUnit4ClassRunner.java:71)
	at org.junit.runners.BlockJUnit4ClassRunner.runChild(BlockJUnit4ClassRunner.java:49)
	at org.junit.runners.ParentRunner$3.run(ParentRunner.java:193)
	at org.junit.runners.ParentRunner$1.schedule(ParentRunner.java:52)
	at org.junit.runners.ParentRunner.runChildren(ParentRunner.java:191)
	at org.junit.runners.ParentRunner.access$000(ParentRunner.java:42)
	at org.junit.runners.ParentRunner$2.evaluate(ParentRunner.java:184)
	at org.junit.runners.ParentRunner.run(ParentRunner.java:236)
	at org.apache.maven.surefire.junit4.JUnit4TestSet.execute(JUnit4TestSet.java:53)
	at org.apache.maven.surefire.junit4.JUnit4Provider.executeTestSet(JUnit4Provider.java:123)
	at org.apache.maven.surefire.junit4.JUnit4Provider.invoke(JUnit4Provider.java:104)
	at sun.reflect.NativeMethodAccessorImpl.invoke0(Native Method)
	at sun.reflect.NativeMethodAccessorImpl.invoke(NativeMethodAccessorImpl.java:39)
	at sun.reflect.DelegatingMethodAccessorImpl.invoke(DelegatingMethodAccessorImpl.java:25)
	at java.lang.reflect.Method.invoke(Method.java:597)
	at org.apache.maven.surefire.util.ReflectionUtils.invokeMethodWithArray(ReflectionUtils.java:164)
	at org.apache.maven.surefire.booter.ProviderFactory$ProviderProxy.invoke(ProviderFactory.java:110)
	at org.apache.maven.surefire.booter.SurefireStarter.invokeProvider(SurefireStarter.java:175)
	at org.apache.maven.surefire.booter.SurefireStarter.runSuitesInProcessWhenForked(SurefireStarter.java:81)
	at org.apache.maven.surefire.booter.ForkedBooter.main(ForkedBooter.java:68)


REGRESSION:  org.apache.hadoop.hdfs.TestDecommission.testClusterStatsFederation

Error Message:
Cannot lock storage /home/jenkins/jenkins-slave/workspace/Hadoop-Hdfs-0.23-Build/trunk/hadoop-hdfs-project/hadoop-hdfs/target/test/data/dfs/name1. The directory is already locked.

Stack Trace:
java.io.IOException: Cannot lock storage /home/jenkins/jenkins-slave/workspace/Hadoop-Hdfs-0.23-Build/trunk/hadoop-hdfs-project/hadoop-hdfs/target/test/data/dfs/name1. The directory is already locked.
	at org.apache.hadoop.hdfs.server.common.Storage$StorageDirectory.lock(Storage.java:586)
	at org.apache.hadoop.hdfs.server.common.Storage$StorageDirectory.analyzeStorage(Storage.java:435)
	at org.apache.hadoop.hdfs.server.namenode.FSImage.recoverStorageDirs(FSImage.java:294)
	at org.apache.hadoop.hdfs.server.namenode.FSImage.recoverTransitionRead(FSImage.java:210)
	at org.apache.hadoop.hdfs.server.namenode.FSDirectory.loadFSImage(FSDirectory.java:175)
	at org.apache.hadoop.hdfs.server.namenode.FSNamesystem.initialize(FSNamesystem.java:331)
	at org.apache.hadoop.hdfs.server.namenode.FSNamesystem.<init>(FSNamesystem.java:303)
	at org.apache.hadoop.hdfs.server.namenode.NameNode.loadNamesystem(NameNode.java:299)
	at org.apache.hadoop.hdfs.server.namenode.NameNode.initialize(NameNode.java:333)
	at org.apache.hadoop.hdfs.server.namenode.NameNode.<init>(NameNode.java:459)
	at org.apache.hadoop.hdfs.server.namenode.NameNode.<init>(NameNode.java:451)
	at org.apache.hadoop.hdfs.server.namenode.NameNode.createNameNode(NameNode.java:752)
	at org.apache.hadoop.hdfs.MiniDFSCluster.createNameNode(MiniDFSCluster.java:642)
	at org.apache.hadoop.hdfs.MiniDFSCluster.createFederatedNameNode(MiniDFSCluster.java:650)
	at org.apache.hadoop.hdfs.MiniDFSCluster.createFederationNamenodes(MiniDFSCluster.java:611)
	at org.apache.hadoop.hdfs.MiniDFSCluster.initMiniDFSCluster(MiniDFSCluster.java:557)
	at org.apache.hadoop.hdfs.MiniDFSCluster.<init>(MiniDFSCluster.java:262)
	at org.apache.hadoop.hdfs.MiniDFSCluster.<init>(MiniDFSCluster.java:86)
	at org.apache.hadoop.hdfs.MiniDFSCluster$Builder.build(MiniDFSCluster.java:248)
	at org.apache.hadoop.hdfs.TestDecommission.startCluster(TestDecommission.java:281)
	at org.apache.hadoop.hdfs.TestDecommission.testClusterStats(TestDecommission.java:460)
	at org.apache.hadoop.hdfs.TestDecommission.__CLR3_0_2a3t3xdznt(TestDecommission.java:453)
	at org.apache.hadoop.hdfs.TestDecommission.testClusterStatsFederation(TestDecommission.java:452)
	at sun.reflect.NativeMethodAccessorImpl.invoke0(Native Method)
	at sun.reflect.NativeMethodAccessorImpl.invoke(NativeMethodAccessorImpl.java:39)
	at sun.reflect.DelegatingMethodAccessorImpl.invoke(DelegatingMethodAccessorImpl.java:25)
	at java.lang.reflect.Method.invoke(Method.java:597)
	at org.junit.runners.model.FrameworkMethod$1.runReflectiveCall(FrameworkMethod.java:44)
	at org.junit.internal.runners.model.ReflectiveCallable.run(ReflectiveCallable.java:15)
	at org.junit.runners.model.FrameworkMethod.invokeExplosively(FrameworkMethod.java:41)
	at org.junit.internal.runners.statements.InvokeMethod.evaluate(InvokeMethod.java:20)
	at org.junit.internal.runners.statements.RunBefores.evaluate(RunBefores.java:28)
	at org.junit.internal.runners.statements.RunAfters.evaluate(RunAfters.java:31)
	at org.junit.runners.BlockJUnit4ClassRunner.runNotIgnored(BlockJUnit4ClassRunner.java:79)
	at org.junit.runners.BlockJUnit4ClassRunner.runChild(BlockJUnit4ClassRunner.java:71)
	at org.junit.runners.BlockJUnit4ClassRunner.runChild(BlockJUnit4ClassRunner.java:49)
	at org.junit.runners.ParentRunner$3.run(ParentRunner.java:193)
	at org.junit.runners.ParentRunner$1.schedule(ParentRunner.java:52)
	at org.junit.runners.ParentRunner.runChildren(ParentRunner.java:191)
	at org.junit.runners.ParentRunner.access$000(ParentRunner.java:42)
	at org.junit.runners.ParentRunner$2.evaluate(ParentRunner.java:184)
	at org.junit.runners.ParentRunner.run(ParentRunner.java:236)
	at org.apache.maven.surefire.junit4.JUnit4TestSet.execute(JUnit4TestSet.java:53)
	at org.apache.maven.surefire.junit4.JUnit4Provider.executeTestSet(JUnit4Provider.java:123)
	at org.apache.maven.surefire.junit4.JUnit4Provider.invoke(JUnit4Provider.java:104)
	at sun.reflect.NativeMethodAccessorImpl.invoke0(Native Method)
	at sun.reflect.NativeMethodAccessorImpl.invoke(NativeMethodAccessorImpl.java:39)
	at sun.reflect.DelegatingMethodAccessorImpl.invoke(DelegatingMethodAccessorImpl.java:25)
	at java.lang.reflect.Method.invoke(Method.java:597)
	at org.apache.maven.surefire.util.ReflectionUtils.invokeMethodWithArray(ReflectionUtils.java:164)
	at org.apache.maven.surefire.booter.ProviderFactory$ProviderProxy.invoke(ProviderFactory.java:110)
	at org.apache.maven.surefire.booter.SurefireStarter.invokeProvider(SurefireStarter.java:175)
	at org.apache.maven.surefire.booter.SurefireStarter.runSuitesInProcessWhenForked(SurefireStarter.java:81)
	at org.apache.maven.surefire.booter.ForkedBooter.main(ForkedBooter.java:68)


REGRESSION:  org.apache.hadoop.hdfs.TestDecommission.testHostsFile

Error Message:
Cannot lock storage /home/jenkins/jenkins-slave/workspace/Hadoop-Hdfs-0.23-Build/trunk/hadoop-hdfs-project/hadoop-hdfs/target/test/data/dfs/name1. The directory is already locked.

Stack Trace:
java.io.IOException: Cannot lock storage /home/jenkins/jenkins-slave/workspace/Hadoop-Hdfs-0.23-Build/trunk/hadoop-hdfs-project/hadoop-hdfs/target/test/data/dfs/name1. The directory is already locked.
	at org.apache.hadoop.hdfs.server.common.Storage$StorageDirectory.lock(Storage.java:586)
	at org.apache.hadoop.hdfs.server.common.Storage$StorageDirectory.analyzeStorage(Storage.java:435)
	at org.apache.hadoop.hdfs.server.namenode.FSImage.recoverStorageDirs(FSImage.java:294)
	at org.apache.hadoop.hdfs.server.namenode.FSImage.recoverTransitionRead(FSImage.java:210)
	at org.apache.hadoop.hdfs.server.namenode.FSDirectory.loadFSImage(FSDirectory.java:175)
	at org.apache.hadoop.hdfs.server.namenode.FSNamesystem.initialize(FSNamesystem.java:331)
	at org.apache.hadoop.hdfs.server.namenode.FSNamesystem.<init>(FSNamesystem.java:303)
	at org.apache.hadoop.hdfs.server.namenode.NameNode.loadNamesystem(NameNode.java:299)
	at org.apache.hadoop.hdfs.server.namenode.NameNode.initialize(NameNode.java:333)
	at org.apache.hadoop.hdfs.server.namenode.NameNode.<init>(NameNode.java:459)
	at org.apache.hadoop.hdfs.server.namenode.NameNode.<init>(NameNode.java:451)
	at org.apache.hadoop.hdfs.server.namenode.NameNode.createNameNode(NameNode.java:752)
	at org.apache.hadoop.hdfs.MiniDFSCluster.createNameNode(MiniDFSCluster.java:642)
	at org.apache.hadoop.hdfs.MiniDFSCluster.initMiniDFSCluster(MiniDFSCluster.java:546)
	at org.apache.hadoop.hdfs.MiniDFSCluster.<init>(MiniDFSCluster.java:262)
	at org.apache.hadoop.hdfs.MiniDFSCluster.<init>(MiniDFSCluster.java:86)
	at org.apache.hadoop.hdfs.MiniDFSCluster$Builder.build(MiniDFSCluster.java:248)
	at org.apache.hadoop.hdfs.TestDecommission.testHostsFile(TestDecommission.java:509)
	at org.apache.hadoop.hdfs.TestDecommission.__CLR3_0_2moi8yszoe(TestDecommission.java:491)
	at org.apache.hadoop.hdfs.TestDecommission.testHostsFile(TestDecommission.java:489)
	at sun.reflect.NativeMethodAccessorImpl.invoke0(Native Method)
	at sun.reflect.NativeMethodAccessorImpl.invoke(NativeMethodAccessorImpl.java:39)
	at sun.reflect.DelegatingMethodAccessorImpl.invoke(DelegatingMethodAccessorImpl.java:25)
	at java.lang.reflect.Method.invoke(Method.java:597)
	at org.junit.runners.model.FrameworkMethod$1.runReflectiveCall(FrameworkMethod.java:44)
	at org.junit.internal.runners.model.ReflectiveCallable.run(ReflectiveCallable.java:15)
	at org.junit.runners.model.FrameworkMethod.invokeExplosively(FrameworkMethod.java:41)
	at org.junit.internal.runners.statements.InvokeMethod.evaluate(InvokeMethod.java:20)
	at org.junit.internal.runners.statements.RunBefores.evaluate(RunBefores.java:28)
	at org.junit.internal.runners.statements.RunAfters.evaluate(RunAfters.java:31)
	at org.junit.runners.BlockJUnit4ClassRunner.runNotIgnored(BlockJUnit4ClassRunner.java:79)
	at org.junit.runners.BlockJUnit4ClassRunner.runChild(BlockJUnit4ClassRunner.java:71)
	at org.junit.runners.BlockJUnit4ClassRunner.runChild(BlockJUnit4ClassRunner.java:49)
	at org.junit.runners.ParentRunner$3.run(ParentRunner.java:193)
	at org.junit.runners.ParentRunner$1.schedule(ParentRunner.java:52)
	at org.junit.runners.ParentRunner.runChildren(ParentRunner.java:191)
	at org.junit.runners.ParentRunner.access$000(ParentRunner.java:42)
	at org.junit.runners.ParentRunner$2.evaluate(ParentRunner.java:184)
	at org.junit.runners.ParentRunner.run(ParentRunner.java:236)
	at org.apache.maven.surefire.junit4.JUnit4TestSet.execute(JUnit4TestSet.java:53)
	at org.apache.maven.surefire.junit4.JUnit4Provider.executeTestSet(JUnit4Provider.java:123)
	at org.apache.maven.surefire.junit4.JUnit4Provider.invoke(JUnit4Provider.java:104)
	at sun.reflect.NativeMethodAccessorImpl.invoke0(Native Method)
	at sun.reflect.NativeMethodAccessorImpl.invoke(NativeMethodAccessorImpl.java:39)
	at sun.reflect.DelegatingMethodAccessorImpl.invoke(DelegatingMethodAccessorImpl.java:25)
	at java.lang.reflect.Method.invoke(Method.java:597)
	at org.apache.maven.surefire.util.ReflectionUtils.invokeMethodWithArray(ReflectionUtils.java:164)
	at org.apache.maven.surefire.booter.ProviderFactory$ProviderProxy.invoke(ProviderFactory.java:110)
	at org.apache.maven.surefire.booter.SurefireStarter.invokeProvider(SurefireStarter.java:175)
	at org.apache.maven.surefire.booter.SurefireStarter.runSuitesInProcessWhenForked(SurefireStarter.java:81)
	at org.apache.maven.surefire.booter.ForkedBooter.main(ForkedBooter.java:68)


REGRESSION:  org.apache.hadoop.hdfs.TestDecommission.testHostsFileFederation

Error Message:
Cannot lock storage /home/jenkins/jenkins-slave/workspace/Hadoop-Hdfs-0.23-Build/trunk/hadoop-hdfs-project/hadoop-hdfs/target/test/data/dfs/name1. The directory is already locked.

Stack Trace:
java.io.IOException: Cannot lock storage /home/jenkins/jenkins-slave/workspace/Hadoop-Hdfs-0.23-Build/trunk/hadoop-hdfs-project/hadoop-hdfs/target/test/data/dfs/name1. The directory is already locked.
	at org.apache.hadoop.hdfs.server.common.Storage$StorageDirectory.lock(Storage.java:586)
	at org.apache.hadoop.hdfs.server.common.Storage$StorageDirectory.analyzeStorage(Storage.java:435)
	at org.apache.hadoop.hdfs.server.namenode.FSImage.recoverStorageDirs(FSImage.java:294)
	at org.apache.hadoop.hdfs.server.namenode.FSImage.recoverTransitionRead(FSImage.java:210)
	at org.apache.hadoop.hdfs.server.namenode.FSDirectory.loadFSImage(FSDirectory.java:175)
	at org.apache.hadoop.hdfs.server.namenode.FSNamesystem.initialize(FSNamesystem.java:331)
	at org.apache.hadoop.hdfs.server.namenode.FSNamesystem.<init>(FSNamesystem.java:303)
	at org.apache.hadoop.hdfs.server.namenode.NameNode.loadNamesystem(NameNode.java:299)
	at org.apache.hadoop.hdfs.server.namenode.NameNode.initialize(NameNode.java:333)
	at org.apache.hadoop.hdfs.server.namenode.NameNode.<init>(NameNode.java:459)
	at org.apache.hadoop.hdfs.server.namenode.NameNode.<init>(NameNode.java:451)
	at org.apache.hadoop.hdfs.server.namenode.NameNode.createNameNode(NameNode.java:752)
	at org.apache.hadoop.hdfs.MiniDFSCluster.createNameNode(MiniDFSCluster.java:642)
	at org.apache.hadoop.hdfs.MiniDFSCluster.createFederatedNameNode(MiniDFSCluster.java:650)
	at org.apache.hadoop.hdfs.MiniDFSCluster.createFederationNamenodes(MiniDFSCluster.java:611)
	at org.apache.hadoop.hdfs.MiniDFSCluster.initMiniDFSCluster(MiniDFSCluster.java:557)
	at org.apache.hadoop.hdfs.MiniDFSCluster.<init>(MiniDFSCluster.java:262)
	at org.apache.hadoop.hdfs.MiniDFSCluster.<init>(MiniDFSCluster.java:86)
	at org.apache.hadoop.hdfs.MiniDFSCluster$Builder.build(MiniDFSCluster.java:248)
	at org.apache.hadoop.hdfs.TestDecommission.testHostsFile(TestDecommission.java:509)
	at org.apache.hadoop.hdfs.TestDecommission.__CLR3_0_28i3l7lzog(TestDecommission.java:502)
	at org.apache.hadoop.hdfs.TestDecommission.testHostsFileFederation(TestDecommission.java:500)
	at sun.reflect.NativeMethodAccessorImpl.invoke0(Native Method)
	at sun.reflect.NativeMethodAccessorImpl.invoke(NativeMethodAccessorImpl.java:39)
	at sun.reflect.DelegatingMethodAccessorImpl.invoke(DelegatingMethodAccessorImpl.java:25)
	at java.lang.reflect.Method.invoke(Method.java:597)
	at org.junit.runners.model.FrameworkMethod$1.runReflectiveCall(FrameworkMethod.java:44)
	at org.junit.internal.runners.model.ReflectiveCallable.run(ReflectiveCallable.java:15)
	at org.junit.runners.model.FrameworkMethod.invokeExplosively(FrameworkMethod.java:41)
	at org.junit.internal.runners.statements.InvokeMethod.evaluate(InvokeMethod.java:20)
	at org.junit.internal.runners.statements.RunBefores.evaluate(RunBefores.java:28)
	at org.junit.internal.runners.statements.RunAfters.evaluate(RunAfters.java:31)
	at org.junit.runners.BlockJUnit4ClassRunner.runNotIgnored(BlockJUnit4ClassRunner.java:79)
	at org.junit.runners.BlockJUnit4ClassRunner.runChild(BlockJUnit4ClassRunner.java:71)
	at org.junit.runners.BlockJUnit4ClassRunner.runChild(BlockJUnit4ClassRunner.java:49)
	at org.junit.runners.ParentRunner$3.run(ParentRunner.java:193)
	at org.junit.runners.ParentRunner$1.schedule(ParentRunner.java:52)
	at org.junit.runners.ParentRunner.runChildren(ParentRunner.java:191)
	at org.junit.runners.ParentRunner.access$000(ParentRunner.java:42)
	at org.junit.runners.ParentRunner$2.evaluate(ParentRunner.java:184)
	at org.junit.runners.ParentRunner.run(ParentRunner.java:236)
	at org.apache.maven.surefire.junit4.JUnit4TestSet.execute(JUnit4TestSet.java:53)
	at org.apache.maven.surefire.junit4.JUnit4Provider.executeTestSet(JUnit4Provider.java:123)
	at org.apache.maven.surefire.junit4.JUnit4Provider.invoke(JUnit4Provider.java:104)
	at sun.reflect.NativeMethodAccessorImpl.invoke0(Native Method)
	at sun.reflect.NativeMethodAccessorImpl.invoke(NativeMethodAccessorImpl.java:39)
	at sun.reflect.DelegatingMethodAccessorImpl.invoke(DelegatingMethodAccessorImpl.java:25)
	at java.lang.reflect.Method.invoke(Method.java:597)
	at org.apache.maven.surefire.util.ReflectionUtils.invokeMethodWithArray(ReflectionUtils.java:164)
	at org.apache.maven.surefire.booter.ProviderFactory$ProviderProxy.invoke(ProviderFactory.java:110)
	at org.apache.maven.surefire.booter.SurefireStarter.invokeProvider(SurefireStarter.java:175)
	at org.apache.maven.surefire.booter.SurefireStarter.runSuitesInProcessWhenForked(SurefireStarter.java:81)
	at org.apache.maven.surefire.booter.ForkedBooter.main(ForkedBooter.java:68)


FAILED:  org.apache.hadoop.hdfs.TestListFilesInFileContext.org.apache.hadoop.hdfs.TestListFilesInFileContext

Error Message:
Cannot lock storage /home/jenkins/jenkins-slave/workspace/Hadoop-Hdfs-0.23-Build/trunk/hadoop-hdfs-project/hadoop-hdfs/target/test/data/dfs/name1. The directory is already locked.

Stack Trace:
java.io.IOException: Cannot lock storage /home/jenkins/jenkins-slave/workspace/Hadoop-Hdfs-0.23-Build/trunk/hadoop-hdfs-project/hadoop-hdfs/target/test/data/dfs/name1. The directory is already locked.
	at org.apache.hadoop.hdfs.server.common.Storage$StorageDirectory.lock(Storage.java:586)
	at org.apache.hadoop.hdfs.server.common.Storage$StorageDirectory.analyzeStorage(Storage.java:435)
	at org.apache.hadoop.hdfs.server.namenode.FSImage.recoverStorageDirs(FSImage.java:294)
	at org.apache.hadoop.hdfs.server.namenode.FSImage.recoverTransitionRead(FSImage.java:210)
	at org.apache.hadoop.hdfs.server.namenode.FSDirectory.loadFSImage(FSDirectory.java:175)
	at org.apache.hadoop.hdfs.server.namenode.FSNamesystem.initialize(FSNamesystem.java:331)
	at org.apache.hadoop.hdfs.server.namenode.FSNamesystem.<init>(FSNamesystem.java:303)
	at org.apache.hadoop.hdfs.server.namenode.NameNode.loadNamesystem(NameNode.java:299)
	at org.apache.hadoop.hdfs.server.namenode.NameNode.initialize(NameNode.java:333)
	at org.apache.hadoop.hdfs.server.namenode.NameNode.<init>(NameNode.java:459)
	at org.apache.hadoop.hdfs.server.namenode.NameNode.<init>(NameNode.java:451)
	at org.apache.hadoop.hdfs.server.namenode.NameNode.createNameNode(NameNode.java:752)
	at org.apache.hadoop.hdfs.MiniDFSCluster.createNameNode(MiniDFSCluster.java:642)
	at org.apache.hadoop.hdfs.MiniDFSCluster.initMiniDFSCluster(MiniDFSCluster.java:546)
	at org.apache.hadoop.hdfs.MiniDFSCluster.<init>(MiniDFSCluster.java:262)
	at org.apache.hadoop.hdfs.MiniDFSCluster.<init>(MiniDFSCluster.java:86)
	at org.apache.hadoop.hdfs.MiniDFSCluster$Builder.build(MiniDFSCluster.java:248)
	at org.apache.hadoop.hdfs.TestListFilesInFileContext.__CLR3_0_28eh63612o5(TestListFilesInFileContext.java:66)
	at org.apache.hadoop.hdfs.TestListFilesInFileContext.testSetUp(TestListFilesInFileContext.java:65)
	at sun.reflect.NativeMethodAccessorImpl.invoke0(Native Method)
	at sun.reflect.NativeMethodAccessorImpl.invoke(NativeMethodAccessorImpl.java:39)
	at sun.reflect.DelegatingMethodAccessorImpl.invoke(DelegatingMethodAccessorImpl.java:25)
	at java.lang.reflect.Method.invoke(Method.java:597)
	at org.junit.runners.model.FrameworkMethod$1.runReflectiveCall(FrameworkMethod.java:44)
	at org.junit.internal.runners.model.ReflectiveCallable.run(ReflectiveCallable.java:15)
	at org.junit.runners.model.FrameworkMethod.invokeExplosively(FrameworkMethod.java:41)
	at org.junit.internal.runners.statements.RunBefores.evaluate(RunBefores.java:27)
	at org.junit.internal.runners.statements.RunAfters.evaluate(RunAfters.java:31)
	at org.junit.runners.ParentRunner.run(ParentRunner.java:236)
	at org.apache.maven.surefire.junit4.JUnit4TestSet.execute(JUnit4TestSet.java:53)
	at org.apache.maven.surefire.junit4.JUnit4Provider.executeTestSet(JUnit4Provider.java:123)
	at org.apache.maven.surefire.junit4.JUnit4Provider.invoke(JUnit4Provider.java:104)
	at sun.reflect.NativeMethodAccessorImpl.invoke0(Native Method)
	at sun.reflect.NativeMethodAccessorImpl.invoke(NativeMethodAccessorImpl.java:39)
	at sun.reflect.DelegatingMethodAccessorImpl.invoke(DelegatingMethodAccessorImpl.java:25)
	at java.lang.reflect.Method.invoke(Method.java:597)
	at org.apache.maven.surefire.util.ReflectionUtils.invokeMethodWithArray(ReflectionUtils.java:164)
	at org.apache.maven.surefire.booter.ProviderFactory$ProviderProxy.invoke(ProviderFactory.java:110)
	at org.apache.maven.surefire.booter.SurefireStarter.invokeProvider(SurefireStarter.java:175)
	at org.apache.maven.surefire.booter.SurefireStarter.runSuitesInProcessWhenForked(SurefireStarter.java:81)
	at org.apache.maven.surefire.booter.ForkedBooter.main(ForkedBooter.java:68)


FAILED:  org.apache.hadoop.hdfs.TestListFilesInFileContext.org.apache.hadoop.hdfs.TestListFilesInFileContext

Error Message:
null

Stack Trace:
java.lang.NullPointerException
	at org.apache.hadoop.hdfs.TestListFilesInFileContext.__CLR3_0_2hvz73l12og(TestListFilesInFileContext.java:85)
	at org.apache.hadoop.hdfs.TestListFilesInFileContext.testShutdown(TestListFilesInFileContext.java:84)
	at sun.reflect.NativeMethodAccessorImpl.invoke0(Native Method)
	at sun.reflect.NativeMethodAccessorImpl.invoke(NativeMethodAccessorImpl.java:39)
	at sun.reflect.DelegatingMethodAccessorImpl.invoke(DelegatingMethodAccessorImpl.java:25)
	at java.lang.reflect.Method.invoke(Method.java:597)
	at org.junit.runners.model.FrameworkMethod$1.runReflectiveCall(FrameworkMethod.java:44)
	at org.junit.internal.runners.model.ReflectiveCallable.run(ReflectiveCallable.java:15)
	at org.junit.runners.model.FrameworkMethod.invokeExplosively(FrameworkMethod.java:41)
	at org.junit.internal.runners.statements.RunAfters.evaluate(RunAfters.java:37)
	at org.junit.runners.ParentRunner.run(ParentRunner.java:236)
	at org.apache.maven.surefire.junit4.JUnit4TestSet.execute(JUnit4TestSet.java:53)
	at org.apache.maven.surefire.junit4.JUnit4Provider.executeTestSet(JUnit4Provider.java:123)
	at org.apache.maven.surefire.junit4.JUnit4Provider.invoke(JUnit4Provider.java:104)
	at sun.reflect.NativeMethodAccessorImpl.invoke0(Native Method)
	at sun.reflect.NativeMethodAccessorImpl.invoke(NativeMethodAccessorImpl.java:39)
	at sun.reflect.DelegatingMethodAccessorImpl.invoke(DelegatingMethodAccessorImpl.java:25)
	at java.lang.reflect.Method.invoke(Method.java:597)
	at org.apache.maven.surefire.util.ReflectionUtils.invokeMethodWithArray(ReflectionUtils.java:164)
	at org.apache.maven.surefire.booter.ProviderFactory$ProviderProxy.invoke(ProviderFactory.java:110)
	at org.apache.maven.surefire.booter.SurefireStarter.invokeProvider(SurefireStarter.java:175)
	at org.apache.maven.surefire.booter.SurefireStarter.runSuitesInProcessWhenForked(SurefireStarter.java:81)
	at org.apache.maven.surefire.booter.ForkedBooter.main(ForkedBooter.java:68)


REGRESSION:  org.apache.hadoop.hdfs.server.blockmanagement.TestBlocksWithNotEnoughRacks.testCorruptBlockRereplicatedAcrossRacks

Error Message:
Timed out waiting for corrupt replicas. Waiting for 1, but only found 0

Stack Trace:
java.util.concurrent.TimeoutException: Timed out waiting for corrupt replicas. Waiting for 1, but only found 0
	at org.apache.hadoop.hdfs.DFSTestUtil.waitCorruptReplicas(DFSTestUtil.java:329)
	at org.apache.hadoop.hdfs.server.blockmanagement.TestBlocksWithNotEnoughRacks.__CLR3_0_24fu2jg16a3(TestBlocksWithNotEnoughRacks.java:219)
	at org.apache.hadoop.hdfs.server.blockmanagement.TestBlocksWithNotEnoughRacks.testCorruptBlockRereplicatedAcrossRacks(TestBlocksWithNotEnoughRacks.java:189)
	at sun.reflect.NativeMethodAccessorImpl.invoke0(Native Method)
	at sun.reflect.NativeMethodAccessorImpl.invoke(NativeMethodAccessorImpl.java:39)
	at sun.reflect.DelegatingMethodAccessorImpl.invoke(DelegatingMethodAccessorImpl.java:25)
	at java.lang.reflect.Method.invoke(Method.java:597)
	at org.junit.runners.model.FrameworkMethod$1.runReflectiveCall(FrameworkMethod.java:44)
	at org.junit.internal.runners.model.ReflectiveCallable.run(ReflectiveCallable.java:15)
	at org.junit.runners.model.FrameworkMethod.invokeExplosively(FrameworkMethod.java:41)
	at org.junit.internal.runners.statements.InvokeMethod.evaluate(InvokeMethod.java:20)
	at org.junit.runners.BlockJUnit4ClassRunner.runNotIgnored(BlockJUnit4ClassRunner.java:79)
	at org.junit.runners.BlockJUnit4ClassRunner.runChild(BlockJUnit4ClassRunner.java:71)
	at org.junit.runners.BlockJUnit4ClassRunner.runChild(BlockJUnit4ClassRunner.java:49)
	at org.junit.runners.ParentRunner$3.run(ParentRunner.java:193)
	at org.junit.runners.ParentRunner$1.schedule(ParentRunner.java:52)
	at org.junit.runners.ParentRunner.runChildren(ParentRunner.java:191)
	at org.junit.runners.ParentRunner.access$000(ParentRunner.java:42)
	at org.junit.runners.ParentRunner$2.evaluate(ParentRunner.java:184)
	at org.junit.runners.ParentRunner.run(ParentRunner.java:236)
	at org.apache.maven.surefire.junit4.JUnit4TestSet.execute(JUnit4TestSet.java:53)
	at org.apache.maven.surefire.junit4.JUnit4Provider.executeTestSet(JUnit4Provider.java:123)
	at org.apache.maven.surefire.junit4.JUnit4Provider.invoke(JUnit4Provider.java:104)
	at sun.reflect.NativeMethodAccessorImpl.invoke0(Native Method)
	at sun.reflect.NativeMethodAccessorImpl.invoke(NativeMethodAccessorImpl.java:39)
	at sun.reflect.DelegatingMethodAccessorImpl.invoke(DelegatingMethodAccessorImpl.java:25)
	at java.lang.reflect.Method.invoke(Method.java:597)
	at org.apache.maven.surefire.util.ReflectionUtils.invokeMethodWithArray(ReflectionUtils.java:164)
	at org.apache.maven.surefire.booter.ProviderFactory$ProviderProxy.invoke(ProviderFactory.java:110)
	at org.apache.maven.surefire.booter.SurefireStarter.invokeProvider(SurefireStarter.java:175)
	at org.apache.maven.surefire.booter.SurefireStarter.runSuitesInProcessWhenForked(SurefireStarter.java:81)
	at org.apache.maven.surefire.booter.ForkedBooter.main(ForkedBooter.java:68)



Jenkins build is back to normal : Hadoop-Hdfs-0.23-Build #266

Posted by Apache Jenkins Server <je...@builds.apache.org>.
See <https://builds.apache.org/job/Hadoop-Hdfs-0.23-Build/266/>


Build failed in Jenkins: Hadoop-Hdfs-0.23-Build #265

Posted by Apache Jenkins Server <je...@builds.apache.org>.
See <https://builds.apache.org/job/Hadoop-Hdfs-0.23-Build/265/>

------------------------------------------
[...truncated 13702 lines...]
  [javadoc] Loading source files for package org.apache.hadoop.fs...
  [javadoc] Loading source files for package org.apache.hadoop.hdfs...
  [javadoc] Loading source files for package org.apache.hadoop.hdfs.protocol...
  [javadoc] Loading source files for package org.apache.hadoop.hdfs.protocol.datatransfer...
  [javadoc] Loading source files for package org.apache.hadoop.hdfs.security.token.block...
  [javadoc] Loading source files for package org.apache.hadoop.hdfs.security.token.delegation...
  [javadoc] Loading source files for package org.apache.hadoop.hdfs.server.balancer...
  [javadoc] Loading source files for package org.apache.hadoop.hdfs.server.blockmanagement...
  [javadoc] Loading source files for package org.apache.hadoop.hdfs.server.common...
  [javadoc] Loading source files for package org.apache.hadoop.hdfs.server.datanode...
  [javadoc] Loading source files for package org.apache.hadoop.hdfs.server.datanode.metrics...
  [javadoc] Loading source files for package org.apache.hadoop.hdfs.server.datanode.web.resources...
  [javadoc] Loading source files for package org.apache.hadoop.hdfs.server.namenode...
  [javadoc] Loading source files for package org.apache.hadoop.hdfs.server.namenode.metrics...
  [javadoc] Loading source files for package org.apache.hadoop.hdfs.server.namenode.web.resources...
  [javadoc] Loading source files for package org.apache.hadoop.hdfs.server.protocol...
  [javadoc] Loading source files for package org.apache.hadoop.hdfs.tools...
  [javadoc] Loading source files for package org.apache.hadoop.hdfs.tools.offlineEditsViewer...
  [javadoc] Loading source files for package org.apache.hadoop.hdfs.tools.offlineImageViewer...
  [javadoc] Loading source files for package org.apache.hadoop.hdfs.util...
  [javadoc] Loading source files for package org.apache.hadoop.hdfs.web...
  [javadoc] Loading source files for package org.apache.hadoop.hdfs.web.resources...
  [javadoc] 2 errors
     [xslt] Processing <https://builds.apache.org/job/Hadoop-Hdfs-0.23-Build/ws/trunk/hadoop-hdfs-project/hadoop-hdfs/target/findbugsXml.xml> to <https://builds.apache.org/job/Hadoop-Hdfs-0.23-Build/ws/trunk/hadoop-hdfs-project/hadoop-hdfs/target/site/findbugs.html>
     [xslt] Loading stylesheet /home/jenkins/tools/findbugs/latest/src/xsl/default.xsl
[INFO] Executed tasks
[INFO] 
[INFO] --- maven-antrun-plugin:1.6:run (pre-dist) @ hadoop-hdfs ---
[INFO] Executing tasks

main:
[INFO] Executed tasks
[INFO] 
[INFO] --- maven-antrun-plugin:1.6:run (xprepare-package-hadoop-daemon) @ hadoop-hdfs ---
[INFO] Executing tasks

main:
      [get] Destination already exists (skipping): <https://builds.apache.org/job/Hadoop-Hdfs-0.23-Build/ws/trunk/hadoop-hdfs-project/hadoop-hdfs/downloads/commons-daemon-1.0.3-bin-linux-i686.tar.gz>
   [delete] Deleting directory <https://builds.apache.org/job/Hadoop-Hdfs-0.23-Build/ws/trunk/hadoop-hdfs-project/hadoop-hdfs/target/commons-daemon.staging>
    [mkdir] Created dir: <https://builds.apache.org/job/Hadoop-Hdfs-0.23-Build/ws/trunk/hadoop-hdfs-project/hadoop-hdfs/target/commons-daemon.staging>
    [untar] Expanding: <https://builds.apache.org/job/Hadoop-Hdfs-0.23-Build/ws/trunk/hadoop-hdfs-project/hadoop-hdfs/downloads/commons-daemon-1.0.3-bin-linux-i686.tar.gz> into <https://builds.apache.org/job/Hadoop-Hdfs-0.23-Build/ws/trunk/hadoop-hdfs-project/hadoop-hdfs/target/commons-daemon.staging>
[INFO] Executed tasks
[INFO] 
[INFO] >>> maven-javadoc-plugin:2.8.1:javadoc (default) @ hadoop-hdfs >>>
[INFO] 
[INFO] --- maven-antrun-plugin:1.6:run (create-testdirs) @ hadoop-hdfs ---
[INFO] Executing tasks

main:
[INFO] Executed tasks
[INFO] 
[INFO] --- jspc-maven-plugin:2.0-alpha-3:compile (hdfs) @ hadoop-hdfs ---
[WARNING] Compiled JSPs will not be added to the project and web.xml will not be modified, either because includeInProject is set to false or because the project's packaging is not 'war'.
[INFO] Compiling 8 JSP source files to <https://builds.apache.org/job/Hadoop-Hdfs-0.23-Build/ws/trunk/hadoop-hdfs-project/hadoop-hdfs/target/generated-src/main/jsp>
WARN: The method class org.apache.commons.logging.impl.SLF4JLogFactory#release() was invoked.
WARN: Please see http://www.slf4j.org/codes.html for an explanation.
[INFO] Compiled completed in 0:00:00.062
[INFO] 
[INFO] --- jspc-maven-plugin:2.0-alpha-3:compile (secondary) @ hadoop-hdfs ---
[WARNING] Compiled JSPs will not be added to the project and web.xml will not be modified, either because includeInProject is set to false or because the project's packaging is not 'war'.
[INFO] Compiling 1 JSP source file to <https://builds.apache.org/job/Hadoop-Hdfs-0.23-Build/ws/trunk/hadoop-hdfs-project/hadoop-hdfs/target/generated-src/main/jsp>
WARN: The method class org.apache.commons.logging.impl.SLF4JLogFactory#release() was invoked.
WARN: Please see http://www.slf4j.org/codes.html for an explanation.
[INFO] Compiled completed in 0:00:00.051
[INFO] 
[INFO] --- jspc-maven-plugin:2.0-alpha-3:compile (datanode) @ hadoop-hdfs ---
[WARNING] Compiled JSPs will not be added to the project and web.xml will not be modified, either because includeInProject is set to false or because the project's packaging is not 'war'.
[INFO] Compiling 3 JSP source files to <https://builds.apache.org/job/Hadoop-Hdfs-0.23-Build/ws/trunk/hadoop-hdfs-project/hadoop-hdfs/target/generated-src/main/jsp>
WARN: The method class org.apache.commons.logging.impl.SLF4JLogFactory#release() was invoked.
WARN: Please see http://www.slf4j.org/codes.html for an explanation.
[INFO] Compiled completed in 0:00:00.072
[INFO] 
[INFO] --- build-helper-maven-plugin:1.5:add-source (add-source) @ hadoop-hdfs ---
[INFO] Source directory: <https://builds.apache.org/job/Hadoop-Hdfs-0.23-Build/ws/trunk/hadoop-hdfs-project/hadoop-hdfs/target/generated-sources/java> added.
[INFO] Source directory: <https://builds.apache.org/job/Hadoop-Hdfs-0.23-Build/ws/trunk/hadoop-hdfs-project/hadoop-hdfs/target/generated-src/main/jsp> added.
[INFO] 
[INFO] --- maven-antrun-plugin:1.6:run (compile-proto) @ hadoop-hdfs ---
[INFO] Executing tasks

main:
[INFO] Executed tasks
[INFO] 
[INFO] <<< maven-javadoc-plugin:2.8.1:javadoc (default) @ hadoop-hdfs <<<
[INFO] 
[INFO] --- maven-javadoc-plugin:2.8.1:javadoc (default) @ hadoop-hdfs ---
[INFO] 
ExcludePrivateAnnotationsStandardDoclet
[INFO] 
[INFO] --- maven-assembly-plugin:2.3:single (dist) @ hadoop-hdfs ---
[WARNING] The following patterns were never triggered in this artifact exclusion filter:
o  'org.apache.ant:*:jar'
o  'jdiff:jdiff:jar'

[INFO] Copying files to <https://builds.apache.org/job/Hadoop-Hdfs-0.23-Build/ws/trunk/hadoop-hdfs-project/hadoop-hdfs/target/hadoop-hdfs-0.23.3-SNAPSHOT>
[INFO] 
[INFO] --- maven-jar-plugin:2.3.1:jar (default-jar) @ hadoop-hdfs ---
[INFO] 
[INFO] --- maven-source-plugin:2.1.2:jar-no-fork (hadoop-java-sources) @ hadoop-hdfs ---
[INFO] org already added, skipping
[INFO] org/apache already added, skipping
[INFO] org/apache/hadoop already added, skipping
[INFO] org/apache/hadoop/hdfs already added, skipping
[INFO] org/apache/hadoop/hdfs/protocol already added, skipping
[INFO] org/apache/hadoop/hdfs/protocol/proto already added, skipping
[INFO] org already added, skipping
[INFO] org/apache already added, skipping
[INFO] org/apache/hadoop already added, skipping
[INFO] org/apache/hadoop/hdfs already added, skipping
[INFO] org/apache/hadoop/hdfs/server already added, skipping
[INFO] org/apache/hadoop/hdfs/server/namenode already added, skipping
[INFO] org/apache/hadoop/hdfs/server/datanode already added, skipping
[INFO] Building jar: <https://builds.apache.org/job/Hadoop-Hdfs-0.23-Build/ws/trunk/hadoop-hdfs-project/hadoop-hdfs/target/hadoop-hdfs-0.23.3-SNAPSHOT-sources.jar>
[INFO] org already added, skipping
[INFO] org/apache already added, skipping
[INFO] org/apache/hadoop already added, skipping
[INFO] org/apache/hadoop/hdfs already added, skipping
[INFO] org/apache/hadoop/hdfs/protocol already added, skipping
[INFO] org/apache/hadoop/hdfs/protocol/proto already added, skipping
[INFO] org already added, skipping
[INFO] org/apache already added, skipping
[INFO] org/apache/hadoop already added, skipping
[INFO] org/apache/hadoop/hdfs already added, skipping
[INFO] org/apache/hadoop/hdfs/server already added, skipping
[INFO] org/apache/hadoop/hdfs/server/namenode already added, skipping
[INFO] org/apache/hadoop/hdfs/server/datanode already added, skipping
[WARNING] Artifact org.apache.hadoop:hadoop-hdfs:java-source:sources:0.23.3-SNAPSHOT already attached to project, ignoring duplicate
[INFO] 
[INFO] --- maven-site-plugin:3.0:attach-descriptor (attach-descriptor) @ hadoop-hdfs ---
[INFO] 
[INFO] --- maven-antrun-plugin:1.6:run (tar) @ hadoop-hdfs ---
[INFO] Executing tasks

main:
[INFO] Executed tasks
[INFO] 
[INFO] --- maven-javadoc-plugin:2.8.1:jar (module-javadocs) @ hadoop-hdfs ---
[INFO] 
ExcludePrivateAnnotationsStandardDoclet
[INFO] Building jar: <https://builds.apache.org/job/Hadoop-Hdfs-0.23-Build/ws/trunk/hadoop-hdfs-project/hadoop-hdfs/target/hadoop-hdfs-0.23.3-SNAPSHOT-javadoc.jar>
[WARNING] Artifact org.apache.hadoop:hadoop-hdfs:javadoc:javadoc:0.23.3-SNAPSHOT already attached to project, ignoring duplicate
[INFO] 
[INFO] --- maven-checkstyle-plugin:2.6:checkstyle (default-cli) @ hadoop-hdfs ---
[INFO] 
[INFO] There are 6927 checkstyle errors.
[WARNING] Unable to locate Source XRef to link to - DISABLED
[INFO] 
[INFO] --- findbugs-maven-plugin:2.3.2:findbugs (default-cli) @ hadoop-hdfs ---
[INFO] ****** FindBugsMojo execute *******
[INFO] canGenerate is true
[INFO] ****** FindBugsMojo executeFindbugs *******
[INFO] Temp File is <https://builds.apache.org/job/Hadoop-Hdfs-0.23-Build/ws/trunk/hadoop-hdfs-project/hadoop-hdfs/target/findbugsTemp.xml>
[INFO] Fork Value is true
[INFO] xmlOutput is false
[INFO]                                                                         
[INFO] ------------------------------------------------------------------------
[INFO] Building Apache Hadoop HttpFS 0.23.3-SNAPSHOT
[INFO] ------------------------------------------------------------------------
[INFO] 
[INFO] --- maven-clean-plugin:2.4.1:clean (default-clean) @ hadoop-hdfs-httpfs ---
[INFO] Deleting <https://builds.apache.org/job/Hadoop-Hdfs-0.23-Build/ws/trunk/hadoop-hdfs-project/hadoop-hdfs-httpfs/target>
[INFO] 
[INFO] --- maven-antrun-plugin:1.6:run (create-testdirs) @ hadoop-hdfs-httpfs ---
[INFO] Executing tasks

main:
    [mkdir] Created dir: <https://builds.apache.org/job/Hadoop-Hdfs-0.23-Build/ws/trunk/hadoop-hdfs-project/hadoop-hdfs-httpfs/target/test-dir>
[INFO] Executed tasks
[INFO] 
[INFO] --- maven-resources-plugin:2.2:resources (default-resources) @ hadoop-hdfs-httpfs ---
[INFO] Using default encoding to copy filtered resources.
[INFO] 
[INFO] --- maven-compiler-plugin:2.3.2:compile (default-compile) @ hadoop-hdfs-httpfs ---
[INFO] Compiling 48 source files to <https://builds.apache.org/job/Hadoop-Hdfs-0.23-Build/ws/trunk/hadoop-hdfs-project/hadoop-hdfs-httpfs/target/classes>
[INFO] 
[INFO] --- maven-antrun-plugin:1.6:run (create-web-xmls) @ hadoop-hdfs-httpfs ---
[INFO] Executing tasks

main:
    [mkdir] Created dir: <https://builds.apache.org/job/Hadoop-Hdfs-0.23-Build/ws/trunk/hadoop-hdfs-project/hadoop-hdfs-httpfs/target/test-classes/webapp>
     [copy] Copying 1 file to <https://builds.apache.org/job/Hadoop-Hdfs-0.23-Build/ws/trunk/hadoop-hdfs-project/hadoop-hdfs-httpfs/target/test-classes/webapp>
[INFO] Executed tasks
[INFO] 
[INFO] --- maven-resources-plugin:2.2:testResources (default-testResources) @ hadoop-hdfs-httpfs ---
[INFO] Using default encoding to copy filtered resources.
[INFO] 
[INFO] --- maven-compiler-plugin:2.3.2:testCompile (default-testCompile) @ hadoop-hdfs-httpfs ---
[INFO] Compiling 45 source files to <https://builds.apache.org/job/Hadoop-Hdfs-0.23-Build/ws/trunk/hadoop-hdfs-project/hadoop-hdfs-httpfs/target/test-classes>
[INFO] 
[INFO] --- maven-surefire-plugin:2.10:test (default-test) @ hadoop-hdfs-httpfs ---
[INFO] Tests are skipped.
[INFO] 
[INFO] --- maven-site-plugin:3.0:site (docs) @ hadoop-hdfs-httpfs ---
[WARNING] No project URL defined - decoration links will not be relativized!
[INFO] Rendering site with org.apache.maven.skins:maven-stylus-skin:jar:1.2 skin.
[INFO] 
[INFO] --- maven-war-plugin:2.1:war (default-war) @ hadoop-hdfs-httpfs ---
[INFO] Packaging webapp
[INFO] Assembling webapp [hadoop-hdfs-httpfs] in [<https://builds.apache.org/job/Hadoop-Hdfs-0.23-Build/ws/trunk/hadoop-hdfs-project/hadoop-hdfs-httpfs/target/webhdfs]>
[INFO] Processing war project
[INFO] Copying webapp resources [<https://builds.apache.org/job/Hadoop-Hdfs-0.23-Build/ws/trunk/hadoop-hdfs-project/hadoop-hdfs-httpfs/src/main/webapp]>
[INFO] Webapp assembled in [825 msecs]
[INFO] Building war: <https://builds.apache.org/job/Hadoop-Hdfs-0.23-Build/ws/trunk/hadoop-hdfs-project/hadoop-hdfs-httpfs/target/webhdfs.war>
[INFO] WEB-INF/web.xml already added, skipping
[INFO] 
[INFO] --- maven-source-plugin:2.1.2:jar-no-fork (hadoop-java-sources) @ hadoop-hdfs-httpfs ---
[INFO] Building jar: <https://builds.apache.org/job/Hadoop-Hdfs-0.23-Build/ws/trunk/hadoop-hdfs-project/hadoop-hdfs-httpfs/target/hadoop-hdfs-httpfs-0.23.3-SNAPSHOT-sources.jar>
[INFO] 
[INFO] --- maven-site-plugin:3.0:attach-descriptor (attach-descriptor) @ hadoop-hdfs-httpfs ---
[INFO] 
[INFO] --- maven-assembly-plugin:2.3:single (dist) @ hadoop-hdfs-httpfs ---
[INFO] Copying files to <https://builds.apache.org/job/Hadoop-Hdfs-0.23-Build/ws/trunk/hadoop-hdfs-project/hadoop-hdfs-httpfs/target/hadoop-hdfs-httpfs-0.23.3-SNAPSHOT>
[INFO] 
[INFO] --- maven-antrun-plugin:1.6:run (dist) @ hadoop-hdfs-httpfs ---
[INFO] Executing tasks

main:
    [mkdir] Created dir: <https://builds.apache.org/job/Hadoop-Hdfs-0.23-Build/ws/trunk/hadoop-hdfs-project/hadoop-hdfs-httpfs/downloads>
      [get] Getting: http://archive.apache.org/dist/tomcat/tomcat-6/v6.0.32/bin/apache-tomcat-6.0.32.tar.gz
      [get] To: <https://builds.apache.org/job/Hadoop-Hdfs-0.23-Build/ws/trunk/hadoop-hdfs-project/hadoop-hdfs-httpfs/downloads/tomcat.tar.gz>
      [get] Error getting http://archive.apache.org/dist/tomcat/tomcat-6/v6.0.32/bin/apache-tomcat-6.0.32.tar.gz to <https://builds.apache.org/job/Hadoop-Hdfs-0.23-Build/ws/trunk/hadoop-hdfs-project/hadoop-hdfs-httpfs/downloads/tomcat.tar.gz>
[INFO] ------------------------------------------------------------------------
[INFO] Reactor Summary:
[INFO] 
[INFO] Apache Hadoop HDFS ................................ SUCCESS [25:46.311s]
[INFO] Apache Hadoop HttpFS .............................. FAILURE [55.138s]
[INFO] Apache Hadoop HDFS Project ........................ SKIPPED
[INFO] ------------------------------------------------------------------------
[INFO] BUILD FAILURE
[INFO] ------------------------------------------------------------------------
[INFO] Total time: 26:44.208s
[INFO] Finished at: Wed May 23 12:12:32 UTC 2012
[INFO] Final Memory: 72M/747M
[INFO] ------------------------------------------------------------------------
[ERROR] Failed to execute goal org.apache.maven.plugins:maven-antrun-plugin:1.6:run (dist) on project hadoop-hdfs-httpfs: An Ant BuildException has occured: java.net.ConnectException: Connection timed out -> [Help 1]
[ERROR] 
[ERROR] To see the full stack trace of the errors, re-run Maven with the -e switch.
[ERROR] Re-run Maven using the -X switch to enable full debug logging.
[ERROR] 
[ERROR] For more information about the errors and possible solutions, please read the following articles:
[ERROR] [Help 1] http://cwiki.apache.org/confluence/display/MAVEN/MojoExecutionException
[ERROR] 
[ERROR] After correcting the problems, you can resume the build with the command
[ERROR]   mvn <goals> -rf :hadoop-hdfs-httpfs
+ /home/jenkins/tools/maven/latest/bin/mvn test -Dmaven.test.failure.ignore=true -Pclover -DcloverLicenseLocation=/home/jenkins/tools/clover/latest/lib/clover.license
Build step 'Execute shell' marked build as failure
Archiving artifacts
Recording test results
Publishing Javadoc
Recording fingerprints