You are viewing a plain text version of this content. The canonical link for it is here.
Posted to yarn-dev@hadoop.apache.org by Apache Jenkins Server <je...@builds.apache.org> on 2015/04/24 20:23:15 UTC
Failed: YARN-3444 PreCommit Build #7496
Jira: https://issues.apache.org/jira/browse/YARN-3444
Build: https://builds.apache.org/job/PreCommit-YARN-Build/7496/
###################################################################################
########################## LAST 60 LINES OF THE CONSOLE ###########################
[...truncated 281 lines...]
| +1 | javadoc | 9m 36s | There were no new javadoc warning
| | | | messages.
| +1 | release audit | 0m 23s | The applied patch does not increase
| | | | the total number of release audit
| | | | warnings.
| +1 | site | 2m 55s | Site still builds.
| +1 | checkstyle | 3m 56s | There were no new checkstyle
| | | | issues.
| +1 | install | 1m 32s | mvn install still works.
| +1 | eclipse:eclipse | 0m 32s | The patch built with
| | | | eclipse:eclipse.
| +1 | findbugs | 0m 34s | The patch does not introduce any
| | | | new Findbugs (version 2.0.3)
| | | | warnings.
| +1 | yarn tests | 6m 55s | Tests passed in
| | | | hadoop-yarn-applications-distributeds
| | | | hell.
| | | 51m 52s |
|| Subsystem || Report/Notes ||
============================================================================
| Patch URL | http://issues.apache.org/jira/secure/attachment/12727959/YARN-3444.1.patch |
| Optional Tests | javadoc javac unit findbugs checkstyle site |
| git revision | trunk / cf6c8a1 |
| hadoop-yarn-applications-distributedshell test log | /home/jenkins/jenkins-slave/workspace/PreCommit-YARN-Build/../patchprocess/testrun_hadoop-yarn-applications-distributedshell.txt |
| Test Results | https://builds.apache.org/job/PreCommit-YARN-Build/7496/testReport/ |
============================================================================
============================================================================
Adding comment to JIRA
============================================================================
============================================================================
Comment added.
a47a4923e717fd295eb86b1bb7e260187bdd56e0 logged out
============================================================================
============================================================================
Finished build.
============================================================================
============================================================================
Build step 'Execute shell' marked build as failure
Archiving artifacts
Sending artifact delta relative to PreCommit-YARN-Build #7481
Archived 23 artifacts
Archive block size is 32768
Received 372 blocks and 83842098 bytes
Compression is 12.7%
Took 34 sec
[description-setter] Could not determine description.
Recording test results
Email was triggered for: Failure
Sending email for trigger: Failure
###################################################################################
############################## FAILED TESTS (if any) ##############################
All tests passed
Failed: YARN-3485 PreCommit Build #7499
Posted by Apache Jenkins Server <je...@builds.apache.org>.
Jira: https://issues.apache.org/jira/browse/YARN-3485
Build: https://builds.apache.org/job/PreCommit-YARN-Build/7499/
###################################################################################
########################## LAST 60 LINES OF THE CONSOLE ###########################
[...truncated 268 lines...]
| +1 | release audit | 0m 22s | The applied patch does not increase
| | | | the total number of release audit
| | | | warnings.
| +1 | checkstyle | 5m 25s | There were no new checkstyle
| | | | issues.
| +1 | install | 1m 34s | mvn install still works.
| +1 | eclipse:eclipse | 0m 33s | The patch built with
| | | | eclipse:eclipse.
| +1 | findbugs | 1m 15s | The patch does not introduce any
| | | | new Findbugs (version 2.0.3)
| | | | warnings.
| -1 | yarn tests | 52m 18s | Tests failed in
| | | | hadoop-yarn-server-resourcemanager.
| | | 93m 27s |
Reason | Tests
Failed unit tests | hadoop.yarn.server.resourcemanager.applicationsmanager.TestAMRestart
|| Subsystem || Report/Notes ||
============================================================================
| Patch URL | http://issues.apache.org/jira/secure/attachment/12728115/yarn-3485-1.patch |
| Optional Tests | javadoc javac unit findbugs checkstyle |
| git revision | trunk / 78c6b46 |
| hadoop-yarn-server-resourcemanager test log | /home/jenkins/jenkins-slave/workspace/PreCommit-YARN-Build/../patchprocess/testrun_hadoop-yarn-server-resourcemanager.txt |
| Test Results | https://builds.apache.org/job/PreCommit-YARN-Build/7499/testReport/ |
============================================================================
============================================================================
Adding comment to JIRA
============================================================================
============================================================================
Comment added.
77e2cbee42abe3f615b00354397a661569a6d75c logged out
============================================================================
============================================================================
Finished build.
============================================================================
============================================================================
Build step 'Execute shell' marked build as failure
Archiving artifacts
Sending artifact delta relative to PreCommit-YARN-Build #7481
Archived 21 artifacts
Archive block size is 32768
Received 2890 blocks and 79933457 bytes
Compression is 54.2%
Took 19 sec
Description set: MAPREDUCE-6333
Recording test results
Email was triggered for: Failure
Sending email for trigger: Failure
###################################################################################
############################## FAILED TESTS (if any) ##############################
1 tests failed.
FAILED: org.apache.hadoop.yarn.server.resourcemanager.applicationsmanager.TestAMRestart.testShouldNotCountFailureToMaxAttemptRetry
Error Message:
AppAttempt state is not correct (timedout) expected:<ALLOCATED> but was:<SCHEDULED>
Stack Trace:
java.lang.AssertionError: AppAttempt state is not correct (timedout) expected:<ALLOCATED> but was:<SCHEDULED>
at org.junit.Assert.fail(Assert.java:88)
at org.junit.Assert.failNotEquals(Assert.java:743)
at org.junit.Assert.assertEquals(Assert.java:118)
at org.apache.hadoop.yarn.server.resourcemanager.MockAM.waitForState(MockAM.java:86)
at org.apache.hadoop.yarn.server.resourcemanager.MockRM.sendAMLaunched(MockRM.java:507)
at org.apache.hadoop.yarn.server.resourcemanager.MockRM.launchAM(MockRM.java:689)
at org.apache.hadoop.yarn.server.resourcemanager.MockRM.launchAndRegisterAM(MockRM.java:696)
at org.apache.hadoop.yarn.server.resourcemanager.MockRM.waitForNewAMToLaunchAndRegister(MockRM.java:194)
at org.apache.hadoop.yarn.server.resourcemanager.applicationsmanager.TestAMRestart.testShouldNotCountFailureToMaxAttemptRetry(TestAMRestart.java:392)
Failed: YARN-3544 PreCommit Build #7498
Posted by Apache Jenkins Server <je...@builds.apache.org>.
Jira: https://issues.apache.org/jira/browse/YARN-3544
Build: https://builds.apache.org/job/PreCommit-YARN-Build/7498/
###################################################################################
########################## LAST 60 LINES OF THE CONSOLE ###########################
[...truncated 268 lines...]
| | | | the total number of release audit
| | | | warnings.
| -1 | checkstyle | 7m 40s | The applied patch generated 1
| | | | additional checkstyle issues.
| +1 | install | 1m 33s | mvn install still works.
| +1 | eclipse:eclipse | 0m 32s | The patch built with
| | | | eclipse:eclipse.
| +1 | findbugs | 1m 15s | The patch does not introduce any
| | | | new Findbugs (version 2.0.3)
| | | | warnings.
| -1 | yarn tests | 54m 43s | Tests failed in
| | | | hadoop-yarn-server-resourcemanager.
| | | 97m 52s |
Reason | Tests
Failed unit tests | hadoop.yarn.server.resourcemanager.applicationsmanager.TestAMRestart
|| Subsystem || Report/Notes ||
============================================================================
| Patch URL | http://issues.apache.org/jira/secure/attachment/12728109/YARN-3544.1.patch |
| Optional Tests | javadoc javac unit findbugs checkstyle |
| git revision | trunk / 78c6b46 |
| checkstyle | /home/jenkins/jenkins-slave/workspace/PreCommit-YARN-Build/../patchprocess/checkstyle-result-diff.txt |
| hadoop-yarn-server-resourcemanager test log | /home/jenkins/jenkins-slave/workspace/PreCommit-YARN-Build/../patchprocess/testrun_hadoop-yarn-server-resourcemanager.txt |
| Test Results | https://builds.apache.org/job/PreCommit-YARN-Build/7498/testReport/ |
============================================================================
============================================================================
Adding comment to JIRA
============================================================================
============================================================================
Comment added.
ba3f07a7f78a693807724e98db0d1e4ae97a2440 logged out
============================================================================
============================================================================
Finished build.
============================================================================
============================================================================
Build step 'Execute shell' marked build as failure
Archiving artifacts
Sending artifact delta relative to PreCommit-YARN-Build #7481
Archived 21 artifacts
Archive block size is 32768
Received 641 blocks and 156031137 bytes
Compression is 11.9%
Took 1 min 9 sec
Description set: MAPREDUCE-6333
Recording test results
Email was triggered for: Failure
Sending email for trigger: Failure
###################################################################################
############################## FAILED TESTS (if any) ##############################
2 tests failed.
REGRESSION: org.apache.hadoop.yarn.server.resourcemanager.applicationsmanager.TestAMRestart.testShouldNotCountFailureToMaxAttemptRetry
Error Message:
AppAttempt state is not correct (timedout) expected:<ALLOCATED> but was:<SCHEDULED>
Stack Trace:
java.lang.AssertionError: AppAttempt state is not correct (timedout) expected:<ALLOCATED> but was:<SCHEDULED>
at org.junit.Assert.fail(Assert.java:88)
at org.junit.Assert.failNotEquals(Assert.java:743)
at org.junit.Assert.assertEquals(Assert.java:118)
at org.apache.hadoop.yarn.server.resourcemanager.MockAM.waitForState(MockAM.java:86)
at org.apache.hadoop.yarn.server.resourcemanager.MockRM.sendAMLaunched(MockRM.java:507)
at org.apache.hadoop.yarn.server.resourcemanager.MockRM.launchAM(MockRM.java:689)
at org.apache.hadoop.yarn.server.resourcemanager.MockRM.launchAndRegisterAM(MockRM.java:696)
at org.apache.hadoop.yarn.server.resourcemanager.MockRM.waitForNewAMToLaunchAndRegister(MockRM.java:194)
at org.apache.hadoop.yarn.server.resourcemanager.applicationsmanager.TestAMRestart.testShouldNotCountFailureToMaxAttemptRetry(TestAMRestart.java:392)
REGRESSION: org.apache.hadoop.yarn.server.resourcemanager.applicationsmanager.TestAMRestart.testPreemptedAMRestartOnRMRestart
Error Message:
test timed out after 20000 milliseconds
Stack Trace:
java.lang.Exception: test timed out after 20000 milliseconds
at java.lang.Thread.sleep(Native Method)
at org.apache.hadoop.yarn.server.resourcemanager.MockAM.waitForState(MockAM.java:83)
at org.apache.hadoop.yarn.server.resourcemanager.MockRM.sendAMLaunched(MockRM.java:507)
at org.apache.hadoop.yarn.server.resourcemanager.MockRM.launchAM(MockRM.java:689)
at org.apache.hadoop.yarn.server.resourcemanager.MockRM.launchAndRegisterAM(MockRM.java:696)
at org.apache.hadoop.yarn.server.resourcemanager.MockRM.waitForNewAMToLaunchAndRegister(MockRM.java:194)
at org.apache.hadoop.yarn.server.resourcemanager.applicationsmanager.TestAMRestart.testPreemptedAMRestartOnRMRestart(TestAMRestart.java:516)
Failed: YARN-2893 PreCommit Build #7497
Posted by Apache Jenkins Server <je...@builds.apache.org>.
Jira: https://issues.apache.org/jira/browse/YARN-2893
Build: https://builds.apache.org/job/PreCommit-YARN-Build/7497/
###################################################################################
########################## LAST 60 LINES OF THE CONSOLE ###########################
[...truncated 263 lines...]
| | | | messages.
| +1 | javadoc | 9m 38s | There were no new javadoc warning
| | | | messages.
| +1 | release audit | 0m 23s | The applied patch does not increase
| | | | the total number of release audit
| | | | warnings.
| -1 | checkstyle | 7m 40s | The applied patch generated 1
| | | | additional checkstyle issues.
| +1 | install | 1m 41s | mvn install still works.
| +1 | eclipse:eclipse | 0m 32s | The patch built with
| | | | eclipse:eclipse.
| +1 | findbugs | 1m 16s | The patch does not introduce any
| | | | new Findbugs (version 2.0.3)
| | | | warnings.
| +1 | yarn tests | 52m 1s | Tests passed in
| | | | hadoop-yarn-server-resourcemanager.
| | | 95m 26s |
|| Subsystem || Report/Notes ||
============================================================================
| Patch URL | http://issues.apache.org/jira/secure/attachment/12728096/YARN-2893.003.patch |
| Optional Tests | javadoc javac unit findbugs checkstyle |
| git revision | trunk / dcc5455 |
| checkstyle | /home/jenkins/jenkins-slave/workspace/PreCommit-YARN-Build/../patchprocess/checkstyle-result-diff.txt |
| hadoop-yarn-server-resourcemanager test log | /home/jenkins/jenkins-slave/workspace/PreCommit-YARN-Build/../patchprocess/testrun_hadoop-yarn-server-resourcemanager.txt |
| Test Results | https://builds.apache.org/job/PreCommit-YARN-Build/7497/testReport/ |
============================================================================
============================================================================
Adding comment to JIRA
============================================================================
============================================================================
Comment added.
a9918b36478660086c1d09499a13595e728d836f logged out
============================================================================
============================================================================
Finished build.
============================================================================
============================================================================
Build step 'Execute shell' marked build as failure
Archiving artifacts
Sending artifact delta relative to PreCommit-YARN-Build #7481
Archived 21 artifacts
Archive block size is 32768
Received 650 blocks and 155712470 bytes
Compression is 12.0%
Took 58 sec
[description-setter] Could not determine description.
Recording test results
Email was triggered for: Failure
Sending email for trigger: Failure
###################################################################################
############################## FAILED TESTS (if any) ##############################
All tests passed