You are viewing a plain text version of this content. The canonical link for it is here.
Posted to commits@activemq.apache.org by Apache Jenkins Server <je...@builds.apache.org> on 2011/11/23 18:45:37 UTC
Build failed in Jenkins: ActiveMQ-Apollo #454
See <https://builds.apache.org/job/ActiveMQ-Apollo/454/>
------------------------------------------
Started by an SCM change
Building remotely on windows1
Cleaning workspace F:\hudson\hudson-slave\workspace\ActiveMQ-Apollo
hudson.util.IOException2: remote file operation failed: <https://builds.apache.org/job/ActiveMQ-Apollo/ws/> at hudson.remoting.Channel@46f752c9:windows1
at hudson.FilePath.act(FilePath.java:754)
at hudson.FilePath.act(FilePath.java:740)
at hudson.scm.SubversionSCM.checkout(SubversionSCM.java:731)
at hudson.scm.SubversionSCM.checkout(SubversionSCM.java:676)
at hudson.model.AbstractProject.checkout(AbstractProject.java:1193)
at hudson.model.AbstractBuild$AbstractRunner.checkout(AbstractBuild.java:566)
at hudson.model.AbstractBuild$AbstractRunner.run(AbstractBuild.java:454)
at hudson.model.Run.run(Run.java:1376)
at hudson.maven.MavenModuleSetBuild.run(MavenModuleSetBuild.java:474)
at hudson.model.ResourceController.execute(ResourceController.java:88)
at hudson.model.Executor.run(Executor.java:230)
Caused by: java.io.IOException: Unable to delete <https://builds.apache.org/job/ActiveMQ-Apollo/ws/trunk\apollo-broker\target\apollo-broker-1.0-SNAPSHOT-tests.jar>
at hudson.Util.deleteFile(Util.java:266)
at hudson.Util.deleteRecursive(Util.java:316)
at hudson.Util.deleteContentsRecursive(Util.java:227)
at hudson.Util.deleteRecursive(Util.java:307)
at hudson.Util.deleteContentsRecursive(Util.java:227)
at hudson.Util.deleteRecursive(Util.java:307)
at hudson.Util.deleteContentsRecursive(Util.java:227)
at hudson.Util.deleteRecursive(Util.java:307)
at hudson.Util.deleteContentsRecursive(Util.java:227)
at hudson.scm.subversion.CheckoutUpdater$1.perform(CheckoutUpdater.java:74)
at hudson.scm.subversion.WorkspaceUpdater$UpdateTask.delegateTo(WorkspaceUpdater.java:136)
at hudson.scm.SubversionSCM$CheckOutTask.perform(SubversionSCM.java:773)
at hudson.scm.SubversionSCM$CheckOutTask.invoke(SubversionSCM.java:754)
at hudson.scm.SubversionSCM$CheckOutTask.invoke(SubversionSCM.java:738)
at hudson.FilePath$FileCallableWrapper.call(FilePath.java:1995)
at hudson.remoting.UserRequest.perform(UserRequest.java:118)
at hudson.remoting.UserRequest.perform(UserRequest.java:48)
at hudson.remoting.Request$2.run(Request.java:287)
at java.util.concurrent.Executors$RunnableAdapter.call(Unknown Source)
at java.util.concurrent.FutureTask$Sync.innerRun(Unknown Source)
at java.util.concurrent.FutureTask.run(Unknown Source)
at java.util.concurrent.ThreadPoolExecutor.runWorker(Unknown Source)
at java.util.concurrent.ThreadPoolExecutor$Worker.run(Unknown Source)
at hudson.remoting.Engine$1$1.run(Engine.java:60)
at java.lang.Thread.run(Unknown Source)
Build failed in Jenkins: ActiveMQ-Apollo #461
Posted by Apache Jenkins Server <je...@builds.apache.org>.
See <https://builds.apache.org/job/ActiveMQ-Apollo/461/changes>
Changes:
[chirino] Log a warning if the pure java implementation of the leveldb is being used since it's a bit buggy still.
[chirino] Avoid compile warning.
------------------------------------------
[...truncated 3353 lines...]
[INFO] Building jar: F:\hudson\hudson-slave\workspace\ActiveMQ-Apollo\trunk\apollo-stomp\target\apollo-stomp-1.0-SNAPSHOT-tests.jar
[INFO]
[INFO] --- maven-install-plugin:2.3.1:install (default-install) @ apollo-stomp ---
[INFO] Installing F:\hudson\hudson-slave\workspace\ActiveMQ-Apollo\trunk\apollo-stomp\target\apollo-stomp-1.0-SNAPSHOT.jar to C:\Users\hudson\.m2\repository\org\apache\activemq\apollo-stomp\1.0-SNAPSHOT\apollo-stomp-1.0-SNAPSHOT.jar
[INFO] Installing F:\hudson\hudson-slave\workspace\ActiveMQ-Apollo\trunk\apollo-stomp\pom.xml to C:\Users\hudson\.m2\repository\org\apache\activemq\apollo-stomp\1.0-SNAPSHOT\apollo-stomp-1.0-SNAPSHOT.pom
[INFO] Installing F:\hudson\hudson-slave\workspace\ActiveMQ-Apollo\trunk\apollo-stomp\target\apollo-stomp-1.0-SNAPSHOT-tests.jar to C:\Users\hudson\.m2\repository\org\apache\activemq\apollo-stomp\1.0-SNAPSHOT\apollo-stomp-1.0-SNAPSHOT-tests.jar
[JENKINS] Archiving disabled - not archiving F:\hudson\hudson-slave\workspace\ActiveMQ-Apollo\trunk\apollo-stomp\pom.xml
[JENKINS] Archiving disabled - not archiving F:\hudson\hudson-slave\workspace\ActiveMQ-Apollo\trunk\apollo-stomp\target\apollo-stomp-1.0-SNAPSHOT.jar
[JENKINS] Archiving disabled - not archiving F:\hudson\hudson-slave\workspace\ActiveMQ-Apollo\trunk\apollo-stomp\target\apollo-stomp-1.0-SNAPSHOT-tests.jar
[INFO]
[INFO] ------------------------------------------------------------------------
[INFO] Skipping apollo-cli
[INFO] This project has been banned from the build due to previous failures.
[INFO] ------------------------------------------------------------------------
[INFO]
[INFO] ------------------------------------------------------------------------
[INFO] Building apollo-website 1.0-SNAPSHOT
[INFO] ------------------------------------------------------------------------
[INFO]
[INFO] --- maven-clean-plugin:2.4.1:clean (default-clean) @ apollo-website ---
[INFO]
[INFO] --- maven-enforcer-plugin:1.0:enforce (default) @ apollo-website ---
[INFO]
[INFO] --- maven-antrun-plugin:1.6:run (default) @ apollo-website ---
[WARNING] Parameter tasks is deprecated, use target instead
[INFO] Executing tasks
main:
[mkdir] Created dir: F:\hudson\hudson-slave\workspace\ActiveMQ-Apollo\trunk\apollo-website\target\sitegen\documentation\schema
[schemagen] Generating schema from 64 source files
Note: Writing F:\hudson\hudson-slave\workspace\ActiveMQ-Apollo\trunk\apollo-website\target\sitegen\documentation\schema\apollo.xsd
[INFO] Executed tasks
[INFO]
[INFO] --- maven-remote-resources-plugin:1.1:process (default) @ apollo-website ---
[INFO]
[INFO] --- maven-scala-plugin:2.15.2:compile (default) @ apollo-website ---
[INFO] Checking for multiple versions of scala
[INFO] includes = [**/*.scala,**/*.java,]
[INFO] excludes = []
[INFO] F:\hudson\hudson-slave\workspace\ActiveMQ-Apollo\trunk\apollo-website\ext:-1: info: compiling
[INFO] Compiling 3 source files to F:\hudson\hudson-slave\workspace\ActiveMQ-Apollo\trunk\apollo-website\target\classes at 1322585666794
[INFO] compiler plugin: BasicArtifact(org.scala-lang.plugins,continuations,2.9.1)
[INFO] compiler plugin: BasicArtifact(org.fusesource.jvmassert,jvmassert,1.2)
[INFO] prepare-compile in 0 s
[INFO] compile in 9 s
[INFO]
[INFO] --- maven-scala-plugin:2.15.2:testCompile (default) @ apollo-website ---
[INFO] Checking for multiple versions of scala
[INFO] includes = [**/*.scala,**/*.java,]
[INFO] excludes = []
[WARNING] No source files found.
[INFO]
[INFO] --- maven-enforcer-plugin:1.0:enforce (default) @ apollo-website ---
[JENKINS] Archiving disabled - not archiving F:\hudson\hudson-slave\workspace\ActiveMQ-Apollo\trunk\apollo-website\pom.xml
ignoring exception during new ExecutedMojo null
[INFO]
[INFO] --- maven-source-plugin:2.1.2:jar (attach-sources) @ apollo-website ---
[INFO]
[INFO] --- maven-enforcer-plugin:1.0:enforce (default) @ apollo-website ---
[INFO]
[INFO] --- maven-antrun-plugin:1.6:run (default) @ apollo-website ---
[WARNING] Parameter tasks is deprecated, use target instead
[INFO] Executing tasks
main:
[schemagen] Generating schema from 64 source files
Note: Writing F:\hudson\hudson-slave\workspace\ActiveMQ-Apollo\trunk\apollo-website\target\sitegen\documentation\schema\apollo.xsd
[INFO] Executed tasks
[INFO]
[INFO] --- maven-remote-resources-plugin:1.1:process (default) @ apollo-website ---
[INFO]
[INFO] --- maven-scala-plugin:2.15.2:compile (default) @ apollo-website ---
[INFO] Checking for multiple versions of scala
[INFO] includes = [**/*.scala,**/*.java,]
[INFO] excludes = []
[INFO] Nothing to compile - all classes are up to date
[INFO]
[INFO] --- maven-scala-plugin:2.15.2:testCompile (default) @ apollo-website ---
[INFO] Checking for multiple versions of scala
[INFO] includes = [**/*.scala,**/*.java,]
[INFO] excludes = []
[WARNING] No source files found.
[INFO]
[INFO] --- maven-enforcer-plugin:1.0:enforce (default) @ apollo-website ---
[JENKINS] Archiving disabled - not archiving F:\hudson\hudson-slave\workspace\ActiveMQ-Apollo\trunk\apollo-website\pom.xml
ignoring exception during new ExecutedMojo null
[INFO]
[INFO] --- maven-source-plugin:2.1.2:jar (attach-sources) @ apollo-website ---
[JENKINS] Archiving disabled - not archiving F:\hudson\hudson-slave\workspace\ActiveMQ-Apollo\trunk\apollo-website\pom.xml
ignoring exception during new ExecutedMojo null
[INFO] Processing Configuration for child elements
Processing child [project]
Processing child [workingDirectory]
Processing child [webappDirectory]
Processing child [targetDirectory]
Processing child [testClassPathElements]
[INFO] Generating static website from Scalate Templates and wiki files...
[INFO] template properties: null
[INFO] --- maven-scalate-plugin:1.5.3:sitegen (sitegen) @ apollo-website ---
Using dir: F:\hudson\hudson-slave\workspace\ActiveMQ-Apollo\trunk\apollo-website\src\blog at request path: /blog
[INFO] processing F:\hudson\hudson-slave\workspace\ActiveMQ-Apollo\trunk\apollo-website\src\blog\index.page with uri: /blog/index.page =>
Using dir: F:\hudson\hudson-slave\workspace\ActiveMQ-Apollo\trunk\apollo-website\src\blog at request path: /blog
[INFO] processing F:\hudson\hudson-slave\workspace\ActiveMQ-Apollo\trunk\apollo-website\src\blog\index.rss.feed with uri: /blog/index.rss.feed =>
[INFO] processing F:\hudson\hudson-slave\workspace\ActiveMQ-Apollo\trunk\apollo-website\src\blog\releases\release-1-0-beta1.page with uri: /blog/releases/release-1-0-beta1.page =>
[INFO] processing F:\hudson\hudson-slave\workspace\ActiveMQ-Apollo\trunk\apollo-website\src\blog\releases\release-1-0-beta2.page with uri: /blog/releases/release-1-0-beta2.page =>
[INFO] processing F:\hudson\hudson-slave\workspace\ActiveMQ-Apollo\trunk\apollo-website\src\blog\releases\release-1-0-beta3.page with uri: /blog/releases/release-1-0-beta3.page =>
[INFO] processing F:\hudson\hudson-slave\workspace\ActiveMQ-Apollo\trunk\apollo-website\src\blog\releases\release-1-0-beta4.page with uri: /blog/releases/release-1-0-beta4.page =>
[INFO] processing F:\hudson\hudson-slave\workspace\ActiveMQ-Apollo\trunk\apollo-website\src\blog\releases\release-1-0-beta5.page with uri: /blog/releases/release-1-0-beta5.page =>
[INFO] processing F:\hudson\hudson-slave\workspace\ActiveMQ-Apollo\trunk\apollo-website\src\community\building.page with uri: /community/building.page =>
[INFO] processing F:\hudson\hudson-slave\workspace\ActiveMQ-Apollo\trunk\apollo-website\src\community\contributing.page with uri: /community/contributing.page =>
[INFO] processing F:\hudson\hudson-slave\workspace\ActiveMQ-Apollo\trunk\apollo-website\src\community\developers.page with uri: /community/developers.page =>
[INFO] processing F:\hudson\hudson-slave\workspace\ActiveMQ-Apollo\trunk\apollo-website\src\community\faq.page with uri: /community/faq.page =>
[INFO] processing F:\hudson\hudson-slave\workspace\ActiveMQ-Apollo\trunk\apollo-website\src\community\index.page with uri: /community/index.page =>
[INFO] processing F:\hudson\hudson-slave\workspace\ActiveMQ-Apollo\trunk\apollo-website\src\community\release-guide.page with uri: /community/release-guide.page =>
[INFO] processing F:\hudson\hudson-slave\workspace\ActiveMQ-Apollo\trunk\apollo-website\src\community\site.page with uri: /community/site.page =>
[INFO] processing F:\hudson\hudson-slave\workspace\ActiveMQ-Apollo\trunk\apollo-website\src\community\source.page with uri: /community/source.page =>
[INFO] processing F:\hudson\hudson-slave\workspace\ActiveMQ-Apollo\trunk\apollo-website\src\community\support.page with uri: /community/support.page =>
[INFO] processing F:\hudson\hudson-slave\workspace\ActiveMQ-Apollo\trunk\apollo-website\src\documentation\architecture.md with uri: /documentation/architecture.md =>
[INFO] processing F:\hudson\hudson-slave\workspace\ActiveMQ-Apollo\trunk\apollo-website\src\documentation\extending-guide.md with uri: /documentation/extending-guide.md =>
[INFO] processing F:\hudson\hudson-slave\workspace\ActiveMQ-Apollo\trunk\apollo-website\src\documentation\getting-started.md with uri: /documentation/getting-started.md =>
[INFO] processing F:\hudson\hudson-slave\workspace\ActiveMQ-Apollo\trunk\apollo-website\src\documentation\index.page with uri: /documentation/index.page =>
[INFO] processing F:\hudson\hudson-slave\workspace\ActiveMQ-Apollo\trunk\apollo-website\src\documentation\management-api.md with uri: /documentation/management-api.md =>
[INFO] processing F:\hudson\hudson-slave\workspace\ActiveMQ-Apollo\trunk\apollo-website\src\documentation\module-organization.page with uri: /documentation/module-organization.page =>
[INFO] processing F:\hudson\hudson-slave\workspace\ActiveMQ-Apollo\trunk\apollo-website\src\documentation\performance-scaling.md with uri: /documentation/performance-scaling.md =>
[INFO] processing F:\hudson\hudson-slave\workspace\ActiveMQ-Apollo\trunk\apollo-website\src\documentation\user-manual.md with uri: /documentation/user-manual.md =>
[INFO] processing F:\hudson\hudson-slave\workspace\ActiveMQ-Apollo\trunk\apollo-website\src\documentation\verification.md with uri: /documentation/verification.md =>
[INFO] processing F:\hudson\hudson-slave\workspace\ActiveMQ-Apollo\trunk\apollo-website\src\download.page with uri: /download.page =>
[INFO] processing F:\hudson\hudson-slave\workspace\ActiveMQ-Apollo\trunk\apollo-website\src\index.page with uri: /index.page =>
[INFO] processing F:\hudson\hudson-slave\workspace\ActiveMQ-Apollo\trunk\apollo-website\src\privacy-policy.page with uri: /privacy-policy.page =>
[INFO] processing F:\hudson\hudson-slave\workspace\ActiveMQ-Apollo\trunk\apollo-website\src\versions\index.page with uri: /versions/index.page =>
[INFO]
[INFO] --- maven-install-plugin:2.3.1:install (default-install) @ apollo-website ---
[INFO] Installing F:\hudson\hudson-slave\workspace\ActiveMQ-Apollo\trunk\apollo-website\pom.xml to C:\Users\hudson\.m2\repository\org\apache\activemq\apollo-website\1.0-SNAPSHOT\apollo-website-1.0-SNAPSHOT.pom
[JENKINS] Archiving disabled - not archiving F:\hudson\hudson-slave\workspace\ActiveMQ-Apollo\trunk\apollo-website\pom.xml
[INFO]
[INFO] ------------------------------------------------------------------------
[INFO] Skipping apache-apollo
[INFO] This project has been banned from the build due to previous failures.
[INFO] ------------------------------------------------------------------------
[INFO]
[INFO] ------------------------------------------------------------------------
[INFO] Building apollo-karaf-feature 1.0-SNAPSHOT
[INFO] ------------------------------------------------------------------------
[INFO]
[INFO] --- maven-clean-plugin:2.4.1:clean (default-clean) @ apollo-karaf-feature ---
[INFO]
[INFO] --- maven-enforcer-plugin:1.0:enforce (default) @ apollo-karaf-feature ---
[INFO]
[INFO] --- maven-remote-resources-plugin:1.1:process (default) @ apollo-karaf-feature ---
[INFO]
[INFO] --- maven-resources-plugin:2.4.3:resources (filter) @ apollo-karaf-feature ---[INFO] Using 'UTF-8' encoding to copy filtered resources.
[INFO] Copying 1 resource
[INFO] Copying 3 resources
[INFO]
[INFO] --- build-helper-maven-plugin:1.2:attach-artifact (attach-artifacts) @ apollo-karaf-feature ---
[INFO]
[INFO] --- maven-install-plugin:2.3.1:install (default-install) @ apollo-karaf-feature ---[INFO] Installing F:\hudson\hudson-slave\workspace\ActiveMQ-Apollo\trunk\apollo-karaf-feature\pom.xml to C:\Users\hudson\.m2\repository\org\apache\activemq\apollo-karaf-feature\1.0-SNAPSHOT\apollo-karaf-feature-1.0-SNAPSHOT.pom
[INFO] Installing F:\hudson\hudson-slave\workspace\ActiveMQ-Apollo\trunk\apollo-karaf-feature\target\classes\features.xml to C:\Users\hudson\.m2\repository\org\apache\activemq\apollo-karaf-feature\1.0-SNAPSHOT\apollo-karaf-feature-1.0-SNAPSHOT-features.xml
[JENKINS] Archiving disabled - not archiving F:\hudson\hudson-slave\workspace\ActiveMQ-Apollo\trunk\apollo-karaf-feature\pom.xml
[JENKINS] Archiving disabled - not archiving F:\hudson\hudson-slave\workspace\ActiveMQ-Apollo\trunk\apollo-karaf-feature\target\classes\features.xml
[INFO] ------------------------------------------------------------------------
[INFO] Reactor Summary:
[INFO]
[INFO] Apache ActiveMQ Apollo Project .................... SUCCESS [8.366s]
[INFO] apollo-boot ....................................... SUCCESS [3.442s]
[INFO] apollo-scala ...................................... SUCCESS [2.139s]
[INFO] apollo-util ....................................... SUCCESS [55.064s]
[INFO] apollo-transport .................................. SUCCESS [1.812s]
[INFO] apollo-dto ........................................ SUCCESS [7.916s]
[INFO] apollo-selector ................................... SUCCESS [4.779s]
[INFO] apollo-broker ..................................... SUCCESS [1:18.071s]
[INFO] apollo-tcp ........................................ SUCCESS [1.349s]
[INFO] apollo-web ........................................ SUCCESS [1:07.247s]
[INFO] apollo-leveldb .................................... FAILURE [8.363s]
[INFO] apollo-bdb ........................................ SUCCESS [38.648s]
[INFO] apollo-jdbm2 ...................................... SUCCESS [43.771s]
[INFO] apollo-stomp ...................................... SUCCESS [1:28.663s]
[INFO] apollo-cli ........................................ SKIPPED
[INFO] apollo-website .................................... SUCCESS [50.454s]
[INFO] apache-apollo ..................................... SKIPPED
[INFO] apollo-karaf-feature .............................. SUCCESS [0.271s]
[INFO] ------------------------------------------------------------------------
[INFO] BUILD FAILURE
[INFO] ------------------------------------------------------------------------
[INFO] Total time: 7:46.803s
[INFO] Finished at: Tue Nov 29 16:55:08 GMT 2011
[INFO] Final Memory: 302M/1253M
[INFO] ------------------------------------------------------------------------
mavenExecutionResult exceptions not empty
message : Failed to execute goal on project apollo-leveldb: Could not resolve dependencies for project org.apache.activemq:apollo-leveldb:jar:1.0-SNAPSHOT: The following artifacts could not be resolved: org.iq80.leveldb:leveldb-api:jar:0.1-SNAPSHOT, org.iq80.leveldb:leveldb:jar:0.1-SNAPSHOT: Could not find artifact org.iq80.leveldb:leveldb-api:jar:0.1-SNAPSHOT in Nexus (http://repository.apache.org/snapshots)
cause : Could not resolve dependencies for project org.apache.activemq:apollo-leveldb:jar:1.0-SNAPSHOT: The following artifacts could not be resolved: org.iq80.leveldb:leveldb-api:jar:0.1-SNAPSHOT, org.iq80.leveldb:leveldb:jar:0.1-SNAPSHOT: Could not find artifact org.iq80.leveldb:leveldb-api:jar:0.1-SNAPSHOT in Nexus (http://repository.apache.org/snapshots)
Stack trace :
org.apache.maven.lifecycle.LifecycleExecutionException: Failed to execute goal on project apollo-leveldb: Could not resolve dependencies for project org.apache.activemq:apollo-leveldb:jar:1.0-SNAPSHOT: The following artifacts could not be resolved: org.iq80.leveldb:leveldb-api:jar:0.1-SNAPSHOT, org.iq80.leveldb:leveldb:jar:0.1-SNAPSHOT: Could not find artifact org.iq80.leveldb:leveldb-api:jar:0.1-SNAPSHOT in Nexus (http://repository.apache.org/snapshots)
at org.apache.maven.lifecycle.internal.LifecycleDependencyResolver.getDependencies(LifecycleDependencyResolver.java:190)
at org.apache.maven.lifecycle.internal.LifecycleDependencyResolver.resolveProjectDependencies(LifecycleDependencyResolver.java:104)
at org.apache.maven.lifecycle.internal.MojoExecutor.ensureDependenciesAreResolved(MojoExecutor.java:258)
at org.apache.maven.lifecycle.internal.MojoExecutor.execute(MojoExecutor.java:201)
at org.apache.maven.lifecycle.internal.MojoExecutor.execute(MojoExecutor.java:153)
at org.apache.maven.lifecycle.internal.MojoExecutor.execute(MojoExecutor.java:145)
at org.apache.maven.lifecycle.internal.LifecycleModuleBuilder.buildProject(LifecycleModuleBuilder.java:84)
at org.apache.maven.lifecycle.internal.LifecycleModuleBuilder.buildProject(LifecycleModuleBuilder.java:59)
at org.apache.maven.lifecycle.internal.LifecycleStarter.singleThreadedBuild(LifecycleStarter.java:183)
at org.apache.maven.lifecycle.internal.LifecycleStarter.execute(LifecycleStarter.java:161)
at org.apache.maven.DefaultMaven.doExecute(DefaultMaven.java:319)
at org.apache.maven.DefaultMaven.execute(DefaultMaven.java:156)
at org.jvnet.hudson.maven3.launcher.Maven3Launcher.main(Maven3Launcher.java:79)
at sun.reflect.NativeMethodAccessorImpl.invoke0(Native Method)
at sun.reflect.NativeMethodAccessorImpl.invoke(NativeMethodAccessorImpl.java:39)
at sun.reflect.DelegatingMethodAccessorImpl.invoke(DelegatingMethodAccessorImpl.java:25)
at java.lang.reflect.Method.invoke(Method.java:597)
at org.codehaus.plexus.classworlds.launcher.Launcher.launchStandard(Launcher.java:329)
at org.codehaus.plexus.classworlds.launcher.Launcher.launch(Launcher.java:239)
at org.jvnet.hudson.maven3.agent.Maven3Main.launch(Maven3Main.java:158)
at hudson.maven.Maven3Builder.call(Maven3Builder.java:122)
at hudson.maven.Maven3Builder.call(Maven3Builder.java:74)
at hudson.remoting.UserRequest.perform(UserRequest.java:118)
at hudson.remoting.UserRequest.perform(UserRequest.java:48)
at hudson.remoting.Request$2.run(Request.java:287)
at java.util.concurrent.Executors$RunnableAdapter.call(Executors.java:441)
at java.util.concurrent.FutureTask$Sync.innerRun(FutureTask.java:303)
at java.util.concurrent.FutureTask.run(FutureTask.java:138)
at java.util.concurrent.ThreadPoolExecutor$Worker.runTask(ThreadPoolExecutor.java:886)
at java.util.concurrent.ThreadPoolExecutor$Worker.run(ThreadPoolExecutor.java:908)
at java.lang.Thread.run(Thread.java:662)
Caused by: org.apache.maven.project.DependencyResolutionException: Could not resolve dependencies for project org.apache.activemq:apollo-leveldb:jar:1.0-SNAPSHOT: The following artifacts could not be resolved: org.iq80.leveldb:leveldb-api:jar:0.1-SNAPSHOT, org.iq80.leveldb:leveldb:jar:0.1-SNAPSHOT: Could not find artifact org.iq80.leveldb:leveldb-api:jar:0.1-SNAPSHOT in Nexus (http://repository.apache.org/snapshots)
at org.apache.maven.project.DefaultProjectDependenciesResolver.resolve(DefaultProjectDependenciesResolver.java:156)
at org.apache.maven.lifecycle.internal.LifecycleDependencyResolver.getDependencies(LifecycleDependencyResolver.java:165)
... 30 more
Caused by: org.sonatype.aether.resolution.ArtifactResolutionException: The following artifacts could not be resolved: org.iq80.leveldb:leveldb-api:jar:0.1-SNAPSHOT, org.iq80.leveldb:leveldb:jar:0.1-SNAPSHOT: Could not find artifact org.iq80.leveldb:leveldb-api:jar:0.1-SNAPSHOT in Nexus (http://repository.apache.org/snapshots)
at org.sonatype.aether.impl.internal.DefaultArtifactResolver.resolveArtifacts(DefaultArtifactResolver.java:526)
at org.sonatype.aether.impl.internal.DefaultRepositorySystem.resolveArtifacts(DefaultRepositorySystem.java:304)
at org.sonatype.aether.impl.internal.DefaultRepositorySystem.resolveDependencies(DefaultRepositorySystem.java:334)
at org.apache.maven.project.DefaultProjectDependenciesResolver.resolve(DefaultProjectDependenciesResolver.java:150)
... 31 more
Caused by: org.sonatype.aether.transfer.ArtifactNotFoundException: Could not find artifact org.iq80.leveldb:leveldb-api:jar:0.1-SNAPSHOT in Nexus (http://repository.apache.org/snapshots)
at org.sonatype.aether.connector.wagon.WagonRepositoryConnector$4.wrap(WagonRepositoryConnector.java:945)
at org.sonatype.aether.connector.wagon.WagonRepositoryConnector$4.wrap(WagonRepositoryConnector.java:940)
at org.sonatype.aether.connector.wagon.WagonRepositoryConnector$GetTask.flush(WagonRepositoryConnector.java:696)
at org.sonatype.aether.connector.wagon.WagonRepositoryConnector$GetTask.flush(WagonRepositoryConnector.java:690)
at org.sonatype.aether.connector.wagon.WagonRepositoryConnector.get(WagonRepositoryConnector.java:435)
at org.sonatype.aether.impl.internal.DefaultArtifactResolver.resolveArtifacts(DefaultArtifactResolver.java:438)
... 34 more
Maven failed with error.
Sending e-mails to: commits@activemq.apache.org
Sending e-mails to: commits@activemq.apache.org
channel stopped
Build failed in Jenkins: ActiveMQ-Apollo #460
Posted by Apache Jenkins Server <je...@builds.apache.org>.
See <https://builds.apache.org/job/ActiveMQ-Apollo/460/changes>
Changes:
[chirino] Avoid naming the BrokerFactory interface the same as the object class so that the object class can still be used by java code.
------------------------------------------
[...truncated 3385 lines...]
[INFO] --- maven-jar-plugin:2.3.1:test-jar (default) @ apollo-stomp ---
[INFO] Installing F:\hudson\hudson-slave\workspace\ActiveMQ-Apollo\trunk\apollo-stomp\target\apollo-stomp-1.0-SNAPSHOT.jar to C:\Users\hudson\.m2\repository\org\apache\activemq\apollo-stomp\1.0-SNAPSHOT\apollo-stomp-1.0-SNAPSHOT.jar
[INFO]
[INFO] --- maven-install-plugin:2.3.1:install (default-install) @ apollo-stomp ---
[INFO] Installing F:\hudson\hudson-slave\workspace\ActiveMQ-Apollo\trunk\apollo-stomp\pom.xml to C:\Users\hudson\.m2\repository\org\apache\activemq\apollo-stomp\1.0-SNAPSHOT\apollo-stomp-1.0-SNAPSHOT.pom
[INFO] Installing F:\hudson\hudson-slave\workspace\ActiveMQ-Apollo\trunk\apollo-stomp\target\apollo-stomp-1.0-SNAPSHOT-tests.jar to C:\Users\hudson\.m2\repository\org\apache\activemq\apollo-stomp\1.0-SNAPSHOT\apollo-stomp-1.0-SNAPSHOT-tests.jar
[JENKINS] Archiving disabled - not archiving F:\hudson\hudson-slave\workspace\ActiveMQ-Apollo\trunk\apollo-stomp\pom.xml
[JENKINS] Archiving disabled - not archiving F:\hudson\hudson-slave\workspace\ActiveMQ-Apollo\trunk\apollo-stomp\target\apollo-stomp-1.0-SNAPSHOT.jar
[JENKINS] Archiving disabled - not archiving F:\hudson\hudson-slave\workspace\ActiveMQ-Apollo\trunk\apollo-stomp\target\apollo-stomp-1.0-SNAPSHOT-tests.jar
[INFO]
[INFO] ------------------------------------------------------------------------
[INFO] Skipping apollo-cli
[INFO] This project has been banned from the build due to previous failures.
[INFO] ------------------------------------------------------------------------
[INFO]
[INFO] ------------------------------------------------------------------------
[INFO] Building apollo-website 1.0-SNAPSHOT
[INFO] ------------------------------------------------------------------------
[INFO]
[INFO] --- maven-clean-plugin:2.4.1:clean (default-clean) @ apollo-website ---
[INFO]
[INFO] --- maven-enforcer-plugin:1.0:enforce (default) @ apollo-website ---
[INFO] [WARNING] Parameter tasks is deprecated, use target instead
[INFO] --- maven-antrun-plugin:1.6:run (default) @ apollo-website ---
[INFO] Executing tasks
main:
[mkdir] Created dir: F:\hudson\hudson-slave\workspace\ActiveMQ-Apollo\trunk\apollo-website\target\sitegen\documentation\schema
[schemagen] Generating schema from 64 source files
Note: Writing F:\hudson\hudson-slave\workspace\ActiveMQ-Apollo\trunk\apollo-website\target\sitegen\documentation\schema\apollo.xsd
[INFO] Executed tasks
[INFO]
[INFO] --- maven-remote-resources-plugin:1.1:process (default) @ apollo-website ---
[INFO]
[INFO] --- maven-scala-plugin:2.15.2:compile (default) @ apollo-website ---
[INFO] Checking for multiple versions of scala
[INFO] includes = [**/*.scala,**/*.java,]
[INFO] excludes = []
[INFO] F:\hudson\hudson-slave\workspace\ActiveMQ-Apollo\trunk\apollo-website\ext:-1: info: compiling
[INFO] Compiling 3 source files to F:\hudson\hudson-slave\workspace\ActiveMQ-Apollo\trunk\apollo-website\target\classes at 1322583194036
[INFO] compiler plugin: BasicArtifact(org.scala-lang.plugins,continuations,2.9.1)
[INFO] compiler plugin: BasicArtifact(org.fusesource.jvmassert,jvmassert,1.2)
[INFO] prepare-compile in 0 s
[INFO] compile in 9 s
[INFO]
[INFO] --- maven-scala-plugin:2.15.2:testCompile (default) @ apollo-website ---
[INFO] Checking for multiple versions of scala
[INFO] includes = [**/*.scala,**/*.java,]
[INFO] excludes = []
[WARNING] No source files found.
[INFO]
[INFO] --- maven-enforcer-plugin:1.0:enforce (default) @ apollo-website ---
[JENKINS] Archiving disabled - not archiving F:\hudson\hudson-slave\workspace\ActiveMQ-Apollo\trunk\apollo-website\pom.xml
ignoring exception during new ExecutedMojo null
[INFO]
[INFO] --- maven-source-plugin:2.1.2:jar (attach-sources) @ apollo-website ---
[INFO]
[INFO] --- maven-enforcer-plugin:1.0:enforce (default) @ apollo-website ---
[INFO]
[INFO] --- maven-antrun-plugin:1.6:run (default) @ apollo-website ---
[WARNING] Parameter tasks is deprecated, use target instead
[INFO] Executing tasks
main:
[schemagen] Generating schema from 64 source files
Note: Writing F:\hudson\hudson-slave\workspace\ActiveMQ-Apollo\trunk\apollo-website\target\sitegen\documentation\schema\apollo.xsd
[INFO] Executed tasks
[INFO]
[INFO] --- maven-remote-resources-plugin:1.1:process (default) @ apollo-website ---
[INFO]
[INFO] --- maven-scala-plugin:2.15.2:compile (default) @ apollo-website ---
[INFO] Checking for multiple versions of scala
[INFO] includes = [**/*.scala,**/*.java,]
[INFO] excludes = []
[INFO] Nothing to compile - all classes are up to date
[INFO] Checking for multiple versions of scala
[INFO] includes = [**/*.scala,**/*.java,]
[INFO] excludes = []
[WARNING] No source files found.
[INFO]
[INFO] --- maven-scala-plugin:2.15.2:testCompile (default) @ apollo-website ---
[INFO]
[INFO] --- maven-enforcer-plugin:1.0:enforce (default) @ apollo-website ---
[JENKINS] Archiving disabled - not archiving F:\hudson\hudson-slave\workspace\ActiveMQ-Apollo\trunk\apollo-website\pom.xml
ignoring exception during new ExecutedMojo null
[INFO]
[INFO] --- maven-source-plugin:2.1.2:jar (attach-sources) @ apollo-website ---
[JENKINS] Archiving disabled - not archiving F:\hudson\hudson-slave\workspace\ActiveMQ-Apollo\trunk\apollo-website\pom.xml
ignoring exception during new ExecutedMojo null
Processing Configuration for child elements
Processing child [project]
Processing child [workingDirectory]
Processing child [webappDirectory]
Processing child [targetDirectory]
Processing child [testClassPathElements]
[INFO] Generating static website from Scalate Templates and wiki files...
[INFO] template properties: null
[INFO]
[INFO] --- maven-scalate-plugin:1.5.3:sitegen (sitegen) @ apollo-website ---
Using dir: F:\hudson\hudson-slave\workspace\ActiveMQ-Apollo\trunk\apollo-website\src\blog at request path: /blog
[INFO] processing F:\hudson\hudson-slave\workspace\ActiveMQ-Apollo\trunk\apollo-website\src\blog\index.page with uri: /blog/index.page =>
Using dir: F:\hudson\hudson-slave\workspace\ActiveMQ-Apollo\trunk\apollo-website\src\blog at request path: /blog
[INFO] processing F:\hudson\hudson-slave\workspace\ActiveMQ-Apollo\trunk\apollo-website\src\blog\index.rss.feed with uri: /blog/index.rss.feed =>
[INFO] processing F:\hudson\hudson-slave\workspace\ActiveMQ-Apollo\trunk\apollo-website\src\blog\releases\release-1-0-beta1.page with uri: /blog/releases/release-1-0-beta1.page =>
[INFO] processing F:\hudson\hudson-slave\workspace\ActiveMQ-Apollo\trunk\apollo-website\src\blog\releases\release-1-0-beta2.page with uri: /blog/releases/release-1-0-beta2.page =>
[INFO] processing F:\hudson\hudson-slave\workspace\ActiveMQ-Apollo\trunk\apollo-website\src\blog\releases\release-1-0-beta3.page with uri: /blog/releases/release-1-0-beta3.page =>
[INFO] processing F:\hudson\hudson-slave\workspace\ActiveMQ-Apollo\trunk\apollo-website\src\blog\releases\release-1-0-beta4.page with uri: /blog/releases/release-1-0-beta4.page =>
[INFO] processing F:\hudson\hudson-slave\workspace\ActiveMQ-Apollo\trunk\apollo-website\src\blog\releases\release-1-0-beta5.page with uri: /blog/releases/release-1-0-beta5.page =>
[INFO] processing F:\hudson\hudson-slave\workspace\ActiveMQ-Apollo\trunk\apollo-website\src\community\building.page with uri: /community/building.page =>
[INFO] processing F:\hudson\hudson-slave\workspace\ActiveMQ-Apollo\trunk\apollo-website\src\community\contributing.page with uri: /community/contributing.page =>
[INFO] processing F:\hudson\hudson-slave\workspace\ActiveMQ-Apollo\trunk\apollo-website\src\community\developers.page with uri: /community/developers.page =>
[INFO] processing F:\hudson\hudson-slave\workspace\ActiveMQ-Apollo\trunk\apollo-website\src\community\faq.page with uri: /community/faq.page =>
[INFO] processing F:\hudson\hudson-slave\workspace\ActiveMQ-Apollo\trunk\apollo-website\src\community\index.page with uri: /community/index.page =>
[INFO] processing F:\hudson\hudson-slave\workspace\ActiveMQ-Apollo\trunk\apollo-website\src\community\release-guide.page with uri: /community/release-guide.page =>
[INFO] processing F:\hudson\hudson-slave\workspace\ActiveMQ-Apollo\trunk\apollo-website\src\community\site.page with uri: /community/site.page =>
[INFO] processing F:\hudson\hudson-slave\workspace\ActiveMQ-Apollo\trunk\apollo-website\src\community\source.page with uri: /community/source.page =>
[INFO] processing F:\hudson\hudson-slave\workspace\ActiveMQ-Apollo\trunk\apollo-website\src\community\support.page with uri: /community/support.page =>
[INFO] processing F:\hudson\hudson-slave\workspace\ActiveMQ-Apollo\trunk\apollo-website\src\documentation\architecture.md with uri: /documentation/architecture.md =>
[INFO] processing F:\hudson\hudson-slave\workspace\ActiveMQ-Apollo\trunk\apollo-website\src\documentation\extending-guide.md with uri: /documentation/extending-guide.md =>
[INFO] processing F:\hudson\hudson-slave\workspace\ActiveMQ-Apollo\trunk\apollo-website\src\documentation\getting-started.md with uri: /documentation/getting-started.md =>
[INFO] processing F:\hudson\hudson-slave\workspace\ActiveMQ-Apollo\trunk\apollo-website\src\documentation\index.page with uri: /documentation/index.page =>
[INFO] processing F:\hudson\hudson-slave\workspace\ActiveMQ-Apollo\trunk\apollo-website\src\documentation\management-api.md with uri: /documentation/management-api.md =>
[INFO] processing F:\hudson\hudson-slave\workspace\ActiveMQ-Apollo\trunk\apollo-website\src\documentation\module-organization.page with uri: /documentation/module-organization.page =>
[INFO] processing F:\hudson\hudson-slave\workspace\ActiveMQ-Apollo\trunk\apollo-website\src\documentation\performance-scaling.md with uri: /documentation/performance-scaling.md =>
[INFO] processing F:\hudson\hudson-slave\workspace\ActiveMQ-Apollo\trunk\apollo-website\src\documentation\user-manual.md with uri: /documentation/user-manual.md =>
[INFO] processing F:\hudson\hudson-slave\workspace\ActiveMQ-Apollo\trunk\apollo-website\src\documentation\verification.md with uri: /documentation/verification.md =>
[INFO] processing F:\hudson\hudson-slave\workspace\ActiveMQ-Apollo\trunk\apollo-website\src\download.page with uri: /download.page =>
[INFO] processing F:\hudson\hudson-slave\workspace\ActiveMQ-Apollo\trunk\apollo-website\src\index.page with uri: /index.page =>
[INFO] processing F:\hudson\hudson-slave\workspace\ActiveMQ-Apollo\trunk\apollo-website\src\privacy-policy.page with uri: /privacy-policy.page =>
[INFO] processing F:\hudson\hudson-slave\workspace\ActiveMQ-Apollo\trunk\apollo-website\src\versions\index.page with uri: /versions/index.page =>
[INFO] [INFO] Installing F:\hudson\hudson-slave\workspace\ActiveMQ-Apollo\trunk\apollo-website\pom.xml to C:\Users\hudson\.m2\repository\org\apache\activemq\apollo-website\1.0-SNAPSHOT\apollo-website-1.0-SNAPSHOT.pom
[INFO] --- maven-install-plugin:2.3.1:install (default-install) @ apollo-website ---
[JENKINS] Archiving disabled - not archiving F:\hudson\hudson-slave\workspace\ActiveMQ-Apollo\trunk\apollo-website\pom.xml
[INFO]
[INFO] ------------------------------------------------------------------------
[INFO] Skipping apache-apollo
[INFO] This project has been banned from the build due to previous failures.
[INFO] ------------------------------------------------------------------------
[INFO]
[INFO] ------------------------------------------------------------------------
[INFO] Building apollo-karaf-feature 1.0-SNAPSHOT
[INFO] ------------------------------------------------------------------------
[INFO]
[INFO] --- maven-clean-plugin:2.4.1:clean (default-clean) @ apollo-karaf-feature ---
[INFO]
[INFO] --- maven-enforcer-plugin:1.0:enforce (default) @ apollo-karaf-feature ---
[INFO]
[INFO] --- maven-remote-resources-plugin:1.1:process (default) @ apollo-karaf-feature ---
[INFO] Using 'UTF-8' encoding to copy filtered resources.
[INFO]
[INFO] --- maven-resources-plugin:2.4.3:resources (filter) @ apollo-karaf-feature ---
[INFO] Copying 1 resource
[INFO] Copying 3 resources
[INFO]
[INFO] --- build-helper-maven-plugin:1.2:attach-artifact (attach-artifacts) @ apollo-karaf-feature ---
[INFO] [INFO] Installing F:\hudson\hudson-slave\workspace\ActiveMQ-Apollo\trunk\apollo-karaf-feature\pom.xml to C:\Users\hudson\.m2\repository\org\apache\activemq\apollo-karaf-feature\1.0-SNAPSHOT\apollo-karaf-feature-1.0-SNAPSHOT.pom
[INFO] --- maven-install-plugin:2.3.1:install (default-install) @ apollo-karaf-feature ---
[INFO] Installing F:\hudson\hudson-slave\workspace\ActiveMQ-Apollo\trunk\apollo-karaf-feature\target\classes\features.xml to C:\Users\hudson\.m2\repository\org\apache\activemq\apollo-karaf-feature\1.0-SNAPSHOT\apollo-karaf-feature-1.0-SNAPSHOT-features.xml
[JENKINS] Archiving disabled - not archiving F:\hudson\hudson-slave\workspace\ActiveMQ-Apollo\trunk\apollo-karaf-feature\pom.xml
[JENKINS] Archiving disabled - not archiving F:\hudson\hudson-slave\workspace\ActiveMQ-Apollo\trunk\apollo-karaf-feature\target\classes\features.xml
[INFO] ------------------------------------------------------------------------
[INFO] Reactor Summary:
[INFO]
[INFO] Apache ActiveMQ Apollo Project .................... SUCCESS [19.465s]
[INFO] apollo-boot ....................................... SUCCESS [6.878s]
[INFO] apollo-scala ...................................... SUCCESS [8.970s]
[INFO] apollo-util ....................................... SUCCESS [2:11.558s]
[INFO] apollo-transport .................................. SUCCESS [8.546s]
[INFO] apollo-dto ........................................ SUCCESS [22.441s]
[INFO] apollo-selector ................................... SUCCESS [10.057s]
[INFO] apollo-broker ..................................... SUCCESS [1:25.573s]
[INFO] apollo-tcp ........................................ SUCCESS [1.573s]
[INFO] apollo-web ........................................ SUCCESS [1:04.833s]
[INFO] apollo-leveldb .................................... FAILURE [15.982s]
[INFO] apollo-bdb ........................................ SUCCESS [44.685s]
[INFO] apollo-jdbm2 ...................................... SUCCESS [40.046s]
[INFO] apollo-stomp ...................................... SUCCESS [1:27.317s]
[INFO] apollo-cli ........................................ SKIPPED
[INFO] apollo-website .................................... SUCCESS [1:00.862s]
[INFO] apache-apollo ..................................... SKIPPED
[INFO] apollo-karaf-feature .............................. SUCCESS [0.412s]
[INFO] ------------------------------------------------------------------------
[INFO] BUILD FAILURE
[INFO] ------------------------------------------------------------------------
[INFO] Total time: 10:12.274s
[INFO] Finished at: Tue Nov 29 16:14:04 GMT 2011
[INFO] Final Memory: 298M/1286M
[INFO] ------------------------------------------------------------------------
mavenExecutionResult exceptions not empty
message : Failed to execute goal on project apollo-leveldb: Could not resolve dependencies for project org.apache.activemq:apollo-leveldb:jar:1.0-SNAPSHOT: The following artifacts could not be resolved: org.iq80.leveldb:leveldb-api:jar:0.1-SNAPSHOT, org.iq80.leveldb:leveldb:jar:0.1-SNAPSHOT: Could not find artifact org.iq80.leveldb:leveldb-api:jar:0.1-SNAPSHOT in Nexus (http://repository.apache.org/snapshots)
cause : Could not resolve dependencies for project org.apache.activemq:apollo-leveldb:jar:1.0-SNAPSHOT: The following artifacts could not be resolved: org.iq80.leveldb:leveldb-api:jar:0.1-SNAPSHOT, org.iq80.leveldb:leveldb:jar:0.1-SNAPSHOT: Could not find artifact org.iq80.leveldb:leveldb-api:jar:0.1-SNAPSHOT in Nexus (http://repository.apache.org/snapshots)
Stack trace :
org.apache.maven.lifecycle.LifecycleExecutionException: Failed to execute goal on project apollo-leveldb: Could not resolve dependencies for project org.apache.activemq:apollo-leveldb:jar:1.0-SNAPSHOT: The following artifacts could not be resolved: org.iq80.leveldb:leveldb-api:jar:0.1-SNAPSHOT, org.iq80.leveldb:leveldb:jar:0.1-SNAPSHOT: Could not find artifact org.iq80.leveldb:leveldb-api:jar:0.1-SNAPSHOT in Nexus (http://repository.apache.org/snapshots)
at org.apache.maven.lifecycle.internal.LifecycleDependencyResolver.getDependencies(LifecycleDependencyResolver.java:190)
at org.apache.maven.lifecycle.internal.LifecycleDependencyResolver.resolveProjectDependencies(LifecycleDependencyResolver.java:104)
at org.apache.maven.lifecycle.internal.MojoExecutor.ensureDependenciesAreResolved(MojoExecutor.java:258)
at org.apache.maven.lifecycle.internal.MojoExecutor.execute(MojoExecutor.java:201)
at org.apache.maven.lifecycle.internal.MojoExecutor.execute(MojoExecutor.java:153)
at org.apache.maven.lifecycle.internal.MojoExecutor.execute(MojoExecutor.java:145)
at org.apache.maven.lifecycle.internal.LifecycleModuleBuilder.buildProject(LifecycleModuleBuilder.java:84)
at org.apache.maven.lifecycle.internal.LifecycleModuleBuilder.buildProject(LifecycleModuleBuilder.java:59)
at org.apache.maven.lifecycle.internal.LifecycleStarter.singleThreadedBuild(LifecycleStarter.java:183)
at org.apache.maven.lifecycle.internal.LifecycleStarter.execute(LifecycleStarter.java:161)
at org.apache.maven.DefaultMaven.doExecute(DefaultMaven.java:319)
at org.apache.maven.DefaultMaven.execute(DefaultMaven.java:156)
at org.jvnet.hudson.maven3.launcher.Maven3Launcher.main(Maven3Launcher.java:79)
at sun.reflect.NativeMethodAccessorImpl.invoke0(Native Method)
at sun.reflect.NativeMethodAccessorImpl.invoke(NativeMethodAccessorImpl.java:39)
at sun.reflect.DelegatingMethodAccessorImpl.invoke(DelegatingMethodAccessorImpl.java:25)
at java.lang.reflect.Method.invoke(Method.java:597)
at org.codehaus.plexus.classworlds.launcher.Launcher.launchStandard(Launcher.java:329)
at org.codehaus.plexus.classworlds.launcher.Launcher.launch(Launcher.java:239)
at org.jvnet.hudson.maven3.agent.Maven3Main.launch(Maven3Main.java:158)
at hudson.maven.Maven3Builder.call(Maven3Builder.java:122)
at hudson.maven.Maven3Builder.call(Maven3Builder.java:74)
at hudson.remoting.UserRequest.perform(UserRequest.java:118)
at hudson.remoting.UserRequest.perform(UserRequest.java:48)
at hudson.remoting.Request$2.run(Request.java:287)
at java.util.concurrent.Executors$RunnableAdapter.call(Executors.java:441)
at java.util.concurrent.FutureTask$Sync.innerRun(FutureTask.java:303)
at java.util.concurrent.FutureTask.run(FutureTask.java:138)
at java.util.concurrent.ThreadPoolExecutor$Worker.runTask(ThreadPoolExecutor.java:886)
at java.util.concurrent.ThreadPoolExecutor$Worker.run(ThreadPoolExecutor.java:908)
at java.lang.Thread.run(Thread.java:662)
Caused by: org.apache.maven.project.DependencyResolutionException: Could not resolve dependencies for project org.apache.activemq:apollo-leveldb:jar:1.0-SNAPSHOT: The following artifacts could not be resolved: org.iq80.leveldb:leveldb-api:jar:0.1-SNAPSHOT, org.iq80.leveldb:leveldb:jar:0.1-SNAPSHOT: Could not find artifact org.iq80.leveldb:leveldb-api:jar:0.1-SNAPSHOT in Nexus (http://repository.apache.org/snapshots)
at org.apache.maven.project.DefaultProjectDependenciesResolver.resolve(DefaultProjectDependenciesResolver.java:156)
at org.apache.maven.lifecycle.internal.LifecycleDependencyResolver.getDependencies(LifecycleDependencyResolver.java:165)
... 30 more
Caused by: org.sonatype.aether.resolution.ArtifactResolutionException: The following artifacts could not be resolved: org.iq80.leveldb:leveldb-api:jar:0.1-SNAPSHOT, org.iq80.leveldb:leveldb:jar:0.1-SNAPSHOT: Could not find artifact org.iq80.leveldb:leveldb-api:jar:0.1-SNAPSHOT in Nexus (http://repository.apache.org/snapshots)
at org.sonatype.aether.impl.internal.DefaultArtifactResolver.resolveArtifacts(DefaultArtifactResolver.java:526)
at org.sonatype.aether.impl.internal.DefaultRepositorySystem.resolveArtifacts(DefaultRepositorySystem.java:304)
at org.sonatype.aether.impl.internal.DefaultRepositorySystem.resolveDependencies(DefaultRepositorySystem.java:334)
at org.apache.maven.project.DefaultProjectDependenciesResolver.resolve(DefaultProjectDependenciesResolver.java:150)
... 31 more
Caused by: org.sonatype.aether.transfer.ArtifactNotFoundException: Could not find artifact org.iq80.leveldb:leveldb-api:jar:0.1-SNAPSHOT in Nexus (http://repository.apache.org/snapshots)
at org.sonatype.aether.connector.wagon.WagonRepositoryConnector$4.wrap(WagonRepositoryConnector.java:945)
at org.sonatype.aether.connector.wagon.WagonRepositoryConnector$4.wrap(WagonRepositoryConnector.java:940)
at org.sonatype.aether.connector.wagon.WagonRepositoryConnector$GetTask.flush(WagonRepositoryConnector.java:696)
at org.sonatype.aether.connector.wagon.WagonRepositoryConnector$GetTask.flush(WagonRepositoryConnector.java:690)
at org.sonatype.aether.connector.wagon.WagonRepositoryConnector.get(WagonRepositoryConnector.java:435)
at org.sonatype.aether.impl.internal.DefaultArtifactResolver.resolveArtifacts(DefaultArtifactResolver.java:438)
... 34 more
Maven failed with error.
Sending e-mails to: commits@activemq.apache.org
Sending e-mails to: commits@activemq.apache.org
channel stopped
Build failed in Jenkins: ActiveMQ-Apollo #459
Posted by Apache Jenkins Server <je...@builds.apache.org>.
See <https://builds.apache.org/job/ActiveMQ-Apollo/459/changes>
Changes:
[chirino] Fixes APLO-91 : NPE occurs when a subscription is added to a queue which is in the process of starting up.
------------------------------------------
[...truncated 3319 lines...]
[INFO]
[INFO] --- maven-jar-plugin:2.3.1:test-jar (default) @ apollo-stomp ---
[INFO] Building jar: F:\hudson\hudson-slave\workspace\ActiveMQ-Apollo\trunk\apollo-stomp\target\apollo-stomp-1.0-SNAPSHOT-tests.jar
[INFO] Installing F:\hudson\hudson-slave\workspace\ActiveMQ-Apollo\trunk\apollo-stomp\target\apollo-stomp-1.0-SNAPSHOT.jar to C:\Users\hudson\.m2\repository\org\apache\activemq\apollo-stomp\1.0-SNAPSHOT\apollo-stomp-1.0-SNAPSHOT.jar
[INFO]
[INFO] --- maven-install-plugin:2.3.1:install (default-install) @ apollo-stomp ---
[INFO] Installing F:\hudson\hudson-slave\workspace\ActiveMQ-Apollo\trunk\apollo-stomp\pom.xml to C:\Users\hudson\.m2\repository\org\apache\activemq\apollo-stomp\1.0-SNAPSHOT\apollo-stomp-1.0-SNAPSHOT.pom
[INFO] Installing F:\hudson\hudson-slave\workspace\ActiveMQ-Apollo\trunk\apollo-stomp\target\apollo-stomp-1.0-SNAPSHOT-tests.jar to C:\Users\hudson\.m2\repository\org\apache\activemq\apollo-stomp\1.0-SNAPSHOT\apollo-stomp-1.0-SNAPSHOT-tests.jar
[JENKINS] Archiving disabled - not archiving F:\hudson\hudson-slave\workspace\ActiveMQ-Apollo\trunk\apollo-stomp\pom.xml
[JENKINS] Archiving disabled - not archiving F:\hudson\hudson-slave\workspace\ActiveMQ-Apollo\trunk\apollo-stomp\target\apollo-stomp-1.0-SNAPSHOT.jar
[JENKINS] Archiving disabled - not archiving F:\hudson\hudson-slave\workspace\ActiveMQ-Apollo\trunk\apollo-stomp\target\apollo-stomp-1.0-SNAPSHOT-tests.jar
[INFO]
[INFO] ------------------------------------------------------------------------
[INFO] Skipping apollo-cli
[INFO] This project has been banned from the build due to previous failures.
[INFO] ------------------------------------------------------------------------
[INFO]
[INFO] ------------------------------------------------------------------------
[INFO] Building apollo-website 1.0-SNAPSHOT
[INFO] ------------------------------------------------------------------------
[INFO]
[INFO] --- maven-clean-plugin:2.4.1:clean (default-clean) @ apollo-website ---
[INFO]
[INFO] --- maven-enforcer-plugin:1.0:enforce (default) @ apollo-website ---
[INFO]
[INFO] --- maven-antrun-plugin:1.6:run (default) @ apollo-website ---
[WARNING] Parameter tasks is deprecated, use target instead
[INFO] Executing tasks
main:
[mkdir] Created dir: F:\hudson\hudson-slave\workspace\ActiveMQ-Apollo\trunk\apollo-website\target\sitegen\documentation\schema
[schemagen] Generating schema from 64 source files
Note: Writing F:\hudson\hudson-slave\workspace\ActiveMQ-Apollo\trunk\apollo-website\target\sitegen\documentation\schema\apollo.xsd
[INFO] Executed tasks
[INFO]
[INFO] --- maven-remote-resources-plugin:1.1:process (default) @ apollo-website ---
[INFO] Checking for multiple versions of scala
[INFO]
[INFO] --- maven-scala-plugin:2.15.2:compile (default) @ apollo-website ---
[INFO] includes = [**/*.scala,**/*.java,]
[INFO] excludes = []
[INFO] F:\hudson\hudson-slave\workspace\ActiveMQ-Apollo\trunk\apollo-website\ext:-1: info: compiling
[INFO] Compiling 3 source files to F:\hudson\hudson-slave\workspace\ActiveMQ-Apollo\trunk\apollo-website\target\classes at 1322512221263
[INFO] compiler plugin: BasicArtifact(org.scala-lang.plugins,continuations,2.9.1)
[INFO] compiler plugin: BasicArtifact(org.fusesource.jvmassert,jvmassert,1.2)
[INFO] prepare-compile in 0 s
[INFO] compile in 32 s
[INFO] Checking for multiple versions of scala
[INFO]
[INFO] --- maven-scala-plugin:2.15.2:testCompile (default) @ apollo-website ---
[INFO] includes = [**/*.scala,**/*.java,]
[INFO] excludes = []
[WARNING] No source files found.
[INFO]
[INFO] --- maven-enforcer-plugin:1.0:enforce (default) @ apollo-website ---
[JENKINS] Archiving disabled - not archiving F:\hudson\hudson-slave\workspace\ActiveMQ-Apollo\trunk\apollo-website\pom.xml
ignoring exception during new ExecutedMojo null
[INFO]
[INFO] --- maven-source-plugin:2.1.2:jar (attach-sources) @ apollo-website ---
[INFO]
[INFO] --- maven-enforcer-plugin:1.0:enforce (default) @ apollo-website ---
[INFO] [WARNING] Parameter tasks is deprecated, use target instead
[INFO] --- maven-antrun-plugin:1.6:run (default) @ apollo-website ---
[INFO] Executing tasks
main:
[schemagen] Generating schema from 64 source files
Note: Writing F:\hudson\hudson-slave\workspace\ActiveMQ-Apollo\trunk\apollo-website\target\sitegen\documentation\schema\apollo.xsd
[INFO] Executed tasks
[INFO]
[INFO] --- maven-remote-resources-plugin:1.1:process (default) @ apollo-website ---
[INFO]
[INFO] --- maven-scala-plugin:2.15.2:compile (default) @ apollo-website ---
[INFO] Checking for multiple versions of scala
[INFO] includes = [**/*.scala,**/*.java,]
[INFO] excludes = []
[INFO] Nothing to compile - all classes are up to date
[INFO]
[INFO] --- maven-scala-plugin:2.15.2:testCompile (default) @ apollo-website ---
[INFO] Checking for multiple versions of scala
[INFO] includes = [**/*.scala,**/*.java,]
[INFO] excludes = []
[WARNING] No source files found.
[INFO]
[INFO] --- maven-enforcer-plugin:1.0:enforce (default) @ apollo-website ---
[JENKINS] Archiving disabled - not archiving F:\hudson\hudson-slave\workspace\ActiveMQ-Apollo\trunk\apollo-website\pom.xml
ignoring exception during new ExecutedMojo null
[INFO]
[INFO] --- maven-source-plugin:2.1.2:jar (attach-sources) @ apollo-website ---
[JENKINS] Archiving disabled - not archiving F:\hudson\hudson-slave\workspace\ActiveMQ-Apollo\trunk\apollo-website\pom.xml
ignoring exception during new ExecutedMojo null
[INFO]
[INFO] --- maven-scalate-plugin:1.5.3:sitegen (sitegen) @ apollo-website ---
Processing Configuration for child elements
Processing child [project]
Processing child [workingDirectory]
Processing child [webappDirectory]
Processing child [targetDirectory]
Processing child [testClassPathElements]
[INFO] Generating static website from Scalate Templates and wiki files...
[INFO] template properties: null
Using dir: F:\hudson\hudson-slave\workspace\ActiveMQ-Apollo\trunk\apollo-website\src\blog at request path: /blog
[INFO] processing F:\hudson\hudson-slave\workspace\ActiveMQ-Apollo\trunk\apollo-website\src\blog\index.page with uri: /blog/index.page =>
Using dir: F:\hudson\hudson-slave\workspace\ActiveMQ-Apollo\trunk\apollo-website\src\blog at request path: /blog
[INFO] processing F:\hudson\hudson-slave\workspace\ActiveMQ-Apollo\trunk\apollo-website\src\blog\index.rss.feed with uri: /blog/index.rss.feed =>
[INFO] processing F:\hudson\hudson-slave\workspace\ActiveMQ-Apollo\trunk\apollo-website\src\blog\releases\release-1-0-beta1.page with uri: /blog/releases/release-1-0-beta1.page =>
[INFO] processing F:\hudson\hudson-slave\workspace\ActiveMQ-Apollo\trunk\apollo-website\src\blog\releases\release-1-0-beta2.page with uri: /blog/releases/release-1-0-beta2.page =>
[INFO] processing F:\hudson\hudson-slave\workspace\ActiveMQ-Apollo\trunk\apollo-website\src\blog\releases\release-1-0-beta3.page with uri: /blog/releases/release-1-0-beta3.page =>
[INFO] processing F:\hudson\hudson-slave\workspace\ActiveMQ-Apollo\trunk\apollo-website\src\blog\releases\release-1-0-beta4.page with uri: /blog/releases/release-1-0-beta4.page =>
[INFO] processing F:\hudson\hudson-slave\workspace\ActiveMQ-Apollo\trunk\apollo-website\src\blog\releases\release-1-0-beta5.page with uri: /blog/releases/release-1-0-beta5.page =>
[INFO] processing F:\hudson\hudson-slave\workspace\ActiveMQ-Apollo\trunk\apollo-website\src\community\building.page with uri: /community/building.page =>
[INFO] processing F:\hudson\hudson-slave\workspace\ActiveMQ-Apollo\trunk\apollo-website\src\community\contributing.page with uri: /community/contributing.page =>
[INFO] processing F:\hudson\hudson-slave\workspace\ActiveMQ-Apollo\trunk\apollo-website\src\community\developers.page with uri: /community/developers.page =>
[INFO] processing F:\hudson\hudson-slave\workspace\ActiveMQ-Apollo\trunk\apollo-website\src\community\faq.page with uri: /community/faq.page =>
[INFO] processing F:\hudson\hudson-slave\workspace\ActiveMQ-Apollo\trunk\apollo-website\src\community\index.page with uri: /community/index.page =>
[INFO] processing F:\hudson\hudson-slave\workspace\ActiveMQ-Apollo\trunk\apollo-website\src\community\release-guide.page with uri: /community/release-guide.page =>
[INFO] processing F:\hudson\hudson-slave\workspace\ActiveMQ-Apollo\trunk\apollo-website\src\community\site.page with uri: /community/site.page =>
[INFO] processing F:\hudson\hudson-slave\workspace\ActiveMQ-Apollo\trunk\apollo-website\src\community\source.page with uri: /community/source.page =>
[INFO] processing F:\hudson\hudson-slave\workspace\ActiveMQ-Apollo\trunk\apollo-website\src\community\support.page with uri: /community/support.page =>
[INFO] processing F:\hudson\hudson-slave\workspace\ActiveMQ-Apollo\trunk\apollo-website\src\documentation\architecture.md with uri: /documentation/architecture.md =>
[INFO] processing F:\hudson\hudson-slave\workspace\ActiveMQ-Apollo\trunk\apollo-website\src\documentation\extending-guide.md with uri: /documentation/extending-guide.md =>
[INFO] processing F:\hudson\hudson-slave\workspace\ActiveMQ-Apollo\trunk\apollo-website\src\documentation\getting-started.md with uri: /documentation/getting-started.md =>
[INFO] processing F:\hudson\hudson-slave\workspace\ActiveMQ-Apollo\trunk\apollo-website\src\documentation\index.page with uri: /documentation/index.page =>
[INFO] processing F:\hudson\hudson-slave\workspace\ActiveMQ-Apollo\trunk\apollo-website\src\documentation\management-api.md with uri: /documentation/management-api.md =>
[INFO] processing F:\hudson\hudson-slave\workspace\ActiveMQ-Apollo\trunk\apollo-website\src\documentation\module-organization.page with uri: /documentation/module-organization.page =>
[INFO] processing F:\hudson\hudson-slave\workspace\ActiveMQ-Apollo\trunk\apollo-website\src\documentation\performance-scaling.md with uri: /documentation/performance-scaling.md =>
[INFO] processing F:\hudson\hudson-slave\workspace\ActiveMQ-Apollo\trunk\apollo-website\src\documentation\user-manual.md with uri: /documentation/user-manual.md =>
[INFO] processing F:\hudson\hudson-slave\workspace\ActiveMQ-Apollo\trunk\apollo-website\src\documentation\verification.md with uri: /documentation/verification.md =>
[INFO] processing F:\hudson\hudson-slave\workspace\ActiveMQ-Apollo\trunk\apollo-website\src\download.page with uri: /download.page =>
[INFO] processing F:\hudson\hudson-slave\workspace\ActiveMQ-Apollo\trunk\apollo-website\src\index.page with uri: /index.page =>
[INFO] processing F:\hudson\hudson-slave\workspace\ActiveMQ-Apollo\trunk\apollo-website\src\privacy-policy.page with uri: /privacy-policy.page =>
[INFO] processing F:\hudson\hudson-slave\workspace\ActiveMQ-Apollo\trunk\apollo-website\src\versions\index.page with uri: /versions/index.page =>
[INFO]
[INFO] --- maven-install-plugin:2.3.1:install (default-install) @ apollo-website ---
[INFO] Installing F:\hudson\hudson-slave\workspace\ActiveMQ-Apollo\trunk\apollo-website\pom.xml to C:\Users\hudson\.m2\repository\org\apache\activemq\apollo-website\1.0-SNAPSHOT\apollo-website-1.0-SNAPSHOT.pom
[JENKINS] Archiving disabled - not archiving F:\hudson\hudson-slave\workspace\ActiveMQ-Apollo\trunk\apollo-website\pom.xml
[INFO]
[INFO] ------------------------------------------------------------------------
[INFO] Skipping apache-apollo
[INFO] This project has been banned from the build due to previous failures.
[INFO] ------------------------------------------------------------------------
[INFO]
[INFO] ------------------------------------------------------------------------
[INFO] Building apollo-karaf-feature 1.0-SNAPSHOT
[INFO] ------------------------------------------------------------------------
[INFO]
[INFO] --- maven-clean-plugin:2.4.1:clean (default-clean) @ apollo-karaf-feature ---
[INFO]
[INFO] --- maven-enforcer-plugin:1.0:enforce (default) @ apollo-karaf-feature ---
[INFO]
[INFO] --- maven-remote-resources-plugin:1.1:process (default) @ apollo-karaf-feature ---
[INFO]
[INFO] --- maven-resources-plugin:2.4.3:resources (filter) @ apollo-karaf-feature ---
[INFO] Using 'UTF-8' encoding to copy filtered resources.
[INFO] Copying 1 resource
[INFO] Copying 3 resources
[INFO]
[INFO] --- build-helper-maven-plugin:1.2:attach-artifact (attach-artifacts) @ apollo-karaf-feature ---
[INFO] [INFO] Installing F:\hudson\hudson-slave\workspace\ActiveMQ-Apollo\trunk\apollo-karaf-feature\pom.xml to C:\Users\hudson\.m2\repository\org\apache\activemq\apollo-karaf-feature\1.0-SNAPSHOT\apollo-karaf-feature-1.0-SNAPSHOT.pom
[INFO] --- maven-install-plugin:2.3.1:install (default-install) @ apollo-karaf-feature ---
[INFO] Installing F:\hudson\hudson-slave\workspace\ActiveMQ-Apollo\trunk\apollo-karaf-feature\target\classes\features.xml to C:\Users\hudson\.m2\repository\org\apache\activemq\apollo-karaf-feature\1.0-SNAPSHOT\apollo-karaf-feature-1.0-SNAPSHOT-features.xml
[JENKINS] Archiving disabled - not archiving F:\hudson\hudson-slave\workspace\ActiveMQ-Apollo\trunk\apollo-karaf-feature\pom.xml
[JENKINS] Archiving disabled - not archiving F:\hudson\hudson-slave\workspace\ActiveMQ-Apollo\trunk\apollo-karaf-feature\target\classes\features.xml
[INFO] ------------------------------------------------------------------------
[INFO] Reactor Summary:
[INFO]
[INFO] Apache ActiveMQ Apollo Project .................... SUCCESS [12.672s]
[INFO] apollo-boot ....................................... SUCCESS [8.038s]
[INFO] apollo-scala ...................................... SUCCESS [5.392s]
[INFO] apollo-util ....................................... SUCCESS [1:12.826s]
[INFO] apollo-transport .................................. SUCCESS [3.152s]
[INFO] apollo-dto ........................................ SUCCESS [21.232s]
[INFO] apollo-selector ................................... SUCCESS [6.151s]
[INFO] apollo-broker ..................................... SUCCESS [1:38.143s]
[INFO] apollo-tcp ........................................ SUCCESS [2.543s]
[INFO] apollo-web ........................................ SUCCESS [2:13.048s]
[INFO] apollo-leveldb .................................... FAILURE [12.409s]
[INFO] apollo-bdb ........................................ SUCCESS [1:11.143s]
[INFO] apollo-jdbm2 ...................................... SUCCESS [59.361s]
[INFO] apollo-stomp ...................................... SUCCESS [2:04.700s]
[INFO] apollo-cli ........................................ SKIPPED
[INFO] apollo-website .................................... SUCCESS [6:20.004s]
[INFO] apache-apollo ..................................... SKIPPED
[INFO] apollo-karaf-feature .............................. SUCCESS [10.136s]
[INFO] ------------------------------------------------------------------------
[INFO] BUILD FAILURE
[INFO] ------------------------------------------------------------------------
[INFO] Total time: 17:05.884s
[INFO] Finished at: Mon Nov 28 20:36:05 GMT 2011
[INFO] Final Memory: 301M/1239M
[INFO] ------------------------------------------------------------------------
mavenExecutionResult exceptions not empty
message : Failed to execute goal on project apollo-leveldb: Could not resolve dependencies for project org.apache.activemq:apollo-leveldb:jar:1.0-SNAPSHOT: The following artifacts could not be resolved: org.iq80.leveldb:leveldb-api:jar:0.1-SNAPSHOT, org.iq80.leveldb:leveldb:jar:0.1-SNAPSHOT: Could not find artifact org.iq80.leveldb:leveldb-api:jar:0.1-SNAPSHOT in Nexus (http://repository.apache.org/snapshots)
cause : Could not resolve dependencies for project org.apache.activemq:apollo-leveldb:jar:1.0-SNAPSHOT: The following artifacts could not be resolved: org.iq80.leveldb:leveldb-api:jar:0.1-SNAPSHOT, org.iq80.leveldb:leveldb:jar:0.1-SNAPSHOT: Could not find artifact org.iq80.leveldb:leveldb-api:jar:0.1-SNAPSHOT in Nexus (http://repository.apache.org/snapshots)
Stack trace :
org.apache.maven.lifecycle.LifecycleExecutionException: Failed to execute goal on project apollo-leveldb: Could not resolve dependencies for project org.apache.activemq:apollo-leveldb:jar:1.0-SNAPSHOT: The following artifacts could not be resolved: org.iq80.leveldb:leveldb-api:jar:0.1-SNAPSHOT, org.iq80.leveldb:leveldb:jar:0.1-SNAPSHOT: Could not find artifact org.iq80.leveldb:leveldb-api:jar:0.1-SNAPSHOT in Nexus (http://repository.apache.org/snapshots)
at org.apache.maven.lifecycle.internal.LifecycleDependencyResolver.getDependencies(LifecycleDependencyResolver.java:190)
at org.apache.maven.lifecycle.internal.LifecycleDependencyResolver.resolveProjectDependencies(LifecycleDependencyResolver.java:104)
at org.apache.maven.lifecycle.internal.MojoExecutor.ensureDependenciesAreResolved(MojoExecutor.java:258)
at org.apache.maven.lifecycle.internal.MojoExecutor.execute(MojoExecutor.java:201)
at org.apache.maven.lifecycle.internal.MojoExecutor.execute(MojoExecutor.java:153)
at org.apache.maven.lifecycle.internal.MojoExecutor.execute(MojoExecutor.java:145)
at org.apache.maven.lifecycle.internal.LifecycleModuleBuilder.buildProject(LifecycleModuleBuilder.java:84)
at org.apache.maven.lifecycle.internal.LifecycleModuleBuilder.buildProject(LifecycleModuleBuilder.java:59)
at org.apache.maven.lifecycle.internal.LifecycleStarter.singleThreadedBuild(LifecycleStarter.java:183)
at org.apache.maven.lifecycle.internal.LifecycleStarter.execute(LifecycleStarter.java:161)
at org.apache.maven.DefaultMaven.doExecute(DefaultMaven.java:319)
at org.apache.maven.DefaultMaven.execute(DefaultMaven.java:156)
at org.jvnet.hudson.maven3.launcher.Maven3Launcher.main(Maven3Launcher.java:79)
at sun.reflect.NativeMethodAccessorImpl.invoke0(Native Method)
at sun.reflect.NativeMethodAccessorImpl.invoke(NativeMethodAccessorImpl.java:39)
at sun.reflect.DelegatingMethodAccessorImpl.invoke(DelegatingMethodAccessorImpl.java:25)
at java.lang.reflect.Method.invoke(Method.java:597)
at org.codehaus.plexus.classworlds.launcher.Launcher.launchStandard(Launcher.java:329)
at org.codehaus.plexus.classworlds.launcher.Launcher.launch(Launcher.java:239)
at org.jvnet.hudson.maven3.agent.Maven3Main.launch(Maven3Main.java:158)
at hudson.maven.Maven3Builder.call(Maven3Builder.java:122)
at hudson.maven.Maven3Builder.call(Maven3Builder.java:74)
at hudson.remoting.UserRequest.perform(UserRequest.java:118)
at hudson.remoting.UserRequest.perform(UserRequest.java:48)
at hudson.remoting.Request$2.run(Request.java:287)
at java.util.concurrent.Executors$RunnableAdapter.call(Executors.java:441)
at java.util.concurrent.FutureTask$Sync.innerRun(FutureTask.java:303)
at java.util.concurrent.FutureTask.run(FutureTask.java:138)
at java.util.concurrent.ThreadPoolExecutor$Worker.runTask(ThreadPoolExecutor.java:886)
at java.util.concurrent.ThreadPoolExecutor$Worker.run(ThreadPoolExecutor.java:908)
at java.lang.Thread.run(Thread.java:662)
Caused by: org.apache.maven.project.DependencyResolutionException: Could not resolve dependencies for project org.apache.activemq:apollo-leveldb:jar:1.0-SNAPSHOT: The following artifacts could not be resolved: org.iq80.leveldb:leveldb-api:jar:0.1-SNAPSHOT, org.iq80.leveldb:leveldb:jar:0.1-SNAPSHOT: Could not find artifact org.iq80.leveldb:leveldb-api:jar:0.1-SNAPSHOT in Nexus (http://repository.apache.org/snapshots)
at org.apache.maven.project.DefaultProjectDependenciesResolver.resolve(DefaultProjectDependenciesResolver.java:156)
at org.apache.maven.lifecycle.internal.LifecycleDependencyResolver.getDependencies(LifecycleDependencyResolver.java:165)
... 30 more
Caused by: org.sonatype.aether.resolution.ArtifactResolutionException: The following artifacts could not be resolved: org.iq80.leveldb:leveldb-api:jar:0.1-SNAPSHOT, org.iq80.leveldb:leveldb:jar:0.1-SNAPSHOT: Could not find artifact org.iq80.leveldb:leveldb-api:jar:0.1-SNAPSHOT in Nexus (http://repository.apache.org/snapshots)
at org.sonatype.aether.impl.internal.DefaultArtifactResolver.resolveArtifacts(DefaultArtifactResolver.java:526)
at org.sonatype.aether.impl.internal.DefaultRepositorySystem.resolveArtifacts(DefaultRepositorySystem.java:304)
at org.sonatype.aether.impl.internal.DefaultRepositorySystem.resolveDependencies(DefaultRepositorySystem.java:334)
at org.apache.maven.project.DefaultProjectDependenciesResolver.resolve(DefaultProjectDependenciesResolver.java:150)
... 31 more
Caused by: org.sonatype.aether.transfer.ArtifactNotFoundException: Could not find artifact org.iq80.leveldb:leveldb-api:jar:0.1-SNAPSHOT in Nexus (http://repository.apache.org/snapshots)
at org.sonatype.aether.connector.wagon.WagonRepositoryConnector$4.wrap(WagonRepositoryConnector.java:945)
at org.sonatype.aether.connector.wagon.WagonRepositoryConnector$4.wrap(WagonRepositoryConnector.java:940)
at org.sonatype.aether.connector.wagon.WagonRepositoryConnector$GetTask.flush(WagonRepositoryConnector.java:696)
at org.sonatype.aether.connector.wagon.WagonRepositoryConnector$GetTask.flush(WagonRepositoryConnector.java:690)
at org.sonatype.aether.connector.wagon.WagonRepositoryConnector.get(WagonRepositoryConnector.java:435)
at org.sonatype.aether.impl.internal.DefaultArtifactResolver.resolveArtifacts(DefaultArtifactResolver.java:438)
... 34 more
Sending e-mails to: commits@activemq.apache.org
channel stopped
Build failed in Jenkins: ActiveMQ-Apollo #458
Posted by Apache Jenkins Server <je...@builds.apache.org>.
See <https://builds.apache.org/job/ActiveMQ-Apollo/458/changes>
Changes:
[chirino] Fixes APLO-89: Uncaught Exceptions are not being properly logged.
------------------------------------------
[...truncated 3356 lines...]
[INFO]
[INFO] --- maven-jar-plugin:2.3.1:test-jar (default) @ apollo-stomp ---
[INFO] Building jar: F:\hudson\hudson-slave\workspace\ActiveMQ-Apollo\trunk\apollo-stomp\target\apollo-stomp-1.0-SNAPSHOT-tests.jar
[INFO] Installing F:\hudson\hudson-slave\workspace\ActiveMQ-Apollo\trunk\apollo-stomp\target\apollo-stomp-1.0-SNAPSHOT.jar to C:\Users\hudson\.m2\repository\org\apache\activemq\apollo-stomp\1.0-SNAPSHOT\apollo-stomp-1.0-SNAPSHOT.jar
[INFO]
[INFO] --- maven-install-plugin:2.3.1:install (default-install) @ apollo-stomp ---
[INFO] Installing F:\hudson\hudson-slave\workspace\ActiveMQ-Apollo\trunk\apollo-stomp\pom.xml to C:\Users\hudson\.m2\repository\org\apache\activemq\apollo-stomp\1.0-SNAPSHOT\apollo-stomp-1.0-SNAPSHOT.pom
[INFO] Installing F:\hudson\hudson-slave\workspace\ActiveMQ-Apollo\trunk\apollo-stomp\target\apollo-stomp-1.0-SNAPSHOT-tests.jar to C:\Users\hudson\.m2\repository\org\apache\activemq\apollo-stomp\1.0-SNAPSHOT\apollo-stomp-1.0-SNAPSHOT-tests.jar
[JENKINS] Archiving disabled - not archiving F:\hudson\hudson-slave\workspace\ActiveMQ-Apollo\trunk\apollo-stomp\pom.xml
[JENKINS] Archiving disabled - not archiving F:\hudson\hudson-slave\workspace\ActiveMQ-Apollo\trunk\apollo-stomp\target\apollo-stomp-1.0-SNAPSHOT.jar
[JENKINS] Archiving disabled - not archiving F:\hudson\hudson-slave\workspace\ActiveMQ-Apollo\trunk\apollo-stomp\target\apollo-stomp-1.0-SNAPSHOT-tests.jar
[INFO]
[INFO] ------------------------------------------------------------------------
[INFO] Skipping apollo-cli
[INFO] This project has been banned from the build due to previous failures.
[INFO] ------------------------------------------------------------------------
[INFO]
[INFO] ------------------------------------------------------------------------
[INFO] Building apollo-website 1.0-SNAPSHOT
[INFO] ------------------------------------------------------------------------
[INFO]
[INFO] --- maven-clean-plugin:2.4.1:clean (default-clean) @ apollo-website ---
[INFO]
[INFO] --- maven-enforcer-plugin:1.0:enforce (default) @ apollo-website ---
[INFO] [WARNING] Parameter tasks is deprecated, use target instead
[INFO] --- maven-antrun-plugin:1.6:run (default) @ apollo-website ---
[INFO] Executing tasks
main:
[mkdir] Created dir: F:\hudson\hudson-slave\workspace\ActiveMQ-Apollo\trunk\apollo-website\target\sitegen\documentation\schema
[schemagen] Generating schema from 64 source files
Note: Writing F:\hudson\hudson-slave\workspace\ActiveMQ-Apollo\trunk\apollo-website\target\sitegen\documentation\schema\apollo.xsd
[INFO] Executed tasks
[INFO]
[INFO] --- maven-remote-resources-plugin:1.1:process (default) @ apollo-website ---
[INFO]
[INFO] --- maven-scala-plugin:2.15.2:compile (default) @ apollo-website ---
[INFO] Checking for multiple versions of scala
[INFO] includes = [**/*.scala,**/*.java,]
[INFO] excludes = []
[INFO] F:\hudson\hudson-slave\workspace\ActiveMQ-Apollo\trunk\apollo-website\ext:-1: info: compiling
[INFO] Compiling 3 source files to F:\hudson\hudson-slave\workspace\ActiveMQ-Apollo\trunk\apollo-website\target\classes at 1322509426763
[INFO] compiler plugin: BasicArtifact(org.scala-lang.plugins,continuations,2.9.1)
[INFO] compiler plugin: BasicArtifact(org.fusesource.jvmassert,jvmassert,1.2)
[INFO] prepare-compile in 0 s
[INFO] compile in 9 s
[INFO] Checking for multiple versions of scala
[INFO]
[INFO] --- maven-scala-plugin:2.15.2:testCompile (default) @ apollo-website ---
[INFO] includes = [**/*.scala,**/*.java,]
[INFO] excludes = []
[WARNING] No source files found.
[INFO]
[INFO] --- maven-enforcer-plugin:1.0:enforce (default) @ apollo-website ---
[JENKINS] Archiving disabled - not archiving F:\hudson\hudson-slave\workspace\ActiveMQ-Apollo\trunk\apollo-website\pom.xml
ignoring exception during new ExecutedMojo null
[INFO]
[INFO] --- maven-source-plugin:2.1.2:jar (attach-sources) @ apollo-website ---
[INFO]
[INFO] --- maven-enforcer-plugin:1.0:enforce (default) @ apollo-website ---
[INFO] [WARNING] Parameter tasks is deprecated, use target instead
[INFO] Executing tasks
main:
[INFO] --- maven-antrun-plugin:1.6:run (default) @ apollo-website ---
[schemagen] Generating schema from 64 source files
Note: Writing F:\hudson\hudson-slave\workspace\ActiveMQ-Apollo\trunk\apollo-website\target\sitegen\documentation\schema\apollo.xsd
[INFO] Executed tasks
[INFO]
[INFO] --- maven-remote-resources-plugin:1.1:process (default) @ apollo-website ---
[INFO] Checking for multiple versions of scala
[INFO] includes = [**/*.scala,**/*.java,]
[INFO] excludes = []
[INFO] Nothing to compile - all classes are up to date
[INFO]
[INFO] --- maven-scala-plugin:2.15.2:compile (default) @ apollo-website ---
[INFO] Checking for multiple versions of scala
[INFO] includes = [**/*.scala,**/*.java,]
[INFO] excludes = []
[WARNING] No source files found.
[INFO]
[INFO] --- maven-scala-plugin:2.15.2:testCompile (default) @ apollo-website ---
[INFO]
[INFO] --- maven-enforcer-plugin:1.0:enforce (default) @ apollo-website ---
[JENKINS] Archiving disabled - not archiving F:\hudson\hudson-slave\workspace\ActiveMQ-Apollo\trunk\apollo-website\pom.xml
ignoring exception during new ExecutedMojo null
[INFO]
[INFO] --- maven-source-plugin:2.1.2:jar (attach-sources) @ apollo-website ---
[JENKINS] Archiving disabled - not archiving F:\hudson\hudson-slave\workspace\ActiveMQ-Apollo\trunk\apollo-website\pom.xml
ignoring exception during new ExecutedMojo null
[INFO]
[INFO] --- maven-scalate-plugin:1.5.3:sitegen (sitegen) @ apollo-website ---
Processing Configuration for child elements
Processing child [project]
Processing child [workingDirectory]
Processing child [webappDirectory]
Processing child [targetDirectory]
Processing child [testClassPathElements]
[INFO] Generating static website from Scalate Templates and wiki files...
[INFO] template properties: null
Using dir: F:\hudson\hudson-slave\workspace\ActiveMQ-Apollo\trunk\apollo-website\src\blog at request path: /blog
[INFO] processing F:\hudson\hudson-slave\workspace\ActiveMQ-Apollo\trunk\apollo-website\src\blog\index.page with uri: /blog/index.page =>
Using dir: F:\hudson\hudson-slave\workspace\ActiveMQ-Apollo\trunk\apollo-website\src\blog at request path: /blog
[INFO] processing F:\hudson\hudson-slave\workspace\ActiveMQ-Apollo\trunk\apollo-website\src\blog\index.rss.feed with uri: /blog/index.rss.feed =>
[INFO] processing F:\hudson\hudson-slave\workspace\ActiveMQ-Apollo\trunk\apollo-website\src\blog\releases\release-1-0-beta1.page with uri: /blog/releases/release-1-0-beta1.page =>
[INFO] processing F:\hudson\hudson-slave\workspace\ActiveMQ-Apollo\trunk\apollo-website\src\blog\releases\release-1-0-beta2.page with uri: /blog/releases/release-1-0-beta2.page =>
[INFO] processing F:\hudson\hudson-slave\workspace\ActiveMQ-Apollo\trunk\apollo-website\src\blog\releases\release-1-0-beta3.page with uri: /blog/releases/release-1-0-beta3.page =>
[INFO] processing F:\hudson\hudson-slave\workspace\ActiveMQ-Apollo\trunk\apollo-website\src\blog\releases\release-1-0-beta4.page with uri: /blog/releases/release-1-0-beta4.page =>
[INFO] processing F:\hudson\hudson-slave\workspace\ActiveMQ-Apollo\trunk\apollo-website\src\blog\releases\release-1-0-beta5.page with uri: /blog/releases/release-1-0-beta5.page =>
[INFO] processing F:\hudson\hudson-slave\workspace\ActiveMQ-Apollo\trunk\apollo-website\src\community\building.page with uri: /community/building.page =>
[INFO] processing F:\hudson\hudson-slave\workspace\ActiveMQ-Apollo\trunk\apollo-website\src\community\contributing.page with uri: /community/contributing.page =>
[INFO] processing F:\hudson\hudson-slave\workspace\ActiveMQ-Apollo\trunk\apollo-website\src\community\developers.page with uri: /community/developers.page =>
[INFO] processing F:\hudson\hudson-slave\workspace\ActiveMQ-Apollo\trunk\apollo-website\src\community\faq.page with uri: /community/faq.page =>
[INFO] processing F:\hudson\hudson-slave\workspace\ActiveMQ-Apollo\trunk\apollo-website\src\community\index.page with uri: /community/index.page =>
[INFO] processing F:\hudson\hudson-slave\workspace\ActiveMQ-Apollo\trunk\apollo-website\src\community\release-guide.page with uri: /community/release-guide.page =>
[INFO] processing F:\hudson\hudson-slave\workspace\ActiveMQ-Apollo\trunk\apollo-website\src\community\site.page with uri: /community/site.page =>
[INFO] processing F:\hudson\hudson-slave\workspace\ActiveMQ-Apollo\trunk\apollo-website\src\community\source.page with uri: /community/source.page =>
[INFO] processing F:\hudson\hudson-slave\workspace\ActiveMQ-Apollo\trunk\apollo-website\src\community\support.page with uri: /community/support.page =>
[INFO] processing F:\hudson\hudson-slave\workspace\ActiveMQ-Apollo\trunk\apollo-website\src\documentation\architecture.md with uri: /documentation/architecture.md =>
[INFO] processing F:\hudson\hudson-slave\workspace\ActiveMQ-Apollo\trunk\apollo-website\src\documentation\extending-guide.md with uri: /documentation/extending-guide.md =>
[INFO] processing F:\hudson\hudson-slave\workspace\ActiveMQ-Apollo\trunk\apollo-website\src\documentation\getting-started.md with uri: /documentation/getting-started.md =>
[INFO] processing F:\hudson\hudson-slave\workspace\ActiveMQ-Apollo\trunk\apollo-website\src\documentation\index.page with uri: /documentation/index.page =>
[INFO] processing F:\hudson\hudson-slave\workspace\ActiveMQ-Apollo\trunk\apollo-website\src\documentation\management-api.md with uri: /documentation/management-api.md =>
[INFO] processing F:\hudson\hudson-slave\workspace\ActiveMQ-Apollo\trunk\apollo-website\src\documentation\module-organization.page with uri: /documentation/module-organization.page =>
[INFO] processing F:\hudson\hudson-slave\workspace\ActiveMQ-Apollo\trunk\apollo-website\src\documentation\performance-scaling.md with uri: /documentation/performance-scaling.md =>
[INFO] processing F:\hudson\hudson-slave\workspace\ActiveMQ-Apollo\trunk\apollo-website\src\documentation\user-manual.md with uri: /documentation/user-manual.md =>
[INFO] processing F:\hudson\hudson-slave\workspace\ActiveMQ-Apollo\trunk\apollo-website\src\documentation\verification.md with uri: /documentation/verification.md =>
[INFO] processing F:\hudson\hudson-slave\workspace\ActiveMQ-Apollo\trunk\apollo-website\src\download.page with uri: /download.page =>
[INFO] processing F:\hudson\hudson-slave\workspace\ActiveMQ-Apollo\trunk\apollo-website\src\index.page with uri: /index.page =>
[INFO] processing F:\hudson\hudson-slave\workspace\ActiveMQ-Apollo\trunk\apollo-website\src\privacy-policy.page with uri: /privacy-policy.page =>
[INFO] processing F:\hudson\hudson-slave\workspace\ActiveMQ-Apollo\trunk\apollo-website\src\versions\index.page with uri: /versions/index.page =>
[INFO]
[INFO] --- maven-install-plugin:2.3.1:install (default-install) @ apollo-website ---
[INFO] Installing F:\hudson\hudson-slave\workspace\ActiveMQ-Apollo\trunk\apollo-website\pom.xml to C:\Users\hudson\.m2\repository\org\apache\activemq\apollo-website\1.0-SNAPSHOT\apollo-website-1.0-SNAPSHOT.pom
[JENKINS] Archiving disabled - not archiving F:\hudson\hudson-slave\workspace\ActiveMQ-Apollo\trunk\apollo-website\pom.xml
[INFO]
[INFO] ------------------------------------------------------------------------
[INFO] Skipping apache-apollo
[INFO] This project has been banned from the build due to previous failures.
[INFO] ------------------------------------------------------------------------
[INFO]
[INFO] ------------------------------------------------------------------------
[INFO] Building apollo-karaf-feature 1.0-SNAPSHOT
[INFO] ------------------------------------------------------------------------
[INFO]
[INFO] --- maven-clean-plugin:2.4.1:clean (default-clean) @ apollo-karaf-feature ---
[INFO]
[INFO] --- maven-enforcer-plugin:1.0:enforce (default) @ apollo-karaf-feature ---
[INFO]
[INFO] --- maven-remote-resources-plugin:1.1:process (default) @ apollo-karaf-feature ---
[INFO]
[INFO] --- maven-resources-plugin:2.4.3:resources (filter) @ apollo-karaf-feature ---
[INFO] Using 'UTF-8' encoding to copy filtered resources.
[INFO] Copying 1 resource
[INFO] Copying 3 resources
[INFO]
[INFO] --- build-helper-maven-plugin:1.2:attach-artifact (attach-artifacts) @ apollo-karaf-feature ---
[INFO] Installing F:\hudson\hudson-slave\workspace\ActiveMQ-Apollo\trunk\apollo-karaf-feature\pom.xml to C:\Users\hudson\.m2\repository\org\apache\activemq\apollo-karaf-feature\1.0-SNAPSHOT\apollo-karaf-feature-1.0-SNAPSHOT.pom
[INFO]
[INFO] --- maven-install-plugin:2.3.1:install (default-install) @ apollo-karaf-feature ---
[INFO] Installing F:\hudson\hudson-slave\workspace\ActiveMQ-Apollo\trunk\apollo-karaf-feature\target\classes\features.xml to C:\Users\hudson\.m2\repository\org\apache\activemq\apollo-karaf-feature\1.0-SNAPSHOT\apollo-karaf-feature-1.0-SNAPSHOT-features.xml
[JENKINS] Archiving disabled - not archiving F:\hudson\hudson-slave\workspace\ActiveMQ-Apollo\trunk\apollo-karaf-feature\pom.xml
[JENKINS] Archiving disabled - not archiving F:\hudson\hudson-slave\workspace\ActiveMQ-Apollo\trunk\apollo-karaf-feature\target\classes\features.xml
[INFO] ------------------------------------------------------------------------
[INFO] Reactor Summary:
[INFO]
[INFO] Apache ActiveMQ Apollo Project .................... SUCCESS [17.842s]
[INFO] apollo-boot ....................................... SUCCESS [4.351s]
[INFO] apollo-scala ...................................... SUCCESS [5.085s]
[INFO] apollo-util ....................................... SUCCESS [1:39.688s]
[INFO] apollo-transport .................................. SUCCESS [2.672s]
[INFO] apollo-dto ........................................ SUCCESS [31.503s]
[INFO] apollo-selector ................................... SUCCESS [9.485s]
[INFO] apollo-broker ..................................... SUCCESS [1:49.115s]
[INFO] apollo-tcp ........................................ SUCCESS [3.010s]
[INFO] apollo-web ........................................ SUCCESS [1:17.336s]
[INFO] apollo-leveldb .................................... FAILURE [9.297s]
[INFO] apollo-bdb ........................................ SUCCESS [1:01.352s]
[INFO] apollo-jdbm2 ...................................... SUCCESS [1:07.986s]
[INFO] apollo-stomp ...................................... SUCCESS [1:49.453s]
[INFO] apollo-cli ........................................ SKIPPED
[INFO] apollo-website .................................... SUCCESS [2:05.519s]
[INFO] apache-apollo ..................................... SKIPPED
[INFO] apollo-karaf-feature .............................. SUCCESS [1.469s]
[INFO] ------------------------------------------------------------------------
[INFO] BUILD FAILURE
[INFO] ------------------------------------------------------------------------
[INFO] Total time: 12:18.370s
[INFO] Finished at: Mon Nov 28 19:45:08 GMT 2011
[INFO] Final Memory: 300M/1177M
[INFO] ------------------------------------------------------------------------
mavenExecutionResult exceptions not empty
message : Failed to execute goal on project apollo-leveldb: Could not resolve dependencies for project org.apache.activemq:apollo-leveldb:jar:1.0-SNAPSHOT: The following artifacts could not be resolved: org.iq80.leveldb:leveldb-api:jar:0.1-SNAPSHOT, org.iq80.leveldb:leveldb:jar:0.1-SNAPSHOT: Could not find artifact org.iq80.leveldb:leveldb-api:jar:0.1-SNAPSHOT in Nexus (http://repository.apache.org/snapshots)
cause : Could not resolve dependencies for project org.apache.activemq:apollo-leveldb:jar:1.0-SNAPSHOT: The following artifacts could not be resolved: org.iq80.leveldb:leveldb-api:jar:0.1-SNAPSHOT, org.iq80.leveldb:leveldb:jar:0.1-SNAPSHOT: Could not find artifact org.iq80.leveldb:leveldb-api:jar:0.1-SNAPSHOT in Nexus (http://repository.apache.org/snapshots)
Stack trace :
org.apache.maven.lifecycle.LifecycleExecutionException: Failed to execute goal on project apollo-leveldb: Could not resolve dependencies for project org.apache.activemq:apollo-leveldb:jar:1.0-SNAPSHOT: The following artifacts could not be resolved: org.iq80.leveldb:leveldb-api:jar:0.1-SNAPSHOT, org.iq80.leveldb:leveldb:jar:0.1-SNAPSHOT: Could not find artifact org.iq80.leveldb:leveldb-api:jar:0.1-SNAPSHOT in Nexus (http://repository.apache.org/snapshots)
at org.apache.maven.lifecycle.internal.LifecycleDependencyResolver.getDependencies(LifecycleDependencyResolver.java:190)
at org.apache.maven.lifecycle.internal.LifecycleDependencyResolver.resolveProjectDependencies(LifecycleDependencyResolver.java:104)
at org.apache.maven.lifecycle.internal.MojoExecutor.ensureDependenciesAreResolved(MojoExecutor.java:258)
at org.apache.maven.lifecycle.internal.MojoExecutor.execute(MojoExecutor.java:201)
at org.apache.maven.lifecycle.internal.MojoExecutor.execute(MojoExecutor.java:153)
at org.apache.maven.lifecycle.internal.MojoExecutor.execute(MojoExecutor.java:145)
at org.apache.maven.lifecycle.internal.LifecycleModuleBuilder.buildProject(LifecycleModuleBuilder.java:84)
at org.apache.maven.lifecycle.internal.LifecycleModuleBuilder.buildProject(LifecycleModuleBuilder.java:59)
at org.apache.maven.lifecycle.internal.LifecycleStarter.singleThreadedBuild(LifecycleStarter.java:183)
at org.apache.maven.lifecycle.internal.LifecycleStarter.execute(LifecycleStarter.java:161)
at org.apache.maven.DefaultMaven.doExecute(DefaultMaven.java:319)
at org.apache.maven.DefaultMaven.execute(DefaultMaven.java:156)
at org.jvnet.hudson.maven3.launcher.Maven3Launcher.main(Maven3Launcher.java:79)
at sun.reflect.NativeMethodAccessorImpl.invoke0(Native Method)
at sun.reflect.NativeMethodAccessorImpl.invoke(NativeMethodAccessorImpl.java:39)
at sun.reflect.DelegatingMethodAccessorImpl.invoke(DelegatingMethodAccessorImpl.java:25)
at java.lang.reflect.Method.invoke(Method.java:597)
at org.codehaus.plexus.classworlds.launcher.Launcher.launchStandard(Launcher.java:329)
at org.codehaus.plexus.classworlds.launcher.Launcher.launch(Launcher.java:239)
at org.jvnet.hudson.maven3.agent.Maven3Main.launch(Maven3Main.java:158)
at hudson.maven.Maven3Builder.call(Maven3Builder.java:122)
at hudson.maven.Maven3Builder.call(Maven3Builder.java:74)
at hudson.remoting.UserRequest.perform(UserRequest.java:118)
at hudson.remoting.UserRequest.perform(UserRequest.java:48)
at hudson.remoting.Request$2.run(Request.java:287)
at java.util.concurrent.Executors$RunnableAdapter.call(Executors.java:441)
at java.util.concurrent.FutureTask$Sync.innerRun(FutureTask.java:303)
at java.util.concurrent.FutureTask.run(FutureTask.java:138)
at java.util.concurrent.ThreadPoolExecutor$Worker.runTask(ThreadPoolExecutor.java:886)
at java.util.concurrent.ThreadPoolExecutor$Worker.run(ThreadPoolExecutor.java:908)
at java.lang.Thread.run(Thread.java:662)
Caused by: org.apache.maven.project.DependencyResolutionException: Could not resolve dependencies for project org.apache.activemq:apollo-leveldb:jar:1.0-SNAPSHOT: The following artifacts could not be resolved: org.iq80.leveldb:leveldb-api:jar:0.1-SNAPSHOT, org.iq80.leveldb:leveldb:jar:0.1-SNAPSHOT: Could not find artifact org.iq80.leveldb:leveldb-api:jar:0.1-SNAPSHOT in Nexus (http://repository.apache.org/snapshots)
at org.apache.maven.project.DefaultProjectDependenciesResolver.resolve(DefaultProjectDependenciesResolver.java:156)
at org.apache.maven.lifecycle.internal.LifecycleDependencyResolver.getDependencies(LifecycleDependencyResolver.java:165)
... 30 more
Caused by: org.sonatype.aether.resolution.ArtifactResolutionException: The following artifacts could not be resolved: org.iq80.leveldb:leveldb-api:jar:0.1-SNAPSHOT, org.iq80.leveldb:leveldb:jar:0.1-SNAPSHOT: Could not find artifact org.iq80.leveldb:leveldb-api:jar:0.1-SNAPSHOT in Nexus (http://repository.apache.org/snapshots)
at org.sonatype.aether.impl.internal.DefaultArtifactResolver.resolveArtifacts(DefaultArtifactResolver.java:526)
at org.sonatype.aether.impl.internal.DefaultRepositorySystem.resolveArtifacts(DefaultRepositorySystem.java:304)
at org.sonatype.aether.impl.internal.DefaultRepositorySystem.resolveDependencies(DefaultRepositorySystem.java:334)
at org.apache.maven.project.DefaultProjectDependenciesResolver.resolve(DefaultProjectDependenciesResolver.java:150)
... 31 more
Caused by: org.sonatype.aether.transfer.ArtifactNotFoundException: Could not find artifact org.iq80.leveldb:leveldb-api:jar:0.1-SNAPSHOT in Nexus (http://repository.apache.org/snapshots)
at org.sonatype.aether.connector.wagon.WagonRepositoryConnector$4.wrap(WagonRepositoryConnector.java:945)
at org.sonatype.aether.connector.wagon.WagonRepositoryConnector$4.wrap(WagonRepositoryConnector.java:940)
at org.sonatype.aether.connector.wagon.WagonRepositoryConnector$GetTask.flush(WagonRepositoryConnector.java:696)
at org.sonatype.aether.connector.wagon.WagonRepositoryConnector$GetTask.flush(WagonRepositoryConnector.java:690)
at org.sonatype.aether.connector.wagon.WagonRepositoryConnector.get(WagonRepositoryConnector.java:435)
at org.sonatype.aether.impl.internal.DefaultArtifactResolver.resolveArtifacts(DefaultArtifactResolver.java:438)
... 34 more
Sending e-mails to: commits@activemq.apache.org
channel stopped
Build failed in Jenkins: ActiveMQ-Apollo #457
Posted by Apache Jenkins Server <je...@builds.apache.org>.
See <https://builds.apache.org/job/ActiveMQ-Apollo/457/changes>
Changes:
[chirino] Optimize header decoding a bit and log connection errors at info level.
[chirino] Update CLI module to test against leveldb
[chirino] Stub out the XA bits in open wire.
------------------------------------------
[...truncated 3489 lines...]
[INFO] ------------------------------------------------------------------------
[INFO] Skipping apollo-cli
[INFO] This project has been banned from the build due to previous failures.
[INFO] ------------------------------------------------------------------------
[INFO]
[INFO] ------------------------------------------------------------------------
[INFO] Building apollo-website 1.0-SNAPSHOT
[INFO] ------------------------------------------------------------------------
Downloading: http://download.java.net/maven/2/org/fusesource/scalate/scalate-wikitext/1.5.3/scalate-wikitext-1.5.3.pom
Downloading: http://maven.glassfish.org/content/groups/glassfish/org/fusesource/scalate/scalate-wikitext/1.5.3/scalate-wikitext-1.5.3.pom
Downloaded: http://maven.glassfish.org/content/groups/glassfish/org/fusesource/scalate/scalate-wikitext/1.5.3/scalate-wikitext-1.5.3.pom (3 KB at 2.5 KB/sec)
Downloading: http://download.java.net/maven/2/org/fusesource/scalate/scalate-page/1.5.3/scalate-page-1.5.3.pom
Downloading: http://maven.glassfish.org/content/groups/glassfish/org/fusesource/scalate/scalate-page/1.5.3/scalate-page-1.5.3.pom
Downloaded: http://maven.glassfish.org/content/groups/glassfish/org/fusesource/scalate/scalate-page/1.5.3/scalate-page-1.5.3.pom (3 KB at 2.8 KB/sec)
Downloading: http://download.java.net/maven/2/org/fusesource/scalate/scalate-wikitext/1.5.3/scalate-wikitext-1.5.3.jar
Downloading: http://download.java.net/maven/2/org/fusesource/scalate/scalate-page/1.5.3/scalate-page-1.5.3.jar
Downloading: http://maven.glassfish.org/content/groups/glassfish/org/fusesource/scalate/scalate-wikitext/1.5.3/scalate-wikitext-1.5.3.jar
Downloading: http://maven.glassfish.org/content/groups/glassfish/org/fusesource/scalate/scalate-page/1.5.3/scalate-page-1.5.3.jar
Downloaded: http://maven.glassfish.org/content/groups/glassfish/org/fusesource/scalate/scalate-wikitext/1.5.3/scalate-wikitext-1.5.3.jar (159 KB at 104.2 KB/sec)
Downloaded: http://maven.glassfish.org/content/groups/glassfish/org/fusesource/scalate/scalate-page/1.5.3/scalate-page-1.5.3.jar (95 KB at 61.2 KB/sec)
[INFO]
[INFO] --- maven-clean-plugin:2.4.1:clean (default-clean) @ apollo-website ---
[INFO]
[INFO] --- maven-enforcer-plugin:1.0:enforce (default) @ apollo-website ---
[INFO]
[INFO] --- maven-antrun-plugin:1.6:run (default) @ apollo-website ---
[WARNING] Parameter tasks is deprecated, use target instead
[INFO] Executing tasks
main:
[mkdir] Created dir: F:\hudson\hudson-slave\workspace\ActiveMQ-Apollo\trunk\apollo-website\target\sitegen\documentation\schema
[schemagen] Generating schema from 64 source files
Note: Writing F:\hudson\hudson-slave\workspace\ActiveMQ-Apollo\trunk\apollo-website\target\sitegen\documentation\schema\apollo.xsd
[INFO] Executed tasks
[INFO]
[INFO] --- maven-remote-resources-plugin:1.1:process (default) @ apollo-website ---
[INFO]
[INFO] --- maven-scala-plugin:2.15.2:compile (default) @ apollo-website ---
[INFO] Checking for multiple versions of scala
[INFO] includes = [**/*.scala,**/*.java,]
[INFO] excludes = []
[INFO] F:\hudson\hudson-slave\workspace\ActiveMQ-Apollo\trunk\apollo-website\ext:-1: info: compiling
[INFO] Compiling 3 source files to F:\hudson\hudson-slave\workspace\ActiveMQ-Apollo\trunk\apollo-website\target\classes at 1322439962042
[INFO] compiler plugin: BasicArtifact(org.scala-lang.plugins,continuations,2.9.1)
[INFO] compiler plugin: BasicArtifact(org.fusesource.jvmassert,jvmassert,1.2)
[INFO] prepare-compile in 0 s
[INFO] compile in 9 s
[INFO]
[INFO] --- maven-scala-plugin:2.15.2:testCompile (default) @ apollo-website ---
[INFO] Checking for multiple versions of scala
[INFO] includes = [**/*.scala,**/*.java,]
[INFO] excludes = []
[WARNING] No source files found.
[INFO]
[INFO] --- maven-enforcer-plugin:1.0:enforce (default) @ apollo-website ---
[JENKINS] Archiving disabled - not archiving F:\hudson\hudson-slave\workspace\ActiveMQ-Apollo\trunk\apollo-website\pom.xml
ignoring exception during new ExecutedMojo null
[INFO]
[INFO] --- maven-source-plugin:2.1.2:jar (attach-sources) @ apollo-website ---
[INFO]
[INFO] --- maven-enforcer-plugin:1.0:enforce (default) @ apollo-website ---
[WARNING] Parameter tasks is deprecated, use target instead
[INFO] Executing tasks
main:
[INFO]
[INFO] --- maven-antrun-plugin:1.6:run (default) @ apollo-website ---
[schemagen] Generating schema from 64 source files
Note: Writing F:\hudson\hudson-slave\workspace\ActiveMQ-Apollo\trunk\apollo-website\target\sitegen\documentation\schema\apollo.xsd
[INFO] Executed tasks
[INFO]
[INFO] --- maven-remote-resources-plugin:1.1:process (default) @ apollo-website ---
[INFO]
[INFO] --- maven-scala-plugin:2.15.2:compile (default) @ apollo-website ---
[INFO] Checking for multiple versions of scala
[INFO] includes = [**/*.scala,**/*.java,]
[INFO] excludes = []
[INFO] Nothing to compile - all classes are up to date
[INFO]
[INFO] --- maven-scala-plugin:2.15.2:testCompile (default) @ apollo-website ---
[INFO] Checking for multiple versions of scala
[INFO] includes = [**/*.scala,**/*.java,]
[INFO] excludes = []
[WARNING] No source files found.
[INFO]
[INFO] --- maven-enforcer-plugin:1.0:enforce (default) @ apollo-website ---
[JENKINS] Archiving disabled - not archiving F:\hudson\hudson-slave\workspace\ActiveMQ-Apollo\trunk\apollo-website\pom.xml
ignoring exception during new ExecutedMojo null
[INFO]
[INFO] --- maven-source-plugin:2.1.2:jar (attach-sources) @ apollo-website ---
[JENKINS] Archiving disabled - not archiving F:\hudson\hudson-slave\workspace\ActiveMQ-Apollo\trunk\apollo-website\pom.xml
ignoring exception during new ExecutedMojo null
[INFO]
[INFO] --- maven-scalate-plugin:1.5.3:sitegen (sitegen) @ apollo-website ---
Processing Configuration for child elements
Processing child [project]
Processing child [workingDirectory]
Processing child [webappDirectory]
Processing child [targetDirectory]
Processing child [testClassPathElements]
[INFO] Generating static website from Scalate Templates and wiki files...
[INFO] template properties: null
Using dir: F:\hudson\hudson-slave\workspace\ActiveMQ-Apollo\trunk\apollo-website\src\blog at request path: /blog
[INFO] processing F:\hudson\hudson-slave\workspace\ActiveMQ-Apollo\trunk\apollo-website\src\blog\index.page with uri: /blog/index.page =>
Using dir: F:\hudson\hudson-slave\workspace\ActiveMQ-Apollo\trunk\apollo-website\src\blog at request path: /blog
[INFO] processing F:\hudson\hudson-slave\workspace\ActiveMQ-Apollo\trunk\apollo-website\src\blog\index.rss.feed with uri: /blog/index.rss.feed =>
[INFO] processing F:\hudson\hudson-slave\workspace\ActiveMQ-Apollo\trunk\apollo-website\src\blog\releases\release-1-0-beta1.page with uri: /blog/releases/release-1-0-beta1.page =>
[INFO] processing F:\hudson\hudson-slave\workspace\ActiveMQ-Apollo\trunk\apollo-website\src\blog\releases\release-1-0-beta2.page with uri: /blog/releases/release-1-0-beta2.page =>
[INFO] processing F:\hudson\hudson-slave\workspace\ActiveMQ-Apollo\trunk\apollo-website\src\blog\releases\release-1-0-beta3.page with uri: /blog/releases/release-1-0-beta3.page =>
[INFO] processing F:\hudson\hudson-slave\workspace\ActiveMQ-Apollo\trunk\apollo-website\src\blog\releases\release-1-0-beta4.page with uri: /blog/releases/release-1-0-beta4.page =>
[INFO] processing F:\hudson\hudson-slave\workspace\ActiveMQ-Apollo\trunk\apollo-website\src\blog\releases\release-1-0-beta5.page with uri: /blog/releases/release-1-0-beta5.page =>
[INFO] processing F:\hudson\hudson-slave\workspace\ActiveMQ-Apollo\trunk\apollo-website\src\community\building.page with uri: /community/building.page =>
[INFO] processing F:\hudson\hudson-slave\workspace\ActiveMQ-Apollo\trunk\apollo-website\src\community\contributing.page with uri: /community/contributing.page =>
[INFO] processing F:\hudson\hudson-slave\workspace\ActiveMQ-Apollo\trunk\apollo-website\src\community\developers.page with uri: /community/developers.page =>
[INFO] processing F:\hudson\hudson-slave\workspace\ActiveMQ-Apollo\trunk\apollo-website\src\community\faq.page with uri: /community/faq.page =>
[INFO] processing F:\hudson\hudson-slave\workspace\ActiveMQ-Apollo\trunk\apollo-website\src\community\index.page with uri: /community/index.page =>
[INFO] processing F:\hudson\hudson-slave\workspace\ActiveMQ-Apollo\trunk\apollo-website\src\community\release-guide.page with uri: /community/release-guide.page =>
[INFO] processing F:\hudson\hudson-slave\workspace\ActiveMQ-Apollo\trunk\apollo-website\src\community\site.page with uri: /community/site.page =>
[INFO] processing F:\hudson\hudson-slave\workspace\ActiveMQ-Apollo\trunk\apollo-website\src\community\source.page with uri: /community/source.page =>
[INFO] processing F:\hudson\hudson-slave\workspace\ActiveMQ-Apollo\trunk\apollo-website\src\community\support.page with uri: /community/support.page =>
[INFO] processing F:\hudson\hudson-slave\workspace\ActiveMQ-Apollo\trunk\apollo-website\src\documentation\architecture.md with uri: /documentation/architecture.md =>
[INFO] processing F:\hudson\hudson-slave\workspace\ActiveMQ-Apollo\trunk\apollo-website\src\documentation\extending-guide.md with uri: /documentation/extending-guide.md =>
[INFO] processing F:\hudson\hudson-slave\workspace\ActiveMQ-Apollo\trunk\apollo-website\src\documentation\getting-started.md with uri: /documentation/getting-started.md =>
[INFO] processing F:\hudson\hudson-slave\workspace\ActiveMQ-Apollo\trunk\apollo-website\src\documentation\index.page with uri: /documentation/index.page =>
[INFO] processing F:\hudson\hudson-slave\workspace\ActiveMQ-Apollo\trunk\apollo-website\src\documentation\management-api.md with uri: /documentation/management-api.md =>
[INFO] processing F:\hudson\hudson-slave\workspace\ActiveMQ-Apollo\trunk\apollo-website\src\documentation\module-organization.page with uri: /documentation/module-organization.page =>
[INFO] processing F:\hudson\hudson-slave\workspace\ActiveMQ-Apollo\trunk\apollo-website\src\documentation\performance-scaling.md with uri: /documentation/performance-scaling.md =>
[INFO] processing F:\hudson\hudson-slave\workspace\ActiveMQ-Apollo\trunk\apollo-website\src\documentation\user-manual.md with uri: /documentation/user-manual.md =>
[INFO] processing F:\hudson\hudson-slave\workspace\ActiveMQ-Apollo\trunk\apollo-website\src\documentation\verification.md with uri: /documentation/verification.md =>
[INFO] processing F:\hudson\hudson-slave\workspace\ActiveMQ-Apollo\trunk\apollo-website\src\download.page with uri: /download.page =>
[INFO] processing F:\hudson\hudson-slave\workspace\ActiveMQ-Apollo\trunk\apollo-website\src\index.page with uri: /index.page =>
[INFO] processing F:\hudson\hudson-slave\workspace\ActiveMQ-Apollo\trunk\apollo-website\src\privacy-policy.page with uri: /privacy-policy.page =>
[INFO] processing F:\hudson\hudson-slave\workspace\ActiveMQ-Apollo\trunk\apollo-website\src\versions\index.page with uri: /versions/index.page =>
[INFO] Installing F:\hudson\hudson-slave\workspace\ActiveMQ-Apollo\trunk\apollo-website\pom.xml to C:\Users\hudson\.m2\repository\org\apache\activemq\apollo-website\1.0-SNAPSHOT\apollo-website-1.0-SNAPSHOT.pom
[INFO]
[INFO] --- maven-install-plugin:2.3.1:install (default-install) @ apollo-website ---
[JENKINS] Archiving disabled - not archiving F:\hudson\hudson-slave\workspace\ActiveMQ-Apollo\trunk\apollo-website\pom.xml
[INFO]
[INFO] ------------------------------------------------------------------------
[INFO] Skipping apache-apollo
[INFO] This project has been banned from the build due to previous failures.
[INFO] ------------------------------------------------------------------------
[INFO]
[INFO] ------------------------------------------------------------------------
[INFO] Building apollo-karaf-feature 1.0-SNAPSHOT
[INFO] ------------------------------------------------------------------------
[INFO]
[INFO] --- maven-clean-plugin:2.4.1:clean (default-clean) @ apollo-karaf-feature ---
[INFO]
[INFO] --- maven-enforcer-plugin:1.0:enforce (default) @ apollo-karaf-feature ---
[INFO]
[INFO] --- maven-remote-resources-plugin:1.1:process (default) @ apollo-karaf-feature ---
[INFO] Using 'UTF-8' encoding to copy filtered resources.
[INFO]
[INFO] --- maven-resources-plugin:2.4.3:resources (filter) @ apollo-karaf-feature ---
[INFO] Copying 1 resource
[INFO] Copying 3 resources
[INFO]
[INFO] --- build-helper-maven-plugin:1.2:attach-artifact (attach-artifacts) @ apollo-karaf-feature ---
[INFO] Installing F:\hudson\hudson-slave\workspace\ActiveMQ-Apollo\trunk\apollo-karaf-feature\pom.xml to C:\Users\hudson\.m2\repository\org\apache\activemq\apollo-karaf-feature\1.0-SNAPSHOT\apollo-karaf-feature-1.0-SNAPSHOT.pom
[INFO]
[INFO] --- maven-install-plugin:2.3.1:install (default-install) @ apollo-karaf-feature ---
[INFO] Installing F:\hudson\hudson-slave\workspace\ActiveMQ-Apollo\trunk\apollo-karaf-feature\target\classes\features.xml to C:\Users\hudson\.m2\repository\org\apache\activemq\apollo-karaf-feature\1.0-SNAPSHOT\apollo-karaf-feature-1.0-SNAPSHOT-features.xml
[JENKINS] Archiving disabled - not archiving F:\hudson\hudson-slave\workspace\ActiveMQ-Apollo\trunk\apollo-karaf-feature\pom.xml
[JENKINS] Archiving disabled - not archiving F:\hudson\hudson-slave\workspace\ActiveMQ-Apollo\trunk\apollo-karaf-feature\target\classes\features.xml
[INFO] ------------------------------------------------------------------------
[INFO] Reactor Summary:
[INFO]
[INFO] Apache ActiveMQ Apollo Project .................... SUCCESS [5.690s]
[INFO] apollo-boot ....................................... SUCCESS [4.672s]
[INFO] apollo-scala ...................................... SUCCESS [42.748s]
[INFO] apollo-util ....................................... SUCCESS [1:01.746s]
[INFO] apollo-transport .................................. SUCCESS [1.896s]
[INFO] apollo-dto ........................................ SUCCESS [14.816s]
[INFO] apollo-selector ................................... SUCCESS [5.325s]
[INFO] apollo-broker ..................................... SUCCESS [1:32.528s]
[INFO] apollo-tcp ........................................ SUCCESS [2.632s]
[INFO] apollo-web ........................................ SUCCESS [1:22.492s]
[INFO] apollo-leveldb .................................... FAILURE [26.143s]
[INFO] apollo-bdb ........................................ SUCCESS [42.362s]
[INFO] apollo-jdbm2 ...................................... SUCCESS [40.062s]
[INFO] apollo-stomp ...................................... SUCCESS [1:23.722s]
[INFO] apollo-cli ........................................ SKIPPED
[INFO] apollo-website .................................... SUCCESS [54.628s]
[INFO] apache-apollo ..................................... SKIPPED
[INFO] apollo-karaf-feature .............................. SUCCESS [0.411s]
[INFO] ------------------------------------------------------------------------
[INFO] BUILD FAILURE
[INFO] ------------------------------------------------------------------------
[INFO] Total time: 9:23.375s
[INFO] Finished at: Mon Nov 28 00:26:41 GMT 2011
[INFO] Final Memory: 300M/1187M
[INFO] ------------------------------------------------------------------------
mavenExecutionResult exceptions not empty
message : Failed to execute goal on project apollo-leveldb: Could not resolve dependencies for project org.apache.activemq:apollo-leveldb:jar:1.0-SNAPSHOT: The following artifacts could not be resolved: org.iq80.leveldb:leveldb-api:jar:0.1-SNAPSHOT, org.iq80.leveldb:leveldb:jar:0.1-SNAPSHOT: Could not find artifact org.iq80.leveldb:leveldb-api:jar:0.1-SNAPSHOT in Nexus (http://repository.apache.org/snapshots)
cause : Could not resolve dependencies for project org.apache.activemq:apollo-leveldb:jar:1.0-SNAPSHOT: The following artifacts could not be resolved: org.iq80.leveldb:leveldb-api:jar:0.1-SNAPSHOT, org.iq80.leveldb:leveldb:jar:0.1-SNAPSHOT: Could not find artifact org.iq80.leveldb:leveldb-api:jar:0.1-SNAPSHOT in Nexus (http://repository.apache.org/snapshots)
Stack trace :
org.apache.maven.lifecycle.LifecycleExecutionException: Failed to execute goal on project apollo-leveldb: Could not resolve dependencies for project org.apache.activemq:apollo-leveldb:jar:1.0-SNAPSHOT: The following artifacts could not be resolved: org.iq80.leveldb:leveldb-api:jar:0.1-SNAPSHOT, org.iq80.leveldb:leveldb:jar:0.1-SNAPSHOT: Could not find artifact org.iq80.leveldb:leveldb-api:jar:0.1-SNAPSHOT in Nexus (http://repository.apache.org/snapshots)
at org.apache.maven.lifecycle.internal.LifecycleDependencyResolver.getDependencies(LifecycleDependencyResolver.java:190)
at org.apache.maven.lifecycle.internal.LifecycleDependencyResolver.resolveProjectDependencies(LifecycleDependencyResolver.java:104)
at org.apache.maven.lifecycle.internal.MojoExecutor.ensureDependenciesAreResolved(MojoExecutor.java:258)
at org.apache.maven.lifecycle.internal.MojoExecutor.execute(MojoExecutor.java:201)
at org.apache.maven.lifecycle.internal.MojoExecutor.execute(MojoExecutor.java:153)
at org.apache.maven.lifecycle.internal.MojoExecutor.execute(MojoExecutor.java:145)
at org.apache.maven.lifecycle.internal.LifecycleModuleBuilder.buildProject(LifecycleModuleBuilder.java:84)
at org.apache.maven.lifecycle.internal.LifecycleModuleBuilder.buildProject(LifecycleModuleBuilder.java:59)
at org.apache.maven.lifecycle.internal.LifecycleStarter.singleThreadedBuild(LifecycleStarter.java:183)
at org.apache.maven.lifecycle.internal.LifecycleStarter.execute(LifecycleStarter.java:161)
at org.apache.maven.DefaultMaven.doExecute(DefaultMaven.java:319)
at org.apache.maven.DefaultMaven.execute(DefaultMaven.java:156)
at org.jvnet.hudson.maven3.launcher.Maven3Launcher.main(Maven3Launcher.java:79)
at sun.reflect.NativeMethodAccessorImpl.invoke0(Native Method)
at sun.reflect.NativeMethodAccessorImpl.invoke(NativeMethodAccessorImpl.java:39)
at sun.reflect.DelegatingMethodAccessorImpl.invoke(DelegatingMethodAccessorImpl.java:25)
at java.lang.reflect.Method.invoke(Method.java:597)
at org.codehaus.plexus.classworlds.launcher.Launcher.launchStandard(Launcher.java:329)
at org.codehaus.plexus.classworlds.launcher.Launcher.launch(Launcher.java:239)
at org.jvnet.hudson.maven3.agent.Maven3Main.launch(Maven3Main.java:158)
at hudson.maven.Maven3Builder.call(Maven3Builder.java:122)
at hudson.maven.Maven3Builder.call(Maven3Builder.java:74)
at hudson.remoting.UserRequest.perform(UserRequest.java:118)
at hudson.remoting.UserRequest.perform(UserRequest.java:48)
at hudson.remoting.Request$2.run(Request.java:287)
at java.util.concurrent.Executors$RunnableAdapter.call(Executors.java:441)
at java.util.concurrent.FutureTask$Sync.innerRun(FutureTask.java:303)
at java.util.concurrent.FutureTask.run(FutureTask.java:138)
at java.util.concurrent.ThreadPoolExecutor$Worker.runTask(ThreadPoolExecutor.java:886)
at java.util.concurrent.ThreadPoolExecutor$Worker.run(ThreadPoolExecutor.java:908)
at java.lang.Thread.run(Thread.java:662)
Caused by: org.apache.maven.project.DependencyResolutionException: Could not resolve dependencies for project org.apache.activemq:apollo-leveldb:jar:1.0-SNAPSHOT: The following artifacts could not be resolved: org.iq80.leveldb:leveldb-api:jar:0.1-SNAPSHOT, org.iq80.leveldb:leveldb:jar:0.1-SNAPSHOT: Could not find artifact org.iq80.leveldb:leveldb-api:jar:0.1-SNAPSHOT in Nexus (http://repository.apache.org/snapshots)
at org.apache.maven.project.DefaultProjectDependenciesResolver.resolve(DefaultProjectDependenciesResolver.java:156)
at org.apache.maven.lifecycle.internal.LifecycleDependencyResolver.getDependencies(LifecycleDependencyResolver.java:165)
... 30 more
Caused by: org.sonatype.aether.resolution.ArtifactResolutionException: The following artifacts could not be resolved: org.iq80.leveldb:leveldb-api:jar:0.1-SNAPSHOT, org.iq80.leveldb:leveldb:jar:0.1-SNAPSHOT: Could not find artifact org.iq80.leveldb:leveldb-api:jar:0.1-SNAPSHOT in Nexus (http://repository.apache.org/snapshots)
at org.sonatype.aether.impl.internal.DefaultArtifactResolver.resolveArtifacts(DefaultArtifactResolver.java:526)
at org.sonatype.aether.impl.internal.DefaultRepositorySystem.resolveArtifacts(DefaultRepositorySystem.java:304)
at org.sonatype.aether.impl.internal.DefaultRepositorySystem.resolveDependencies(DefaultRepositorySystem.java:334)
at org.apache.maven.project.DefaultProjectDependenciesResolver.resolve(DefaultProjectDependenciesResolver.java:150)
... 31 more
Caused by: org.sonatype.aether.transfer.ArtifactNotFoundException: Could not find artifact org.iq80.leveldb:leveldb-api:jar:0.1-SNAPSHOT in Nexus (http://repository.apache.org/snapshots)
at org.sonatype.aether.connector.wagon.WagonRepositoryConnector$4.wrap(WagonRepositoryConnector.java:945)
at org.sonatype.aether.connector.wagon.WagonRepositoryConnector$4.wrap(WagonRepositoryConnector.java:940)
at org.sonatype.aether.connector.wagon.WagonRepositoryConnector$GetTask.flush(WagonRepositoryConnector.java:696)
at org.sonatype.aether.connector.wagon.WagonRepositoryConnector$GetTask.flush(WagonRepositoryConnector.java:690)
at org.sonatype.aether.connector.wagon.WagonRepositoryConnector.get(WagonRepositoryConnector.java:435)
at org.sonatype.aether.impl.internal.DefaultArtifactResolver.resolveArtifacts(DefaultArtifactResolver.java:438)
... 34 more
Sending e-mails to: commits@activemq.apache.org
channel stopped
Build failed in Jenkins: ActiveMQ-Apollo #456
Posted by Apache Jenkins Server <je...@builds.apache.org>.
See <https://builds.apache.org/job/ActiveMQ-Apollo/456/changes>
Changes:
[chirino] Better packaging of the leveldb bits so that you can remove the levedbjni jars if they are not needed.
[chirino] If native link system call is not available, use a couple of fallback strategies.
------------------------------------------
[...truncated 3826 lines...]
Downloading: http://maven.glassfish.org/content/groups/glassfish/org/fusesource/wikitext/wikitext-core/1.2/wikitext-core-1.2.jar
Downloading: http://maven.glassfish.org/content/groups/glassfish/org/fusesource/wikitext/textile-core/1.2/textile-core-1.2.jar
Downloading: http://maven.glassfish.org/content/groups/glassfish/org/fusesource/scalate/scalate-page/1.5.3/scalate-page-1.5.3.jar
Downloaded: http://maven.glassfish.org/content/groups/glassfish/org/fusesource/scalate/scalate-page/1.5.3/scalate-page-1.5.3.jar (95 KB at 77.7 KB/sec)
Downloading: http://maven.glassfish.org/content/groups/glassfish/org/fusesource/scalamd/scalamd/1.5/scalamd-1.5.jar
Downloaded: http://maven.glassfish.org/content/groups/glassfish/org/fusesource/wikitext/textile-core/1.2/textile-core-1.2.jar (54 KB at 36.6 KB/sec)
Downloaded: http://maven.glassfish.org/content/groups/glassfish/org/fusesource/wikitext/confluence-core/1.2/confluence-core-1.2.jar (65 KB at 42.5 KB/sec)
Downloaded: http://maven.glassfish.org/content/groups/glassfish/org/fusesource/scalate/scalate-wikitext/1.5.3/scalate-wikitext-1.5.3.jar (159 KB at 101.5 KB/sec)
Downloaded: http://maven.glassfish.org/content/groups/glassfish/org/fusesource/wikitext/wikitext-core/1.2/wikitext-core-1.2.jar (237 KB at 146.9 KB/sec)
Downloaded: http://maven.glassfish.org/content/groups/glassfish/org/fusesource/scalamd/scalamd/1.5/scalamd-1.5.jar (82 KB at 82.9 KB/sec)
[INFO]
[INFO] --- maven-clean-plugin:2.4.1:clean (default-clean) @ apollo-website ---
[INFO]
[INFO] --- maven-enforcer-plugin:1.0:enforce (default) @ apollo-website ---
[INFO] [WARNING] Parameter tasks is deprecated, use target instead
[INFO] --- maven-antrun-plugin:1.6:run (default) @ apollo-website ---
[INFO] Executing tasks
main:
[mkdir] Created dir: <https://builds.apache.org/job/ActiveMQ-Apollo/ws/trunk/apollo-website/target/sitegen/documentation/schema>
[schemagen] Generating schema from 64 source files
Note: Writing <https://builds.apache.org/job/ActiveMQ-Apollo/ws/trunk/apollo-website/target/sitegen/documentation/schema/apollo.xsd>
[INFO] Executed tasks
[INFO]
[INFO] --- maven-remote-resources-plugin:1.1:process (default) @ apollo-website ---
[INFO] Checking for multiple versions of scala
[INFO] [INFO] includes = [**/*.scala,**/*.java,]
[INFO] excludes = []
[INFO] <https://builds.apache.org/job/ActiveMQ-Apollo/ws/trunk/apollo-website/ext>:-1: info: compiling
[INFO] Compiling 3 source files to <https://builds.apache.org/job/ActiveMQ-Apollo/ws/trunk/apollo-website/target/classes> at 1322097586649
[INFO] compiler plugin: BasicArtifact(org.scala-lang.plugins,continuations,2.9.1)
[INFO] compiler plugin: BasicArtifact(org.fusesource.jvmassert,jvmassert,1.2)
[INFO] --- maven-scala-plugin:2.15.2:compile (default) @ apollo-website ---
[INFO] prepare-compile in 0 s
[INFO] compile in 6 s
[INFO] Checking for multiple versions of scala
[INFO] [INFO] includes = [**/*.scala,**/*.java,]
[INFO] excludes = []
[WARNING] No source files found.
[INFO] --- maven-scala-plugin:2.15.2:testCompile (default) @ apollo-website ---
[INFO]
[INFO] --- maven-enforcer-plugin:1.0:enforce (default) @ apollo-website ---
[JENKINS] Archiving disabled - not archiving <https://builds.apache.org/job/ActiveMQ-Apollo/ws/trunk/apollo-website/pom.xml>
ignoring exception during new ExecutedMojo null
[INFO]
[INFO] --- maven-source-plugin:2.1.2:jar (attach-sources) @ apollo-website ---
[INFO]
[INFO] --- maven-enforcer-plugin:1.0:enforce (default) @ apollo-website ---
[INFO] [WARNING] Parameter tasks is deprecated, use target instead
[INFO] --- maven-antrun-plugin:1.6:run (default) @ apollo-website ---
[INFO] Executing tasks
main:
[schemagen] Generating schema from 64 source files
Note: Writing <https://builds.apache.org/job/ActiveMQ-Apollo/ws/trunk/apollo-website/target/sitegen/documentation/schema/apollo.xsd>
[INFO] Executed tasks
[INFO]
[INFO] --- maven-remote-resources-plugin:1.1:process (default) @ apollo-website ---
[INFO] [INFO] Checking for multiple versions of scala
[INFO] includes = [**/*.scala,**/*.java,]
[INFO] excludes = []
[INFO] Nothing to compile - all classes are up to date
[INFO] --- maven-scala-plugin:2.15.2:compile (default) @ apollo-website ---
[INFO] [INFO] Checking for multiple versions of scala
[INFO] includes = [**/*.scala,**/*.java,]
[INFO] excludes = []
[WARNING] No source files found.
[INFO] --- maven-scala-plugin:2.15.2:testCompile (default) @ apollo-website ---
[INFO]
[INFO] --- maven-enforcer-plugin:1.0:enforce (default) @ apollo-website ---
[JENKINS] Archiving disabled - not archiving <https://builds.apache.org/job/ActiveMQ-Apollo/ws/trunk/apollo-website/pom.xml>
ignoring exception during new ExecutedMojo null
[INFO]
[INFO] --- maven-source-plugin:2.1.2:jar (attach-sources) @ apollo-website ---
[JENKINS] Archiving disabled - not archiving <https://builds.apache.org/job/ActiveMQ-Apollo/ws/trunk/apollo-website/pom.xml>
ignoring exception during new ExecutedMojo null
[INFO] Processing Configuration for child elements
Processing child [project]
Processing child [workingDirectory]
Processing child [webappDirectory]
Processing child [targetDirectory]
Processing child [testClassPathElements]
[INFO] Generating static website from Scalate Templates and wiki files...
[INFO] template properties: null
[INFO] processing <https://builds.apache.org/job/ActiveMQ-Apollo/ws/trunk/apollo-website/src/community/contributing.page> with uri: /community/contributing.page =>
[INFO] [INFO] processing <https://builds.apache.org/job/ActiveMQ-Apollo/ws/trunk/apollo-website/src/community/index.page> with uri: /community/index.page =>
--- maven-scalate-plugin:1.5.3:sitegen (sitegen) @ apollo-website ---[INFO] processing <https://builds.apache.org/job/ActiveMQ-Apollo/ws/trunk/apollo-website/src/community/release-guide.page> with uri: /community/release-guide.page =>
[INFO] processing <https://builds.apache.org/job/ActiveMQ-Apollo/ws/trunk/apollo-website/src/community/building.page> with uri: /community/building.page =>
[INFO] processing <https://builds.apache.org/job/ActiveMQ-Apollo/ws/trunk/apollo-website/src/community/source.page> with uri: /community/source.page =>
[INFO] processing <https://builds.apache.org/job/ActiveMQ-Apollo/ws/trunk/apollo-website/src/community/faq.page> with uri: /community/faq.page =>
[INFO] processing <https://builds.apache.org/job/ActiveMQ-Apollo/ws/trunk/apollo-website/src/community/support.page> with uri: /community/support.page =>
[INFO] processing <https://builds.apache.org/job/ActiveMQ-Apollo/ws/trunk/apollo-website/src/community/developers.page> with uri: /community/developers.page =>
[INFO] processing <https://builds.apache.org/job/ActiveMQ-Apollo/ws/trunk/apollo-website/src/community/site.page> with uri: /community/site.page =>
[INFO] processing <https://builds.apache.org/job/ActiveMQ-Apollo/ws/trunk/apollo-website/src/index.page> with uri: /index.page =>
Using dir: <https://builds.apache.org/job/ActiveMQ-Apollo/ws/trunk/apollo-website/src/blog> at request path: /blog
[INFO] processing <https://builds.apache.org/job/ActiveMQ-Apollo/ws/trunk/apollo-website/src/blog/index.rss.feed> with uri: /blog/index.rss.feed =>
Using dir: <https://builds.apache.org/job/ActiveMQ-Apollo/ws/trunk/apollo-website/src/blog> at request path: /blog
[INFO] processing <https://builds.apache.org/job/ActiveMQ-Apollo/ws/trunk/apollo-website/src/blog/index.page> with uri: /blog/index.page =>
[INFO] processing <https://builds.apache.org/job/ActiveMQ-Apollo/ws/trunk/apollo-website/src/blog/releases/release-1-0-beta3.page> with uri: /blog/releases/release-1-0-beta3.page =>
[INFO] processing <https://builds.apache.org/job/ActiveMQ-Apollo/ws/trunk/apollo-website/src/blog/releases/release-1-0-beta4.page> with uri: /blog/releases/release-1-0-beta4.page =>
[INFO] processing <https://builds.apache.org/job/ActiveMQ-Apollo/ws/trunk/apollo-website/src/blog/releases/release-1-0-beta5.page> with uri: /blog/releases/release-1-0-beta5.page =>
[INFO] processing <https://builds.apache.org/job/ActiveMQ-Apollo/ws/trunk/apollo-website/src/blog/releases/release-1-0-beta2.page> with uri: /blog/releases/release-1-0-beta2.page =>
[INFO] processing <https://builds.apache.org/job/ActiveMQ-Apollo/ws/trunk/apollo-website/src/blog/releases/release-1-0-beta1.page> with uri: /blog/releases/release-1-0-beta1.page =>
[INFO] processing <https://builds.apache.org/job/ActiveMQ-Apollo/ws/trunk/apollo-website/src/versions/index.page> with uri: /versions/index.page =>
[INFO] processing <https://builds.apache.org/job/ActiveMQ-Apollo/ws/trunk/apollo-website/src/privacy-policy.page> with uri: /privacy-policy.page =>
[INFO] processing <https://builds.apache.org/job/ActiveMQ-Apollo/ws/trunk/apollo-website/src/documentation/architecture.md> with uri: /documentation/architecture.md =>
[INFO] processing <https://builds.apache.org/job/ActiveMQ-Apollo/ws/trunk/apollo-website/src/documentation/index.page> with uri: /documentation/index.page =>
[INFO] processing <https://builds.apache.org/job/ActiveMQ-Apollo/ws/trunk/apollo-website/src/documentation/performance-scaling.md> with uri: /documentation/performance-scaling.md =>
[INFO] processing <https://builds.apache.org/job/ActiveMQ-Apollo/ws/trunk/apollo-website/src/documentation/user-manual.md> with uri: /documentation/user-manual.md =>
[INFO] processing <https://builds.apache.org/job/ActiveMQ-Apollo/ws/trunk/apollo-website/src/documentation/management-api.md> with uri: /documentation/management-api.md =>
[INFO] processing <https://builds.apache.org/job/ActiveMQ-Apollo/ws/trunk/apollo-website/src/documentation/getting-started.md> with uri: /documentation/getting-started.md =>
[INFO] processing <https://builds.apache.org/job/ActiveMQ-Apollo/ws/trunk/apollo-website/src/documentation/module-organization.page> with uri: /documentation/module-organization.page =>
[INFO] processing <https://builds.apache.org/job/ActiveMQ-Apollo/ws/trunk/apollo-website/src/documentation/extending-guide.md> with uri: /documentation/extending-guide.md =>
[INFO] processing <https://builds.apache.org/job/ActiveMQ-Apollo/ws/trunk/apollo-website/src/documentation/verification.md> with uri: /documentation/verification.md =>
[INFO] processing <https://builds.apache.org/job/ActiveMQ-Apollo/ws/trunk/apollo-website/src/download.page> with uri: /download.page =>
[INFO] [INFO] Installing <https://builds.apache.org/job/ActiveMQ-Apollo/ws/trunk/apollo-website/pom.xml> to /home/jenkins/.m2/repository/org/apache/activemq/apollo-website/1.0-SNAPSHOT/apollo-website-1.0-SNAPSHOT.pom
[INFO] --- maven-install-plugin:2.3.1:install (default-install) @ apollo-website ---
[JENKINS] Archiving disabled - not archiving <https://builds.apache.org/job/ActiveMQ-Apollo/ws/trunk/apollo-website/pom.xml>
[INFO]
[INFO] ------------------------------------------------------------------------
[INFO] Skipping apache-apollo
[INFO] This project has been banned from the build due to previous failures.
[INFO] ------------------------------------------------------------------------
[INFO] Downloading: http://repo.fusesource.com/nexus/content/groups/public/org/codehaus/mojo/build-helper-maven-plugin/1.2/build-helper-maven-plugin-1.2.pom
[INFO] ------------------------------------------------------------------------
[INFO] Building apollo-karaf-feature 1.0-SNAPSHOT
[INFO] ------------------------------------------------------------------------
Downloading: http://scala-tools.org/repo-releases/org/codehaus/mojo/build-helper-maven-plugin/1.2/build-helper-maven-plugin-1.2.pom
Downloading: http://download.java.net/maven/2/org/codehaus/mojo/build-helper-maven-plugin/1.2/build-helper-maven-plugin-1.2.pom
Downloading: http://repo1.maven.org/maven2/org/codehaus/mojo/build-helper-maven-plugin/1.2/build-helper-maven-plugin-1.2.pom
[INFO] Downloaded: http://repo1.maven.org/maven2/org/codehaus/mojo/build-helper-maven-plugin/1.2/build-helper-maven-plugin-1.2.pom (3 KB at 8.0 KB/sec)
Downloading: http://repo.fusesource.com/nexus/content/groups/public/org/codehaus/mojo/build-helper-maven-plugin/1.2/build-helper-maven-plugin-1.2.jar
Downloading: http://scala-tools.org/repo-releases/org/codehaus/mojo/build-helper-maven-plugin/1.2/build-helper-maven-plugin-1.2.jar
Downloading: http://download.java.net/maven/2/org/codehaus/mojo/build-helper-maven-plugin/1.2/build-helper-maven-plugin-1.2.jar
Downloading: http://repo1.maven.org/maven2/org/codehaus/mojo/build-helper-maven-plugin/1.2/build-helper-maven-plugin-1.2.jar
Downloaded: http://repo1.maven.org/maven2/org/codehaus/mojo/build-helper-maven-plugin/1.2/build-helper-maven-plugin-1.2.jar (11 KB at 34.4 KB/sec)
[INFO] --- maven-clean-plugin:2.4.1:clean (default-clean) @ apollo-karaf-feature ---
[INFO]
[INFO] --- maven-enforcer-plugin:1.0:enforce (default) @ apollo-karaf-feature ---
[INFO]
[INFO] --- maven-remote-resources-plugin:1.1:process (default) @ apollo-karaf-feature ---
[INFO] [INFO] Using 'UTF-8' encoding to copy filtered resources.
[INFO] Copying 1 resource
[INFO] Copying 3 resources
[INFO] --- maven-resources-plugin:2.4.3:resources (filter) @ apollo-karaf-feature ---
[INFO]
[INFO] --- build-helper-maven-plugin:1.2:attach-artifact (attach-artifacts) @ apollo-karaf-feature ---
[INFO] [INFO] Installing <https://builds.apache.org/job/ActiveMQ-Apollo/ws/trunk/apollo-karaf-feature/pom.xml> to /home/jenkins/.m2/repository/org/apache/activemq/apollo-karaf-feature/1.0-SNAPSHOT/apollo-karaf-feature-1.0-SNAPSHOT.pom
[INFO] Installing <https://builds.apache.org/job/ActiveMQ-Apollo/ws/trunk/apollo-karaf-feature/target/classes/features.xml> to /home/jenkins/.m2/repository/org/apache/activemq/apollo-karaf-feature/1.0-SNAPSHOT/apollo-karaf-feature-1.0-SNAPSHOT-features.xml
[INFO] --- maven-install-plugin:2.3.1:install (default-install) @ apollo-karaf-feature ---
[JENKINS] Archiving disabled - not archiving <https://builds.apache.org/job/ActiveMQ-Apollo/ws/trunk/apollo-karaf-feature/pom.xml>
[JENKINS] Archiving disabled - not archiving <https://builds.apache.org/job/ActiveMQ-Apollo/ws/trunk/apollo-karaf-feature/target/classes/features.xml>
[INFO] ------------------------------------------------------------------------
[INFO] Reactor Summary:
[INFO]
[INFO] Apache ActiveMQ Apollo Project .................... SUCCESS [27.500s]
[INFO] apollo-boot ....................................... SUCCESS [18.250s]
[INFO] apollo-scala ...................................... SUCCESS [1.514s]
[INFO] apollo-util ....................................... SUCCESS [2:44.499s]
[INFO] apollo-transport .................................. SUCCESS [8.322s]
[INFO] apollo-dto ........................................ SUCCESS [23.986s]
[INFO] apollo-selector ................................... SUCCESS [23.116s]
[INFO] apollo-broker ..................................... SUCCESS [1:33.880s]
[INFO] apollo-tcp ........................................ SUCCESS [7.883s]
[INFO] apollo-web ........................................ SUCCESS [3:01.029s]
[INFO] apollo-leveldb .................................... FAILURE [25.313s]
[INFO] apollo-bdb ........................................ SUCCESS [48.469s]
[INFO] apollo-jdbm2 ...................................... SUCCESS [1:00.292s]
[INFO] apollo-stomp ...................................... SUCCESS [1:03.636s]
[INFO] apollo-cli ........................................ SUCCESS [35.840s]
[INFO] apollo-website .................................... SUCCESS [1:09.014s]
[INFO] apache-apollo ..................................... SKIPPED
[INFO] apollo-karaf-feature .............................. SUCCESS [8.591s]
[INFO] ------------------------------------------------------------------------
[INFO] BUILD FAILURE
[INFO] ------------------------------------------------------------------------
[INFO] Total time: 15:48.585s
[INFO] Finished at: Thu Nov 24 01:20:53 UTC 2011
[INFO] Final Memory: 277M/1111M
[INFO] ------------------------------------------------------------------------
mavenExecutionResult exceptions not empty
message : Failed to execute goal on project apollo-leveldb: Could not resolve dependencies for project org.apache.activemq:apollo-leveldb:jar:1.0-SNAPSHOT: The following artifacts could not be resolved: org.iq80.leveldb:leveldb-api:jar:0.1-SNAPSHOT, org.iq80.leveldb:leveldb:jar:0.1-SNAPSHOT: Could not find artifact org.iq80.leveldb:leveldb-api:jar:0.1-SNAPSHOT in Nexus (http://repository.apache.org/snapshots)
cause : Could not resolve dependencies for project org.apache.activemq:apollo-leveldb:jar:1.0-SNAPSHOT: The following artifacts could not be resolved: org.iq80.leveldb:leveldb-api:jar:0.1-SNAPSHOT, org.iq80.leveldb:leveldb:jar:0.1-SNAPSHOT: Could not find artifact org.iq80.leveldb:leveldb-api:jar:0.1-SNAPSHOT in Nexus (http://repository.apache.org/snapshots)
Stack trace :
org.apache.maven.lifecycle.LifecycleExecutionException: Failed to execute goal on project apollo-leveldb: Could not resolve dependencies for project org.apache.activemq:apollo-leveldb:jar:1.0-SNAPSHOT: The following artifacts could not be resolved: org.iq80.leveldb:leveldb-api:jar:0.1-SNAPSHOT, org.iq80.leveldb:leveldb:jar:0.1-SNAPSHOT: Could not find artifact org.iq80.leveldb:leveldb-api:jar:0.1-SNAPSHOT in Nexus (http://repository.apache.org/snapshots)
at org.apache.maven.lifecycle.internal.LifecycleDependencyResolver.getDependencies(LifecycleDependencyResolver.java:190)
at org.apache.maven.lifecycle.internal.LifecycleDependencyResolver.resolveProjectDependencies(LifecycleDependencyResolver.java:104)
at org.apache.maven.lifecycle.internal.MojoExecutor.ensureDependenciesAreResolved(MojoExecutor.java:258)
at org.apache.maven.lifecycle.internal.MojoExecutor.execute(MojoExecutor.java:201)
at org.apache.maven.lifecycle.internal.MojoExecutor.execute(MojoExecutor.java:153)
at org.apache.maven.lifecycle.internal.MojoExecutor.execute(MojoExecutor.java:145)
at org.apache.maven.lifecycle.internal.LifecycleModuleBuilder.buildProject(LifecycleModuleBuilder.java:84)
at org.apache.maven.lifecycle.internal.LifecycleModuleBuilder.buildProject(LifecycleModuleBuilder.java:59)
at org.apache.maven.lifecycle.internal.LifecycleStarter.singleThreadedBuild(LifecycleStarter.java:183)
at org.apache.maven.lifecycle.internal.LifecycleStarter.execute(LifecycleStarter.java:161)
at org.apache.maven.DefaultMaven.doExecute(DefaultMaven.java:319)
at org.apache.maven.DefaultMaven.execute(DefaultMaven.java:156)
at org.jvnet.hudson.maven3.launcher.Maven3Launcher.main(Maven3Launcher.java:79)
at sun.reflect.NativeMethodAccessorImpl.invoke0(Native Method)
at sun.reflect.NativeMethodAccessorImpl.invoke(NativeMethodAccessorImpl.java:39)
at sun.reflect.DelegatingMethodAccessorImpl.invoke(DelegatingMethodAccessorImpl.java:25)
at java.lang.reflect.Method.invoke(Method.java:597)
at org.codehaus.plexus.classworlds.launcher.Launcher.launchStandard(Launcher.java:329)
at org.codehaus.plexus.classworlds.launcher.Launcher.launch(Launcher.java:239)
at org.jvnet.hudson.maven3.agent.Maven3Main.launch(Maven3Main.java:158)
at hudson.maven.Maven3Builder.call(Maven3Builder.java:122)
at hudson.maven.Maven3Builder.call(Maven3Builder.java:74)
at hudson.remoting.UserRequest.perform(UserRequest.java:118)
at hudson.remoting.UserRequest.perform(UserRequest.java:48)
at hudson.remoting.Request$2.run(Request.java:287)
at java.util.concurrent.Executors$RunnableAdapter.call(Executors.java:441)
at java.util.concurrent.FutureTask$Sync.innerRun(FutureTask.java:303)
at java.util.concurrent.FutureTask.run(FutureTask.java:138)
at java.util.concurrent.ThreadPoolExecutor$Worker.runTask(ThreadPoolExecutor.java:886)
at java.util.concurrent.ThreadPoolExecutor$Worker.run(ThreadPoolExecutor.java:908)
at java.lang.Thread.run(Thread.java:662)
Caused by: org.apache.maven.project.DependencyResolutionException: Could not resolve dependencies for project org.apache.activemq:apollo-leveldb:jar:1.0-SNAPSHOT: The following artifacts could not be resolved: org.iq80.leveldb:leveldb-api:jar:0.1-SNAPSHOT, org.iq80.leveldb:leveldb:jar:0.1-SNAPSHOT: Could not find artifact org.iq80.leveldb:leveldb-api:jar:0.1-SNAPSHOT in Nexus (http://repository.apache.org/snapshots)
at org.apache.maven.project.DefaultProjectDependenciesResolver.resolve(DefaultProjectDependenciesResolver.java:156)
at org.apache.maven.lifecycle.internal.LifecycleDependencyResolver.getDependencies(LifecycleDependencyResolver.java:165)
... 30 more
Caused by: org.sonatype.aether.resolution.ArtifactResolutionException: The following artifacts could not be resolved: org.iq80.leveldb:leveldb-api:jar:0.1-SNAPSHOT, org.iq80.leveldb:leveldb:jar:0.1-SNAPSHOT: Could not find artifact org.iq80.leveldb:leveldb-api:jar:0.1-SNAPSHOT in Nexus (http://repository.apache.org/snapshots)
at org.sonatype.aether.impl.internal.DefaultArtifactResolver.resolveArtifacts(DefaultArtifactResolver.java:526)
at org.sonatype.aether.impl.internal.DefaultRepositorySystem.resolveArtifacts(DefaultRepositorySystem.java:304)
at org.sonatype.aether.impl.internal.DefaultRepositorySystem.resolveDependencies(DefaultRepositorySystem.java:334)
at org.apache.maven.project.DefaultProjectDependenciesResolver.resolve(DefaultProjectDependenciesResolver.java:150)
... 31 more
Caused by: org.sonatype.aether.transfer.ArtifactNotFoundException: Could not find artifact org.iq80.leveldb:leveldb-api:jar:0.1-SNAPSHOT in Nexus (http://repository.apache.org/snapshots)
at org.sonatype.aether.connector.wagon.WagonRepositoryConnector$4.wrap(WagonRepositoryConnector.java:945)
at org.sonatype.aether.connector.wagon.WagonRepositoryConnector$4.wrap(WagonRepositoryConnector.java:940)
at org.sonatype.aether.connector.wagon.WagonRepositoryConnector$GetTask.flush(WagonRepositoryConnector.java:696)
at org.sonatype.aether.connector.wagon.WagonRepositoryConnector$GetTask.flush(WagonRepositoryConnector.java:690)
at org.sonatype.aether.connector.wagon.WagonRepositoryConnector.get(WagonRepositoryConnector.java:435)
at org.sonatype.aether.impl.internal.DefaultArtifactResolver.resolveArtifacts(DefaultArtifactResolver.java:438)
... 34 more
Sending e-mails to: commits@activemq.apache.org
channel stopped
Build failed in Jenkins: ActiveMQ-Apollo #455
Posted by Apache Jenkins Server <je...@builds.apache.org>.
See <https://builds.apache.org/job/ActiveMQ-Apollo/455/>
------------------------------------------
[...truncated 3463 lines...]
[INFO] --- maven-install-plugin:2.3.1:install (default-install) @ apollo-cli ---
[INFO] Installing <https://builds.apache.org/job/ActiveMQ-Apollo/ws/trunk/apollo-cli/pom.xml> to /home/jenkins/.m2/repository/org/apache/activemq/apollo-cli/1.0-SNAPSHOT/apollo-cli-1.0-SNAPSHOT.pom
[JENKINS] Archiving disabled - not archiving <https://builds.apache.org/job/ActiveMQ-Apollo/ws/trunk/apollo-cli/pom.xml>
[JENKINS] Archiving disabled - not archiving <https://builds.apache.org/job/ActiveMQ-Apollo/ws/trunk/apollo-cli/target/apollo-cli-1.0-SNAPSHOT.jar>
[INFO]
[INFO] ------------------------------------------------------------------------
[INFO] Building apollo-website 1.0-SNAPSHOT
[INFO] ------------------------------------------------------------------------
Downloading: http://download.java.net/maven/2/org/fusesource/scalate/scalate-wikitext/1.5.3/scalate-wikitext-1.5.3.pom
Downloading: http://maven.glassfish.org/content/groups/glassfish/org/fusesource/scalate/scalate-wikitext/1.5.3/scalate-wikitext-1.5.3.pom
Downloaded: http://maven.glassfish.org/content/groups/glassfish/org/fusesource/scalate/scalate-wikitext/1.5.3/scalate-wikitext-1.5.3.pom (3 KB at 1.9 KB/sec)
Downloading: http://download.java.net/maven/2/org/fusesource/scalate/scalate-page/1.5.3/scalate-page-1.5.3.pom
Downloading: http://maven.glassfish.org/content/groups/glassfish/org/fusesource/scalate/scalate-page/1.5.3/scalate-page-1.5.3.pom
Downloaded: http://maven.glassfish.org/content/groups/glassfish/org/fusesource/scalate/scalate-page/1.5.3/scalate-page-1.5.3.pom (3 KB at 3.2 KB/sec)
Downloading: http://download.java.net/maven/2/org/fusesource/scalate/scalate-wikitext/1.5.3/scalate-wikitext-1.5.3.jar
Downloading: http://download.java.net/maven/2/org/fusesource/scalate/scalate-page/1.5.3/scalate-page-1.5.3.jar
Downloading: http://maven.glassfish.org/content/groups/glassfish/org/fusesource/scalate/scalate-wikitext/1.5.3/scalate-wikitext-1.5.3.jar
Downloading: http://maven.glassfish.org/content/groups/glassfish/org/fusesource/scalate/scalate-page/1.5.3/scalate-page-1.5.3.jar
Downloaded: http://maven.glassfish.org/content/groups/glassfish/org/fusesource/scalate/scalate-page/1.5.3/scalate-page-1.5.3.jar (95 KB at 89.0 KB/sec)
Downloaded: http://maven.glassfish.org/content/groups/glassfish/org/fusesource/scalate/scalate-wikitext/1.5.3/scalate-wikitext-1.5.3.jar (159 KB at 133.6 KB/sec)
[INFO]
[INFO] --- maven-clean-plugin:2.4.1:clean (default-clean) @ apollo-website ---
[INFO]
[INFO] --- maven-enforcer-plugin:1.0:enforce (default) @ apollo-website ---
[INFO] [WARNING] Parameter tasks is deprecated, use target instead
[INFO] --- maven-antrun-plugin:1.6:run (default) @ apollo-website ---
[INFO] Executing tasks
main:
[mkdir] Created dir: <https://builds.apache.org/job/ActiveMQ-Apollo/ws/trunk/apollo-website/target/sitegen/documentation/schema>
[schemagen] Generating schema from 64 source files
Note: Writing <https://builds.apache.org/job/ActiveMQ-Apollo/ws/trunk/apollo-website/target/sitegen/documentation/schema/apollo.xsd>
[INFO] Executed tasks
[INFO]
[INFO] --- maven-remote-resources-plugin:1.1:process (default) @ apollo-website ---
[INFO] [INFO] Checking for multiple versions of scala
[INFO] --- maven-scala-plugin:2.15.2:compile (default) @ apollo-website ---
[INFO] includes = [**/*.scala,**/*.java,]
[INFO] excludes = []
[INFO] /x1/jenkins/jenkins-slave/workspace/ActiveMQ-Apollo/trunk/apollo-website/ext:-1: info: compiling
[INFO] Compiling 3 source files to /x1/jenkins/jenkins-slave/workspace/ActiveMQ-Apollo/trunk/apollo-website/target/classes at 1322078819161
[INFO] compiler plugin: BasicArtifact(org.scala-lang.plugins,continuations,2.9.1)
[INFO] compiler plugin: BasicArtifact(org.fusesource.jvmassert,jvmassert,1.2)
[INFO] prepare-compile in 0 s
[INFO] compile in 4 s
[INFO] [INFO] Checking for multiple versions of scala
[INFO] --- maven-scala-plugin:2.15.2:testCompile (default) @ apollo-website ---[INFO] includes = [**/*.scala,**/*.java,]
[INFO] excludes = []
[WARNING] No source files found.
[INFO]
[INFO] --- maven-enforcer-plugin:1.0:enforce (default) @ apollo-website ---
[JENKINS] Archiving disabled - not archiving <https://builds.apache.org/job/ActiveMQ-Apollo/ws/trunk/apollo-website/pom.xml>
ignoring exception during new ExecutedMojo null
[INFO]
[INFO] --- maven-source-plugin:2.1.2:jar (attach-sources) @ apollo-website ---
[INFO]
[INFO] --- maven-enforcer-plugin:1.0:enforce (default) @ apollo-website ---
[INFO] [WARNING] Parameter tasks is deprecated, use target instead
[INFO] --- maven-antrun-plugin:1.6:run (default) @ apollo-website ---
[INFO] Executing tasks
main:
[schemagen] Generating schema from 64 source files
Note: Writing <https://builds.apache.org/job/ActiveMQ-Apollo/ws/trunk/apollo-website/target/sitegen/documentation/schema/apollo.xsd>
[INFO] Executed tasks
[INFO]
[INFO] --- maven-remote-resources-plugin:1.1:process (default) @ apollo-website ---
[INFO] [INFO] Checking for multiple versions of scala
[INFO] --- maven-scala-plugin:2.15.2:compile (default) @ apollo-website ---
[INFO] includes = [**/*.scala,**/*.java,]
[INFO] excludes = []
[INFO] Nothing to compile - all classes are up to date
[INFO] [INFO] Checking for multiple versions of scala
[INFO] --- maven-scala-plugin:2.15.2:testCompile (default) @ apollo-website ---
[INFO] includes = [**/*.scala,**/*.java,]
[INFO] excludes = []
[WARNING] No source files found.
[INFO]
[INFO] --- maven-enforcer-plugin:1.0:enforce (default) @ apollo-website ---
[JENKINS] Archiving disabled - not archiving <https://builds.apache.org/job/ActiveMQ-Apollo/ws/trunk/apollo-website/pom.xml>
ignoring exception during new ExecutedMojo null
[INFO]
[INFO] --- maven-source-plugin:2.1.2:jar (attach-sources) @ apollo-website ---
[JENKINS] Archiving disabled - not archiving <https://builds.apache.org/job/ActiveMQ-Apollo/ws/trunk/apollo-website/pom.xml>
ignoring exception during new ExecutedMojo null
[INFO] Processing Configuration for child elements
Processing child [project]
Processing child [workingDirectory]
Processing child [webappDirectory]
Processing child [targetDirectory]
Processing child [testClassPathElements]
[INFO] Generating static website from Scalate Templates and wiki files...
[INFO] template properties: null
[INFO] --- maven-scalate-plugin:1.5.3:sitegen (sitegen) @ apollo-website ---
Using dir: <https://builds.apache.org/job/ActiveMQ-Apollo/ws/trunk/apollo-website/src/blog> at request path: /blog
[INFO] processing <https://builds.apache.org/job/ActiveMQ-Apollo/ws/trunk/apollo-website/src/blog/index.page> with uri: /blog/index.page =>
[INFO] processing <https://builds.apache.org/job/ActiveMQ-Apollo/ws/trunk/apollo-website/src/blog/releases/release-1-0-beta4.page> with uri: /blog/releases/release-1-0-beta4.page =>
[INFO] processing <https://builds.apache.org/job/ActiveMQ-Apollo/ws/trunk/apollo-website/src/blog/releases/release-1-0-beta2.page> with uri: /blog/releases/release-1-0-beta2.page =>
[INFO] processing <https://builds.apache.org/job/ActiveMQ-Apollo/ws/trunk/apollo-website/src/blog/releases/release-1-0-beta3.page> with uri: /blog/releases/release-1-0-beta3.page =>
[INFO] processing <https://builds.apache.org/job/ActiveMQ-Apollo/ws/trunk/apollo-website/src/blog/releases/release-1-0-beta1.page> with uri: /blog/releases/release-1-0-beta1.page =>
[INFO] processing <https://builds.apache.org/job/ActiveMQ-Apollo/ws/trunk/apollo-website/src/blog/releases/release-1-0-beta5.page> with uri: /blog/releases/release-1-0-beta5.page =>
Using dir: <https://builds.apache.org/job/ActiveMQ-Apollo/ws/trunk/apollo-website/src/blog> at request path: /blog
[INFO] processing <https://builds.apache.org/job/ActiveMQ-Apollo/ws/trunk/apollo-website/src/blog/index.rss.feed> with uri: /blog/index.rss.feed =>
[INFO] processing <https://builds.apache.org/job/ActiveMQ-Apollo/ws/trunk/apollo-website/src/index.page> with uri: /index.page =>
[INFO] processing <https://builds.apache.org/job/ActiveMQ-Apollo/ws/trunk/apollo-website/src/versions/index.page> with uri: /versions/index.page =>
[INFO] processing <https://builds.apache.org/job/ActiveMQ-Apollo/ws/trunk/apollo-website/src/documentation/verification.md> with uri: /documentation/verification.md =>
[INFO] processing <https://builds.apache.org/job/ActiveMQ-Apollo/ws/trunk/apollo-website/src/documentation/index.page> with uri: /documentation/index.page =>
[INFO] processing <https://builds.apache.org/job/ActiveMQ-Apollo/ws/trunk/apollo-website/src/documentation/module-organization.page> with uri: /documentation/module-organization.page =>
[INFO] processing <https://builds.apache.org/job/ActiveMQ-Apollo/ws/trunk/apollo-website/src/documentation/extending-guide.md> with uri: /documentation/extending-guide.md =>
[INFO] processing <https://builds.apache.org/job/ActiveMQ-Apollo/ws/trunk/apollo-website/src/documentation/performance-scaling.md> with uri: /documentation/performance-scaling.md =>
[INFO] processing <https://builds.apache.org/job/ActiveMQ-Apollo/ws/trunk/apollo-website/src/documentation/getting-started.md> with uri: /documentation/getting-started.md =>
[INFO] processing <https://builds.apache.org/job/ActiveMQ-Apollo/ws/trunk/apollo-website/src/documentation/user-manual.md> with uri: /documentation/user-manual.md =>
[INFO] processing <https://builds.apache.org/job/ActiveMQ-Apollo/ws/trunk/apollo-website/src/documentation/architecture.md> with uri: /documentation/architecture.md =>
[INFO] processing <https://builds.apache.org/job/ActiveMQ-Apollo/ws/trunk/apollo-website/src/documentation/management-api.md> with uri: /documentation/management-api.md =>
[INFO] processing <https://builds.apache.org/job/ActiveMQ-Apollo/ws/trunk/apollo-website/src/download.page> with uri: /download.page =>
[INFO] processing <https://builds.apache.org/job/ActiveMQ-Apollo/ws/trunk/apollo-website/src/community/release-guide.page> with uri: /community/release-guide.page =>
[INFO] processing <https://builds.apache.org/job/ActiveMQ-Apollo/ws/trunk/apollo-website/src/community/index.page> with uri: /community/index.page =>
[INFO] processing <https://builds.apache.org/job/ActiveMQ-Apollo/ws/trunk/apollo-website/src/community/faq.page> with uri: /community/faq.page =>
[INFO] processing <https://builds.apache.org/job/ActiveMQ-Apollo/ws/trunk/apollo-website/src/community/building.page> with uri: /community/building.page =>
[INFO] processing <https://builds.apache.org/job/ActiveMQ-Apollo/ws/trunk/apollo-website/src/community/site.page> with uri: /community/site.page =>
[INFO] processing <https://builds.apache.org/job/ActiveMQ-Apollo/ws/trunk/apollo-website/src/community/contributing.page> with uri: /community/contributing.page =>
[INFO] processing <https://builds.apache.org/job/ActiveMQ-Apollo/ws/trunk/apollo-website/src/community/source.page> with uri: /community/source.page =>
[INFO] processing <https://builds.apache.org/job/ActiveMQ-Apollo/ws/trunk/apollo-website/src/community/support.page> with uri: /community/support.page =>
[INFO] processing <https://builds.apache.org/job/ActiveMQ-Apollo/ws/trunk/apollo-website/src/community/developers.page> with uri: /community/developers.page =>
[INFO] processing <https://builds.apache.org/job/ActiveMQ-Apollo/ws/trunk/apollo-website/src/privacy-policy.page> with uri: /privacy-policy.page =>
[INFO] [INFO] Installing <https://builds.apache.org/job/ActiveMQ-Apollo/ws/trunk/apollo-website/pom.xml> to /home/jenkins/.m2/repository/org/apache/activemq/apollo-website/1.0-SNAPSHOT/apollo-website-1.0-SNAPSHOT.pom
[INFO] --- maven-install-plugin:2.3.1:install (default-install) @ apollo-website ---
[JENKINS] Archiving disabled - not archiving <https://builds.apache.org/job/ActiveMQ-Apollo/ws/trunk/apollo-website/pom.xml>
[INFO]
[INFO] ------------------------------------------------------------------------
[INFO] Skipping apache-apollo
[INFO] This project has been banned from the build due to previous failures.
[INFO] ------------------------------------------------------------------------
[INFO]
[INFO] ------------------------------------------------------------------------
[INFO] Building apollo-karaf-feature 1.0-SNAPSHOT
[INFO] ------------------------------------------------------------------------
[INFO]
[INFO] --- maven-clean-plugin:2.4.1:clean (default-clean) @ apollo-karaf-feature ---
[INFO]
[INFO] --- maven-enforcer-plugin:1.0:enforce (default) @ apollo-karaf-feature ---
[INFO]
[INFO] --- maven-remote-resources-plugin:1.1:process (default) @ apollo-karaf-feature ---
[INFO] [INFO] Using 'UTF-8' encoding to copy filtered resources.
[INFO] Copying 1 resource
[INFO] Copying 3 resources
[INFO] --- maven-resources-plugin:2.4.3:resources (filter) @ apollo-karaf-feature ---
[INFO]
[INFO] --- build-helper-maven-plugin:1.2:attach-artifact (attach-artifacts) @ apollo-karaf-feature ---
[INFO] [INFO] Installing <https://builds.apache.org/job/ActiveMQ-Apollo/ws/trunk/apollo-karaf-feature/pom.xml> to /home/jenkins/.m2/repository/org/apache/activemq/apollo-karaf-feature/1.0-SNAPSHOT/apollo-karaf-feature-1.0-SNAPSHOT.pom
[INFO] --- maven-install-plugin:2.3.1:install (default-install) @ apollo-karaf-feature ---
[INFO] Installing <https://builds.apache.org/job/ActiveMQ-Apollo/ws/trunk/apollo-karaf-feature/target/classes/features.xml> to /home/jenkins/.m2/repository/org/apache/activemq/apollo-karaf-feature/1.0-SNAPSHOT/apollo-karaf-feature-1.0-SNAPSHOT-features.xml
[JENKINS] Archiving disabled - not archiving <https://builds.apache.org/job/ActiveMQ-Apollo/ws/trunk/apollo-karaf-feature/pom.xml>
[JENKINS] Archiving disabled - not archiving <https://builds.apache.org/job/ActiveMQ-Apollo/ws/trunk/apollo-karaf-feature/target/classes/features.xml>
[INFO] ------------------------------------------------------------------------
[INFO] Reactor Summary:
[INFO]
[INFO] Apache ActiveMQ Apollo Project .................... SUCCESS [2.672s]
[INFO] apollo-boot ....................................... SUCCESS [2.279s]
[INFO] apollo-scala ...................................... SUCCESS [1.327s]
[INFO] apollo-util ....................................... SUCCESS [36.164s]
[INFO] apollo-transport .................................. SUCCESS [8.798s]
[INFO] apollo-dto ........................................ SUCCESS [4.319s]
[INFO] apollo-selector ................................... SUCCESS [2.764s]
[INFO] apollo-broker ..................................... SUCCESS [46.133s]
[INFO] apollo-tcp ........................................ SUCCESS [6.449s]
[INFO] apollo-web ........................................ SUCCESS [1:01.131s]
[INFO] apollo-leveldb .................................... FAILURE [12.164s]
[INFO] apollo-bdb ........................................ SUCCESS [33.331s]
[INFO] apollo-jdbm2 ...................................... SUCCESS [36.499s]
[INFO] apollo-stomp ...................................... SUCCESS [48.546s]
[INFO] apollo-cli ........................................ SUCCESS [13.045s]
[INFO] apollo-website .................................... SUCCESS [21.693s]
[INFO] apache-apollo ..................................... SKIPPED
[INFO] apollo-karaf-feature .............................. SUCCESS [0.443s]
[INFO] ------------------------------------------------------------------------
[INFO] BUILD FAILURE
[INFO] ------------------------------------------------------------------------
[INFO] Total time: 5:48.663s
[INFO] Finished at: Wed Nov 23 20:07:16 UTC 2011
[INFO] Final Memory: 282M/1104M
[INFO] ------------------------------------------------------------------------
mavenExecutionResult exceptions not empty
message : Failed to execute goal on project apollo-leveldb: Could not resolve dependencies for project org.apache.activemq:apollo-leveldb:jar:1.0-SNAPSHOT: Could not find artifact org.iq80.leveldb:leveldb:jar:0.1-SNAPSHOT in Nexus (http://repository.apache.org/snapshots)
cause : Could not resolve dependencies for project org.apache.activemq:apollo-leveldb:jar:1.0-SNAPSHOT: Could not find artifact org.iq80.leveldb:leveldb:jar:0.1-SNAPSHOT in Nexus (http://repository.apache.org/snapshots)
Stack trace :
org.apache.maven.lifecycle.LifecycleExecutionException: Failed to execute goal on project apollo-leveldb: Could not resolve dependencies for project org.apache.activemq:apollo-leveldb:jar:1.0-SNAPSHOT: Could not find artifact org.iq80.leveldb:leveldb:jar:0.1-SNAPSHOT in Nexus (http://repository.apache.org/snapshots)
at org.apache.maven.lifecycle.internal.LifecycleDependencyResolver.getDependencies(LifecycleDependencyResolver.java:190)
at org.apache.maven.lifecycle.internal.LifecycleDependencyResolver.resolveProjectDependencies(LifecycleDependencyResolver.java:104)
at org.apache.maven.lifecycle.internal.MojoExecutor.ensureDependenciesAreResolved(MojoExecutor.java:258)
at org.apache.maven.lifecycle.internal.MojoExecutor.execute(MojoExecutor.java:201)
at org.apache.maven.lifecycle.internal.MojoExecutor.execute(MojoExecutor.java:153)
at org.apache.maven.lifecycle.internal.MojoExecutor.execute(MojoExecutor.java:145)
at org.apache.maven.lifecycle.internal.LifecycleModuleBuilder.buildProject(LifecycleModuleBuilder.java:84)
at org.apache.maven.lifecycle.internal.LifecycleModuleBuilder.buildProject(LifecycleModuleBuilder.java:59)
at org.apache.maven.lifecycle.internal.LifecycleStarter.singleThreadedBuild(LifecycleStarter.java:183)
at org.apache.maven.lifecycle.internal.LifecycleStarter.execute(LifecycleStarter.java:161)
at org.apache.maven.DefaultMaven.doExecute(DefaultMaven.java:319)
at org.apache.maven.DefaultMaven.execute(DefaultMaven.java:156)
at org.jvnet.hudson.maven3.launcher.Maven3Launcher.main(Maven3Launcher.java:79)
at sun.reflect.NativeMethodAccessorImpl.invoke0(Native Method)
at sun.reflect.NativeMethodAccessorImpl.invoke(NativeMethodAccessorImpl.java:39)
at sun.reflect.DelegatingMethodAccessorImpl.invoke(DelegatingMethodAccessorImpl.java:25)
at java.lang.reflect.Method.invoke(Method.java:597)
at org.codehaus.plexus.classworlds.launcher.Launcher.launchStandard(Launcher.java:329)
at org.codehaus.plexus.classworlds.launcher.Launcher.launch(Launcher.java:239)
at org.jvnet.hudson.maven3.agent.Maven3Main.launch(Maven3Main.java:158)
at hudson.maven.Maven3Builder.call(Maven3Builder.java:122)
at hudson.maven.Maven3Builder.call(Maven3Builder.java:74)
at hudson.remoting.UserRequest.perform(UserRequest.java:118)
at hudson.remoting.UserRequest.perform(UserRequest.java:48)
at hudson.remoting.Request$2.run(Request.java:287)
at java.util.concurrent.Executors$RunnableAdapter.call(Executors.java:441)
at java.util.concurrent.FutureTask$Sync.innerRun(FutureTask.java:303)
at java.util.concurrent.FutureTask.run(FutureTask.java:138)
at java.util.concurrent.ThreadPoolExecutor$Worker.runTask(ThreadPoolExecutor.java:886)
at java.util.concurrent.ThreadPoolExecutor$Worker.run(ThreadPoolExecutor.java:908)
at java.lang.Thread.run(Thread.java:662)
Caused by: org.apache.maven.project.DependencyResolutionException: Could not resolve dependencies for project org.apache.activemq:apollo-leveldb:jar:1.0-SNAPSHOT: Could not find artifact org.iq80.leveldb:leveldb:jar:0.1-SNAPSHOT in Nexus (http://repository.apache.org/snapshots)
at org.apache.maven.project.DefaultProjectDependenciesResolver.resolve(DefaultProjectDependenciesResolver.java:156)
at org.apache.maven.lifecycle.internal.LifecycleDependencyResolver.getDependencies(LifecycleDependencyResolver.java:165)
... 30 more
Caused by: org.sonatype.aether.resolution.ArtifactResolutionException: Could not find artifact org.iq80.leveldb:leveldb:jar:0.1-SNAPSHOT in Nexus (http://repository.apache.org/snapshots)
at org.sonatype.aether.impl.internal.DefaultArtifactResolver.resolveArtifacts(DefaultArtifactResolver.java:526)
at org.sonatype.aether.impl.internal.DefaultRepositorySystem.resolveArtifacts(DefaultRepositorySystem.java:304)
at org.sonatype.aether.impl.internal.DefaultRepositorySystem.resolveDependencies(DefaultRepositorySystem.java:334)
at org.apache.maven.project.DefaultProjectDependenciesResolver.resolve(DefaultProjectDependenciesResolver.java:150)
... 31 more
Caused by: org.sonatype.aether.transfer.ArtifactNotFoundException: Could not find artifact org.iq80.leveldb:leveldb:jar:0.1-SNAPSHOT in Nexus (http://repository.apache.org/snapshots)
at org.sonatype.aether.connector.wagon.WagonRepositoryConnector$4.wrap(WagonRepositoryConnector.java:945)
at org.sonatype.aether.connector.wagon.WagonRepositoryConnector$4.wrap(WagonRepositoryConnector.java:940)
at org.sonatype.aether.connector.wagon.WagonRepositoryConnector$GetTask.flush(WagonRepositoryConnector.java:696)
at org.sonatype.aether.connector.wagon.WagonRepositoryConnector$GetTask.flush(WagonRepositoryConnector.java:690)
at org.sonatype.aether.connector.wagon.WagonRepositoryConnector.get(WagonRepositoryConnector.java:435)
at org.sonatype.aether.impl.internal.DefaultArtifactResolver.resolveArtifacts(DefaultArtifactResolver.java:438)
... 34 more
Sending e-mails to: commits@activemq.apache.org
channel stopped