You are viewing a plain text version of this content. The canonical link for it is here.
Posted to dev@juneau.apache.org by Apache Jenkins Server <je...@builds.apache.org> on 2026/10/16 14:51:09 UTC

Build failed in Jenkins: Juneau » Juneau-Java-17 #2749

See <https://ci-builds.apache.org/job/Juneau/job/Juneau-Java-17/2749/display/redirect?page=changes>

Changes:

[James Bognar] Fix order-dependent StoreRest failure: species/status chart endpoints skip pets with a null species or status instead of 500ing, and StoreRest_Test tolerates them


------------------------------------------
[...truncated 1.72 MiB...]
[INFO] --- apache-rat:0.16.1:check (default) @ juneau-rest-client-mcp-auth ---
[INFO] Rat check: Summary over all files. Unapproved: 0, unknown: 0, generated: 0, approved: 38 licenses.
[INFO] 
[INFO] --- install:3.1.4:install (default-install) @ juneau-rest-client-mcp-auth ---
[INFO] Installing <https://ci-builds.apache.org/job/Juneau/job/Juneau-Java-17/ws/juneau-rest/juneau-rest-client-mcp-auth/pom.xml> to /home/jenkins/.m2/repository/org/apache/juneau/juneau-rest-client-mcp-auth/10.0.0-SNAPSHOT/juneau-rest-client-mcp-auth-10.0.0-SNAPSHOT.pom
[INFO] Installing <https://ci-builds.apache.org/job/Juneau/job/Juneau-Java-17/ws/juneau-rest/juneau-rest-client-mcp-auth/target/juneau-rest-client-mcp-auth-10.0.0-SNAPSHOT.jar> to /home/jenkins/.m2/repository/org/apache/juneau/juneau-rest-client-mcp-auth/10.0.0-SNAPSHOT/juneau-rest-client-mcp-auth-10.0.0-SNAPSHOT.jar
[INFO] Installing <https://ci-builds.apache.org/job/Juneau/job/Juneau-Java-17/ws/juneau-rest/juneau-rest-client-mcp-auth/target/juneau-rest-client-mcp-auth-10.0.0-SNAPSHOT-sources.jar> to /home/jenkins/.m2/repository/org/apache/juneau/juneau-rest-client-mcp-auth/10.0.0-SNAPSHOT/juneau-rest-client-mcp-auth-10.0.0-SNAPSHOT-sources.jar
[INFO] 
[INFO] --- bundle:6.2.0:install (default-install) @ juneau-rest-client-mcp-auth ---
[INFO] Installing org/apache/juneau/juneau-rest-client-mcp-auth/10.0.0-SNAPSHOT/juneau-rest-client-mcp-auth-10.0.0-SNAPSHOT.jar
[INFO] Writing OBR metadata
[INFO] 
[INFO] --- deploy:3.1.4:deploy (default-deploy) @ juneau-rest-client-mcp-auth ---
Downloading from apache.snapshots.https: https://repository.apache.org/content/repositories/snapshots/org/apache/juneau/juneau-rest-client-mcp-auth/10.0.0-SNAPSHOT/maven-metadata.xml
Progress (1): 1.0 kB                    Downloaded from apache.snapshots.https: https://repository.apache.org/content/repositories/snapshots/org/apache/juneau/juneau-rest-client-mcp-auth/10.0.0-SNAPSHOT/maven-metadata.xml (1.0 kB at 1.9 kB/s)
Uploading to apache.snapshots.https: https://repository.apache.org/content/repositories/snapshots/org/apache/juneau/juneau-rest-client-mcp-auth/10.0.0-SNAPSHOT/juneau-rest-client-mcp-auth-10.0.0-20261016.140052-136.pom
Progress (1): 5.2 kB                    Uploaded to apache.snapshots.https: https://repository.apache.org/content/repositories/snapshots/org/apache/juneau/juneau-rest-client-mcp-auth/10.0.0-SNAPSHOT/juneau-rest-client-mcp-auth-10.0.0-20261016.140052-136.pom (5.2 kB at 5.0 kB/s)
Uploading to apache.snapshots.https: https://repository.apache.org/content/repositories/snapshots/org/apache/juneau/juneau-rest-client-mcp-auth/10.0.0-SNAPSHOT/juneau-rest-client-mcp-auth-10.0.0-20261016.140052-136.jar
Uploading to apache.snapshots.https: https://repository.apache.org/content/repositories/snapshots/org/apache/juneau/juneau-rest-client-mcp-auth/10.0.0-SNAPSHOT/juneau-rest-client-mcp-auth-10.0.0-20261016.140052-136-sources.jar
Progress (1): 33/78 kBProgress (1): 66/78 kBProgress (1): 78 kB   Progress (2): 78 kB | 33/64 kBProgress (2): 78 kB | 64 kB                              Uploaded to apache.snapshots.https: https://repository.apache.org/content/repositories/snapshots/org/apache/juneau/juneau-rest-client-mcp-auth/10.0.0-SNAPSHOT/juneau-rest-client-mcp-auth-10.0.0-20261016.140052-136.jar (78 kB at 56 kB/s)
Uploaded to apache.snapshots.https: https://repository.apache.org/content/repositories/snapshots/org/apache/juneau/juneau-rest-client-mcp-auth/10.0.0-SNAPSHOT/juneau-rest-client-mcp-auth-10.0.0-20261016.140052-136-sources.jar (64 kB at 37 kB/s)
Downloading from apache.snapshots.https: https://repository.apache.org/content/repositories/snapshots/org/apache/juneau/juneau-rest-client-mcp-auth/maven-metadata.xml
Progress (1): 305 B                   Downloaded from apache.snapshots.https: https://repository.apache.org/content/repositories/snapshots/org/apache/juneau/juneau-rest-client-mcp-auth/maven-metadata.xml (305 B at 1.7 kB/s)
Uploading to apache.snapshots.https: https://repository.apache.org/content/repositories/snapshots/org/apache/juneau/juneau-rest-client-mcp-auth/10.0.0-SNAPSHOT/maven-metadata.xml
Progress (1): 1.0 kB                    Uploaded to apache.snapshots.https: https://repository.apache.org/content/repositories/snapshots/org/apache/juneau/juneau-rest-client-mcp-auth/10.0.0-SNAPSHOT/maven-metadata.xml (1.0 kB at 972 B/s)
Uploading to apache.snapshots.https: https://repository.apache.org/content/repositories/snapshots/org/apache/juneau/juneau-rest-client-mcp-auth/maven-metadata.xml
Progress (1): 305 B                   Uploaded to apache.snapshots.https: https://repository.apache.org/content/repositories/snapshots/org/apache/juneau/juneau-rest-client-mcp-auth/maven-metadata.xml (305 B at 290 B/s)
[INFO] 
[INFO] --- bundle:6.2.0:deploy (default-deploy) @ juneau-rest-client-mcp-auth ---
[INFO] Remote OBR update disabled (enable with -DremoteOBR)
[INFO] 
[INFO] -----< org.apache.juneau:juneau-rest-client-apache-httpclient-45 >------
[INFO] Building Apache Juneau NG REST Client — Apache HttpClient 4.5 Transport 10.0.0-SNAPSHOT [73/101]
[INFO]   from juneau-rest/juneau-rest-client-apache-httpclient-45/pom.xml
[INFO] -------------------------------[ bundle ]-------------------------------
[INFO] 
[INFO] --- clean:3.5.0:clean (default-clean) @ juneau-rest-client-apache-httpclient-45 ---
[INFO] Deleting <https://ci-builds.apache.org/job/Juneau/job/Juneau-Java-17/ws/juneau-rest/juneau-rest-client-apache-httpclient-45/target>
[INFO] 
[INFO] --- enforcer:3.6.2:enforce (enforce-maven-version) @ juneau-rest-client-apache-httpclient-45 ---
[INFO] 
[INFO] --- enforcer:3.6.2:enforce (enforce-java-version) @ juneau-rest-client-apache-httpclient-45 ---
[INFO] 
[INFO] --- enforcer:3.6.2:enforce (enforce-maven) @ juneau-rest-client-apache-httpclient-45 ---
[INFO] 
[INFO] --- jacoco:0.8.15:prepare-agent (prepare-agent) @ juneau-rest-client-apache-httpclient-45 ---
[INFO] argLine set to -javaagent:/home/jenkins/.m2/repository/org/jacoco/org.jacoco.agent/0.8.15/org.jacoco.agent-0.8.15-runtime.jar=destfile=<https://ci-builds.apache.org/job/Juneau/job/Juneau-Java-17/ws/juneau-rest/juneau-rest-client-apache-httpclient-45/target/jacoco.exec>
[INFO] 
[INFO] --- remote-resources:3.3.0:process (process-resource-bundles) @ juneau-rest-client-apache-httpclient-45 ---
[INFO] Preparing remote bundle org.apache.apache.resources:apache-jar-resource-bundle:1.7
[INFO] Copying 3 resources from 1 bundle.
[INFO] 
[INFO] --- resources:3.4.0:resources (default-resources) @ juneau-rest-client-apache-httpclient-45 ---
[INFO] Copying 1 resource from src/main/resources to target/classes
[INFO] Copying 3 resources from target/maven-shared-archive-resources to target/classes
[INFO] 
[INFO] --- compiler:3.16.0:compile (default-compile) @ juneau-rest-client-apache-httpclient-45 ---
[INFO] Recompiling the module because of changed dependency.
[INFO] Compiling 6 source files with javac [debug release 17] to target/classes
[INFO] 
[INFO] --- bundle:6.2.0:manifest (bundle-manifest) @ juneau-rest-client-apache-httpclient-45 ---
[INFO] No MANIFEST.MF file found, generating manifest.
[INFO] Writing manifest: <https://ci-builds.apache.org/job/Juneau/job/Juneau-Java-17/ws/juneau-rest/juneau-rest-client-apache-httpclient-45/target/classes/META-INF/MANIFEST.MF>
[INFO] 
[INFO] --- resources:3.4.0:testResources (default-testResources) @ juneau-rest-client-apache-httpclient-45 ---
[INFO] skip non existing resourceDirectory <https://ci-builds.apache.org/job/Juneau/job/Juneau-Java-17/ws/juneau-rest/juneau-rest-client-apache-httpclient-45/src/test/resources>
[INFO] Copying 3 resources from target/maven-shared-archive-resources to target/test-classes
[INFO] 
[INFO] --- compiler:3.16.0:testCompile (default-testCompile) @ juneau-rest-client-apache-httpclient-45 ---
[INFO] Recompiling the module because of changed dependency.
[INFO] Compiling 10 source files with javac [debug release 17] to target/test-classes
[INFO] 
[INFO] --- surefire:3.5.4:test (default-test) @ juneau-rest-client-apache-httpclient-45 ---
[INFO] Using auto detected provider org.apache.maven.surefire.junitplatform.JUnitPlatformProvider
[WARNING] The system property java.util.logging.config.file is configured twice! The property appears in <argLine/> and any of <systemPropertyVariables/>, <systemProperties/> or user property.
[INFO] 
[INFO] -------------------------------------------------------
[INFO]  T E S T S
[INFO] -------------------------------------------------------
[INFO] Running org.apache.juneau.rest.client.ApacheHc45Transport_CallerClientRedirectCredentials_Test
[ERROR] Tests run: 7, Failures: 1, Errors: 0, Skipped: 0, Time elapsed: 1.615 s <<< FAILURE! -- in org.apache.juneau.rest.client.ApacheHc45Transport_CallerClientRedirectCredentials_Test
[ERROR] org.apache.juneau.rest.client.ApacheHc45Transport_CallerClientRedirectCredentials_Test.a07_originBackToFirstOrigin_callerClient_credentialsStayStripped -- Time elapsed: 0.031 s <<< FAILURE!
org.opentest4j.AssertionFailedError: expected: <auth=none|cookie=none|key=none|trace=t-1> but was: <auth=Bearer secret-token|cookie=session=abc123|key=k-1|trace=t-1>
	at org.junit.jupiter.api.AssertionFailureBuilder.build(AssertionFailureBuilder.java:158)
	at org.junit.jupiter.api.AssertionFailureBuilder.buildAndThrow(AssertionFailureBuilder.java:139)
	at org.junit.jupiter.api.AssertEquals.failNotEqual(AssertEquals.java:201)
	at org.junit.jupiter.api.AssertEquals.assertEquals(AssertEquals.java:184)
	at org.junit.jupiter.api.AssertEquals.assertEquals(AssertEquals.java:179)
	at org.junit.jupiter.api.Assertions.assertEquals(Assertions.java:1188)
	at org.apache.juneau.rest.client.ApacheHc45Transport_CallerClientRedirectCredentials_Test.a07_originBackToFirstOrigin_callerClient_credentialsStayStripped(ApacheHc45Transport_CallerClientRedirectCredentials_Test.java:178)

[INFO] Running org.apache.juneau.rest.client.ApacheHc45Transport_SsrfGuard_Test
[INFO] Tests run: 6, Failures: 0, Errors: 0, Skipped: 0, Time elapsed: 0.174 s -- in org.apache.juneau.rest.client.ApacheHc45Transport_SsrfGuard_Test
[INFO] Running org.apache.juneau.rest.client.ApacheHc45Transport_Test
[INFO] Tests run: 17, Failures: 0, Errors: 0, Skipped: 0, Time elapsed: 0.234 s -- in org.apache.juneau.rest.client.ApacheHc45Transport_Test
[INFO] Running org.apache.juneau.rest.client.ApacheHc45Transport_ErrorPaths_Test
[INFO] Tests run: 7, Failures: 0, Errors: 0, Skipped: 0, Time elapsed: 0.044 s -- in org.apache.juneau.rest.client.ApacheHc45Transport_ErrorPaths_Test
[INFO] Running org.apache.juneau.rest.client.ApacheHc45Transport_RedirectCredentials_Test
[INFO] Tests run: 3, Failures: 0, Errors: 0, Skipped: 0, Time elapsed: 0.068 s -- in org.apache.juneau.rest.client.ApacheHc45Transport_RedirectCredentials_Test
[INFO] Running org.apache.juneau.rest.client.apachehttpclient45.Hc45RedirectCredentialGuard_Test
[INFO] Tests run: 8, Failures: 0, Errors: 0, Skipped: 0, Time elapsed: 0.022 s -- in org.apache.juneau.rest.client.apachehttpclient45.Hc45RedirectCredentialGuard_Test
[INFO] Running org.apache.juneau.rest.client.apachehttpclient45.ApacheHc45Transport_TransportBodyEntity_Test
[INFO] Tests run: 2, Failures: 0, Errors: 0, Skipped: 0, Time elapsed: 0.009 s -- in org.apache.juneau.rest.client.apachehttpclient45.ApacheHc45Transport_TransportBodyEntity_Test
[INFO] Running org.apache.juneau.rest.client.apachehttpclient45.ApacheHc45Transport_Policy_Test
[INFO] Tests run: 9, Failures: 0, Errors: 0, Skipped: 0, Time elapsed: 0.030 s -- in org.apache.juneau.rest.client.apachehttpclient45.ApacheHc45Transport_Policy_Test
[INFO] Running org.apache.juneau.rest.client.ApacheHc45Transport_StaleConnectionRetry_Test
[INFO] Tests run: 2, Failures: 0, Errors: 0, Skipped: 0, Time elapsed: 0.042 s -- in org.apache.juneau.rest.client.ApacheHc45Transport_StaleConnectionRetry_Test
[INFO] Running org.apache.juneau.rest.client.ApacheHc45Transport_Timeout_Test
[INFO] Tests run: 5, Failures: 0, Errors: 0, Skipped: 0, Time elapsed: 4.285 s -- in org.apache.juneau.rest.client.ApacheHc45Transport_Timeout_Test
[INFO] 
[INFO] Results:
[INFO] 
[ERROR] Failures: 
[ERROR]   ApacheHc45Transport_CallerClientRedirectCredentials_Test.a07_originBackToFirstOrigin_callerClient_credentialsStayStripped:178 expected: <auth=none|cookie=none|key=none|trace=t-1> but was: <auth=Bearer secret-token|cookie=session=abc123|key=k-1|trace=t-1>
[INFO] 
[ERROR] Tests run: 66, Failures: 1, Errors: 0, Skipped: 0
[INFO] 
[INFO] 
[INFO] ------------------------------------------------------------------------
[INFO] Skipping Apache Juneau
[INFO] This project has been banned from the build due to previous failures.
[INFO] ------------------------------------------------------------------------
[INFO] ------------------------------------------------------------------------
[INFO] Reactor Summary for Apache Juneau 10.0.0-SNAPSHOT:
[INFO] 
[INFO] Apache Juneau ...................................... SUCCESS [ 52.930 s]
[INFO] Apache Juneau Bill of Materials .................... SUCCESS [  3.781 s]
[INFO] Apache Juneau Core ................................. SUCCESS [  8.836 s]
[INFO] Apache Juneau Commons .............................. SUCCESS [02:13 min]
[INFO] Apache Juneau Test Utilities ....................... SUCCESS [  6.737 s]
[INFO] Apache Juneau Testing Toolkit ...................... SUCCESS [ 33.864 s]
[INFO] Apache Juneau Marshall ............................. SUCCESS [05:10 min]
[INFO] Apache Juneau Beans ................................ SUCCESS [  4.953 s]
[INFO] Apache Juneau RFC 7807 Beans ....................... SUCCESS [ 14.402 s]
[INFO] Apache Juneau Marshall Test Utilities .............. SUCCESS [ 10.229 s]
[INFO] Apache Juneau REST ................................. SUCCESS [ 10.208 s]
[INFO] Apache Juneau REST Common .......................... SUCCESS [ 39.025 s]
[INFO] Apache Juneau Config ............................... SUCCESS [ 25.933 s]
[INFO] Apache Juneau Common Beans ......................... SUCCESS [ 19.434 s]
[INFO] Apache Juneau HTML5 Beans .......................... SUCCESS [ 50.031 s]
[INFO] Apache Juneau JSON Schema Beans .................... SUCCESS [ 21.732 s]
[INFO] Apache Juneau Swagger 2.0 Beans .................... SUCCESS [ 23.932 s]
[INFO] Apache Juneau OpenAPI 3.0 Beans .................... SUCCESS [ 26.502 s]
[INFO] Apache Juneau REST Server .......................... SUCCESS [01:19 min]
[INFO] Apache Juneau REST Client .......................... SUCCESS [ 32.682 s]
[INFO] Apache Juneau REST Common (Classic) ................ SUCCESS [ 38.044 s]
[INFO] Apache Juneau REST Client (Classic) ................ SUCCESS [ 35.882 s]
[INFO] Apache Juneau REST Mock ............................ SUCCESS [ 34.858 s]
[INFO] Apache Juneau Microservices ........................ SUCCESS [  4.339 s]
[INFO] Apache Juneau Microservice ......................... SUCCESS [ 44.857 s]
[INFO] Apache Juneau REST Server Message Bus .............. SUCCESS [ 32.047 s]
[INFO] Apache Juneau REST Server Bus WebSocket ............ SUCCESS [ 29.370 s]
[INFO] Apache Juneau Microservice Jetty ................... SUCCESS [01:03 min]
[INFO] Apache Juneau Dependency Bundles ................... SUCCESS [  3.660 s]
[INFO] Apache Juneau Jetty Microservice Bundle ............ SUCCESS [  4.281 s]
[INFO] Apache Juneau Microservice Tomcat .................. SUCCESS [ 24.211 s]
[INFO] Apache Juneau Tomcat Microservice Bundle ........... SUCCESS [  4.277 s]
[INFO] Apache Juneau REST Server Spring Boot .............. SUCCESS [ 54.541 s]
[INFO] Apache Juneau Spring Boot Bundle ................... SUCCESS [  4.132 s]
[INFO] Apache Juneau REST Server Micrometer ............... SUCCESS [ 33.107 s]
[INFO] Apache Juneau REST Server OpenTelemetry ............ SUCCESS [ 26.844 s]
[INFO] Apache Juneau OTLP Observability Bundle ............ SUCCESS [  4.063 s]
[INFO] Apache Juneau BeanQuery SQL ........................ SUCCESS [ 14.171 s]
[INFO] Apache Juneau BeanQuery Postgres ................... SUCCESS [  9.758 s]
[INFO] juneau/core/marshall-rdf ........................... SUCCESS [01:42 min]
[INFO] Apache Juneau REST Server RDF ...................... SUCCESS [ 10.741 s]
[INFO] Apache Juneau JSON-RPC Beans ....................... SUCCESS [ 14.356 s]
[INFO] Apache Juneau REST Server MCP ...................... SUCCESS [ 41.736 s]
[INFO] Apache Juneau MCP Beans (2025-06-18) ............... SUCCESS [ 17.095 s]
[INFO] Apache Juneau REST Server MCP (2025-06-18) ......... SUCCESS [01:09 min]
[INFO] Apache Juneau MCP Beans (2026-07-28) ............... SUCCESS [ 22.864 s]
[INFO] Apache Juneau REST Server Reactive Streams Core .... SUCCESS [ 20.759 s]
[INFO] Apache Juneau REST Auth OAuth Flow ................. SUCCESS [ 14.149 s]
[INFO] Apache Juneau REST Server JWT ...................... SUCCESS [ 35.659 s]
[INFO] Apache Juneau REST Server OAuth .................... SUCCESS [ 20.451 s]
[INFO] Apache Juneau REST Server MCP (2026-07-28) ......... SUCCESS [02:01 min]
[INFO] Apache Juneau REST Server SAML ..................... SUCCESS [01:22 min]
[INFO] Apache Juneau REST Server OIDC Relying Party ....... SUCCESS [ 51.111 s]
[INFO] Apache Juneau REST Server Logging Backends ......... SUCCESS [ 16.703 s]
[INFO] Apache Juneau REST Server DataTables ............... SUCCESS [ 23.395 s]
[INFO] Apache Juneau Run Report ........................... SUCCESS [ 18.664 s]
[INFO] Apache Juneau REST Server Widgets .................. SUCCESS [ 44.270 s]
[INFO] Apache Juneau REST Server Console UI ............... SUCCESS [01:23 min]
[INFO] Apache Juneau REST Server Views .................... SUCCESS [03:03 min]
[INFO] Apache Juneau REST Server Views Markdown ........... SUCCESS [ 12.653 s]
[INFO] Apache Juneau REST Server Terminal ................. SUCCESS [ 34.932 s]
[INFO] Apache Juneau REST Server View — FreeMarker ........ SUCCESS [ 43.712 s]
[INFO] Apache Juneau REST Server Console UI — FreeMarker .. SUCCESS [04:48 min]
[INFO] Apache Juneau REST Server Terminal Bus ............. SUCCESS [ 17.184 s]
[INFO] Apache Juneau REST Server Reactive Streams ......... SUCCESS [ 18.215 s]
[INFO] Apache Juneau REST Server View — JSP ............... SUCCESS [ 57.588 s]
[INFO] Apache Juneau REST Server View — Thymeleaf ......... SUCCESS [ 35.789 s]
[INFO] Apache Juneau REST Server View — Mustache .......... SUCCESS [ 35.499 s]
[INFO] Apache Juneau REST Client MCP ...................... SUCCESS [ 17.297 s]
[INFO] Apache Juneau REST Client MCP (2025-06-18) ......... SUCCESS [ 17.404 s]
[INFO] Apache Juneau REST Client MCP (2026-07-28) ......... SUCCESS [ 20.299 s]
[INFO] Apache Juneau REST Client MCP Auth ................. SUCCESS [ 21.959 s]
[INFO] Apache Juneau NG REST Client — Apache HttpClient 4.5 Transport FAILURE [  9.947 s]
[INFO] Apache Juneau NG REST Client — Apache HttpClient 5.x Transport SKIPPED
[INFO] Apache Juneau NG REST Client — OkHttp Transport .... SKIPPED
[INFO] Apache Juneau NG REST Client — Jetty HttpClient Transport SKIPPED
[INFO] Apache Juneau Microservice Test Support ............ SKIPPED
[INFO] Apache Juneau Microservice Examples ................ SKIPPED
[INFO] Apache Juneau Server Config ........................ SKIPPED
[INFO] Apache Juneau Server Config Server ................. SKIPPED
[INFO] Apache Juneau Secret Store - macOS Keychain ........ SKIPPED
[INFO] Apache Juneau Run Wrapper .......................... SKIPPED
[INFO] Apache Juneau Atom Beans ........................... SKIPPED
[INFO] Apache Juneau Examples ............................. SKIPPED
[INFO] Apache Juneau Core Examples ........................ SKIPPED
[INFO] Apache Juneau MCP Examples ......................... SKIPPED
[INFO] Apache Juneau Petstore ............................. SKIPPED
[INFO] Apache Juneau Petstore Core ........................ SKIPPED
[INFO] Apache Juneau Petstore Jetty ....................... SKIPPED
[INFO] Apache Juneau Petstore Spring Boot ................. SKIPPED
[INFO] Apache Juneau HAL Beans ............................ SKIPPED
[INFO] Apache Juneau JSON:API Beans ....................... SKIPPED
[INFO] Apache Juneau JSON Patch Beans ..................... SKIPPED
[INFO] Apache Juneau Integration Tests .................... SKIPPED
[INFO] Apache Juneau Shaded Artifacts ..................... SKIPPED
[INFO] Apache Juneau Core (Shaded) ........................ SKIPPED
[INFO] Apache Juneau REST Client (Shaded) ................. SKIPPED
[INFO] Apache Juneau REST Server (Shaded) ................. SKIPPED
[INFO] Apache Juneau REST Server Spring Boot (Shaded) ..... SKIPPED
[INFO] Apache Juneau All (Shaded) ......................... SKIPPED
[INFO] Apache Juneau Distribution ......................... SKIPPED
[INFO] ------------------------------------------------------------------------
[INFO] BUILD FAILURE
[INFO] ------------------------------------------------------------------------
[INFO] Total time:  50:02 min
[INFO] Finished at: 2026-10-16T14:50:54Z
[INFO] ------------------------------------------------------------------------
[ERROR] Failed to execute goal org.apache.maven.plugins:maven-surefire-plugin:3.5.4:test (default-test) on project juneau-rest-client-apache-httpclient-45: There are test failures.
[ERROR] 
[ERROR] See <https://ci-builds.apache.org/job/Juneau/job/Juneau-Java-17/ws/juneau-rest/juneau-rest-client-apache-httpclient-45/target/surefire-reports> for the individual test results.
[ERROR] See dump files (if any exist) [date].dump, [date]-jvmRun[N].dump and [date].dumpstream.
[ERROR] -> [Help 1]
[ERROR] 
[ERROR] To see the full stack trace of the errors, re-run Maven with the -e switch.
[ERROR] Re-run Maven using the -X switch to enable full debug logging.
[ERROR] 
[ERROR] For more information about the errors and possible solutions, please read the following articles:
[ERROR] [Help 1] http://cwiki.apache.org/confluence/display/MAVEN/MojoFailureException
[ERROR] 
[ERROR] After correcting the problems, you can resume the build with the command
[ERROR]   mvn <args> -rf :juneau-rest-client-apache-httpclient-45
Build step 'Invoke top-level Maven targets' marked build as failure
Recording test results
[Checks API] No suitable checks publisher found.

Jenkins build is back to normal : Juneau » Juneau-Java-17 #2754

Posted by Apache Jenkins Server <je...@builds.apache.org>.
See <https://ci-builds.apache.org/job/Juneau/job/Juneau-Java-17/2754/display/redirect?page=changes>


Build failed in Jenkins: Juneau » Juneau-Java-17 #2753

Posted by Apache Jenkins Server <je...@builds.apache.org>.
See <https://ci-builds.apache.org/job/Juneau/job/Juneau-Java-17/2753/display/redirect?page=changes>

Changes:

[James Bognar] Bind the bus websocket CSRF boundary to a trusted Forwarded/X-Forwarded host and proto with trustedHops and new boundary reason codes (J0802); and compare HC4.5 and policy redirect hops against the first origin, restoring credentials only on GET/HEAD returns, refusing userinfo in redirect Locations and legacy AbstractHttpClient instances, and stripping Proxy-Authorization on tunnelled routes (J0824)


------------------------------------------
[...truncated 1.69 MiB...]
[INFO] Compiling 6 source files with javac [debug release 17] to target/classes
[INFO] 
[INFO] --- bundle:6.2.0:manifest (bundle-manifest) @ juneau-rest-client-apache-httpclient-50 ---
[INFO] No MANIFEST.MF file found, generating manifest.
[INFO] Writing manifest: <https://ci-builds.apache.org/job/Juneau/job/Juneau-Java-17/ws/juneau-rest/juneau-rest-client-apache-httpclient-50/target/classes/META-INF/MANIFEST.MF>
[INFO] 
[INFO] --- resources:3.4.0:testResources (default-testResources) @ juneau-rest-client-apache-httpclient-50 ---
[INFO] skip non existing resourceDirectory <https://ci-builds.apache.org/job/Juneau/job/Juneau-Java-17/ws/juneau-rest/juneau-rest-client-apache-httpclient-50/src/test/resources>
[INFO] Copying 3 resources from target/maven-shared-archive-resources to target/test-classes
[INFO] 
[INFO] --- compiler:3.16.0:testCompile (default-testCompile) @ juneau-rest-client-apache-httpclient-50 ---
[INFO] Recompiling the module because of changed dependency.
[INFO] Compiling 9 source files with javac [debug release 17] to target/test-classes
[INFO] 
[INFO] --- surefire:3.5.4:test (default-test) @ juneau-rest-client-apache-httpclient-50 ---
[INFO] Using auto detected provider org.apache.maven.surefire.junitplatform.JUnitPlatformProvider
[WARNING] The system property java.util.logging.config.file is configured twice! The property appears in <argLine/> and any of <systemPropertyVariables/>, <systemProperties/> or user property.
[INFO] 
[INFO] -------------------------------------------------------
[INFO]  T E S T S
[INFO] -------------------------------------------------------
[INFO] Running org.apache.juneau.rest.client.ApacheHc5Transport_CallerClientRedirectCredentials_Test
SLF4J: Failed to load class "org.slf4j.impl.StaticLoggerBinder".
SLF4J: Defaulting to no-operation (NOP) logger implementation
SLF4J: See http://www.slf4j.org/codes.html#StaticLoggerBinder for further details.
[ERROR] Tests run: 15, Failures: 0, Errors: 1, Skipped: 0, Time elapsed: 2.227 s <<< FAILURE! -- in org.apache.juneau.rest.client.ApacheHc5Transport_CallerClientRedirectCredentials_Test
[ERROR] org.apache.juneau.rest.client.ApacheHc5Transport_CallerClientRedirectCredentials_Test.b08_crossOrigin_retriedAfter503_laxRedirectStrategy_retryStaysStripped -- Time elapsed: 1.180 s <<< ERROR!
org.apache.juneau.rest.client.TransportException: HTTP transport error: 127.0.0.1:45229 failed to respond
	at org.apache.juneau.rest.client.apachehttpclient50.ApacheHc5Transport.sendOnce(ApacheHc5Transport.java:202)
	at org.apache.juneau.rest.client.apachehttpclient50.ApacheHc5Transport.execute(ApacheHc5Transport.java:158)
	at org.apache.juneau.rest.client.RestRequest.run(RestRequest.java:621)
	at org.apache.juneau.rest.client.ApacheHc5Transport_CallerClientRedirectCredentials_Test.get(ApacheHc5Transport_CallerClientRedirectCredentials_Test.java:235)
	at org.apache.juneau.rest.client.ApacheHc5Transport_CallerClientRedirectCredentials_Test.get(ApacheHc5Transport_CallerClientRedirectCredentials_Test.java:224)
	at org.apache.juneau.rest.client.ApacheHc5Transport_CallerClientRedirectCredentials_Test.b08_crossOrigin_retriedAfter503_laxRedirectStrategy_retryStaysStripped(ApacheHc5Transport_CallerClientRedirectCredentials_Test.java:348)
Caused by: org.apache.hc.core5.http.NoHttpResponseException: 127.0.0.1:45229 failed to respond
	at org.apache.hc.core5.http.impl.io.DefaultBHttpClientConnection.receiveResponseHeader(DefaultBHttpClientConnection.java:333)
	at org.apache.hc.core5.http.impl.io.HttpRequestExecutor.execute(HttpRequestExecutor.java:197)
	at org.apache.hc.client5.http.impl.classic.InternalExecRuntime.lambda$execute$0(InternalExecRuntime.java:236)
	at org.apache.hc.client5.http.impl.io.PoolingHttpClientConnectionManager$InternalConnectionEndpoint.execute(PoolingHttpClientConnectionManager.java:851)
	at org.apache.hc.client5.http.impl.classic.InternalExecRuntime.execute(InternalExecRuntime.java:233)
	at org.apache.hc.client5.http.impl.classic.MainClientExec.execute(MainClientExec.java:120)
	at org.apache.hc.client5.http.impl.classic.ExecChainElement.execute(ExecChainElement.java:51)
	at org.apache.hc.client5.http.impl.classic.ConnectExec.execute(ConnectExec.java:192)
	at org.apache.hc.client5.http.impl.classic.ExecChainElement.execute(ExecChainElement.java:51)
	at org.apache.hc.client5.http.impl.classic.ProtocolExec.execute(ProtocolExec.java:192)
	at org.apache.hc.client5.http.impl.classic.ExecChainElement.execute(ExecChainElement.java:51)
	at org.apache.hc.client5.http.impl.classic.ContentCompressionExec.execute(ContentCompressionExec.java:138)
	at org.apache.hc.client5.http.impl.classic.ExecChainElement.execute(ExecChainElement.java:51)
	at org.apache.hc.client5.http.impl.classic.HttpRequestRetryExec.execute(HttpRequestRetryExec.java:112)
	at org.apache.hc.client5.http.impl.classic.ExecChainElement.execute(ExecChainElement.java:51)
	at org.apache.hc.client5.http.impl.classic.RedirectExec.execute(RedirectExec.java:110)
	at org.apache.hc.client5.http.impl.classic.ExecChainElement.execute(ExecChainElement.java:51)
	at org.apache.hc.client5.http.impl.classic.InternalHttpClient.doExecute(InternalHttpClient.java:186)
	at org.apache.hc.client5.http.impl.classic.CloseableHttpClient.execute(CloseableHttpClient.java:87)
	at org.apache.hc.client5.http.impl.classic.CloseableHttpClient.execute(CloseableHttpClient.java:55)
	at org.apache.hc.client5.http.classic.HttpClient.executeOpen(HttpClient.java:183)
	at org.apache.juneau.rest.client.apachehttpclient50.ApacheHc5Transport.sendOnce(ApacheHc5Transport.java:200)
	... 5 more

[INFO] Running org.apache.juneau.rest.client.ApacheHc5Transport_Edge_Test
[INFO] Tests run: 7, Failures: 0, Errors: 0, Skipped: 0, Time elapsed: 0.033 s -- in org.apache.juneau.rest.client.ApacheHc5Transport_Edge_Test
[INFO] Running org.apache.juneau.rest.client.ApacheHc5Transport_SsrfGuard_Test
[INFO] Tests run: 8, Failures: 0, Errors: 0, Skipped: 0, Time elapsed: 0.135 s -- in org.apache.juneau.rest.client.ApacheHc5Transport_SsrfGuard_Test
[INFO] Running org.apache.juneau.rest.client.ApacheHc5Transport_BuiltClientRedirectCredentials_Test
[ERROR] Tests run: 12, Failures: 0, Errors: 1, Skipped: 0, Time elapsed: 1.472 s <<< FAILURE! -- in org.apache.juneau.rest.client.ApacheHc5Transport_BuiltClientRedirectCredentials_Test
[ERROR] org.apache.juneau.rest.client.ApacheHc5Transport_BuiltClientRedirectCredentials_Test.b06_crossOrigin_retriedAfter503_retryStaysStripped -- Time elapsed: 1.024 s <<< ERROR!
org.apache.juneau.rest.client.TransportException: HTTP transport error: 127.0.0.1:35727 failed to respond
	at org.apache.juneau.rest.client.apachehttpclient50.ApacheHc5Transport.sendOnce(ApacheHc5Transport.java:202)
	at org.apache.juneau.rest.client.apachehttpclient50.ApacheHc5Transport.execute(ApacheHc5Transport.java:158)
	at org.apache.juneau.rest.client.RestRequest.run(RestRequest.java:621)
	at org.apache.juneau.rest.client.ApacheHc5Transport_BuiltClientRedirectCredentials_Test.send(ApacheHc5Transport_BuiltClientRedirectCredentials_Test.java:178)
	at org.apache.juneau.rest.client.ApacheHc5Transport_BuiltClientRedirectCredentials_Test.get(ApacheHc5Transport_BuiltClientRedirectCredentials_Test.java:185)
	at org.apache.juneau.rest.client.ApacheHc5Transport_BuiltClientRedirectCredentials_Test.b06_crossOrigin_retriedAfter503_retryStaysStripped(ApacheHc5Transport_BuiltClientRedirectCredentials_Test.java:282)
Caused by: org.apache.hc.core5.http.NoHttpResponseException: 127.0.0.1:35727 failed to respond
	at org.apache.hc.core5.http.impl.io.DefaultBHttpClientConnection.receiveResponseHeader(DefaultBHttpClientConnection.java:333)
	at org.apache.hc.core5.http.impl.io.HttpRequestExecutor.execute(HttpRequestExecutor.java:197)
	at org.apache.hc.client5.http.impl.classic.InternalExecRuntime.lambda$execute$0(InternalExecRuntime.java:236)
	at org.apache.hc.client5.http.impl.io.PoolingHttpClientConnectionManager$InternalConnectionEndpoint.execute(PoolingHttpClientConnectionManager.java:851)
	at org.apache.hc.client5.http.impl.classic.InternalExecRuntime.execute(InternalExecRuntime.java:233)
	at org.apache.hc.client5.http.impl.classic.MainClientExec.execute(MainClientExec.java:120)
	at org.apache.hc.client5.http.impl.classic.ExecChainElement.execute(ExecChainElement.java:51)
	at org.apache.hc.client5.http.impl.classic.ConnectExec.execute(ConnectExec.java:192)
	at org.apache.hc.client5.http.impl.classic.ExecChainElement.execute(ExecChainElement.java:51)
	at org.apache.hc.client5.http.impl.classic.ProtocolExec.execute(ProtocolExec.java:192)
	at org.apache.hc.client5.http.impl.classic.ExecChainElement.execute(ExecChainElement.java:51)
	at org.apache.hc.client5.http.impl.classic.ContentCompressionExec.execute(ContentCompressionExec.java:138)
	at org.apache.hc.client5.http.impl.classic.ExecChainElement.execute(ExecChainElement.java:51)
	at org.apache.hc.client5.http.impl.classic.HttpRequestRetryExec.execute(HttpRequestRetryExec.java:112)
	at org.apache.hc.client5.http.impl.classic.ExecChainElement.execute(ExecChainElement.java:51)
	at org.apache.hc.client5.http.impl.classic.RedirectExec.execute(RedirectExec.java:110)
	at org.apache.hc.client5.http.impl.classic.ExecChainElement.execute(ExecChainElement.java:51)
	at org.apache.hc.client5.http.impl.classic.InternalHttpClient.doExecute(InternalHttpClient.java:186)
	at org.apache.hc.client5.http.impl.classic.CloseableHttpClient.execute(CloseableHttpClient.java:87)
	at org.apache.hc.client5.http.impl.classic.CloseableHttpClient.execute(CloseableHttpClient.java:55)
	at org.apache.hc.client5.http.classic.HttpClient.executeOpen(HttpClient.java:183)
	at org.apache.juneau.rest.client.apachehttpclient50.ApacheHc5Transport.sendOnce(ApacheHc5Transport.java:200)
	... 5 more

[INFO] Running org.apache.juneau.rest.client.apachehttpclient50.ApacheHc5Transport_RedirectCredentials_Test
[INFO] Tests run: 6, Failures: 0, Errors: 0, Skipped: 0, Time elapsed: 0.068 s -- in org.apache.juneau.rest.client.apachehttpclient50.ApacheHc5Transport_RedirectCredentials_Test
[INFO] Running org.apache.juneau.rest.client.apachehttpclient50.CredentialGuardingContext_Test
[INFO] Tests run: 19, Failures: 0, Errors: 0, Skipped: 0, Time elapsed: 0.040 s -- in org.apache.juneau.rest.client.apachehttpclient50.CredentialGuardingContext_Test
[INFO] Running org.apache.juneau.rest.client.apachehttpclient50.PolicyPinningDnsResolver_Test
[INFO] Tests run: 3, Failures: 0, Errors: 0, Skipped: 0, Time elapsed: 0.010 s -- in org.apache.juneau.rest.client.apachehttpclient50.PolicyPinningDnsResolver_Test
[INFO] Running org.apache.juneau.rest.client.ApacheHc5Transport_Test
[INFO] Tests run: 18, Failures: 0, Errors: 0, Skipped: 0, Time elapsed: 0.152 s -- in org.apache.juneau.rest.client.ApacheHc5Transport_Test
[INFO] Running org.apache.juneau.rest.client.ApacheHc5Transport_Timeout_Test
[INFO] Tests run: 5, Failures: 0, Errors: 0, Skipped: 0, Time elapsed: 4.249 s -- in org.apache.juneau.rest.client.ApacheHc5Transport_Timeout_Test
[INFO] 
[INFO] Results:
[INFO] 
[ERROR] Errors: 
[ERROR]   ApacheHc5Transport_BuiltClientRedirectCredentials_Test.b06_crossOrigin_retriedAfter503_retryStaysStripped:282->get:185->send:178 » Transport HTTP transport error: 127.0.0.1:35727 failed to respond
[ERROR]   ApacheHc5Transport_CallerClientRedirectCredentials_Test.b08_crossOrigin_retriedAfter503_laxRedirectStrategy_retryStaysStripped:348->get:224->get:235 » Transport HTTP transport error: 127.0.0.1:45229 failed to respond
[INFO] 
[ERROR] Tests run: 93, Failures: 0, Errors: 2, Skipped: 0
[INFO] 
[INFO] 
[INFO] ------------------------------------------------------------------------
[INFO] Skipping Apache Juneau
[INFO] This project has been banned from the build due to previous failures.
[INFO] ------------------------------------------------------------------------
[INFO] ------------------------------------------------------------------------
[INFO] Reactor Summary for Apache Juneau 10.0.0-SNAPSHOT:
[INFO] 
[INFO] Apache Juneau ...................................... SUCCESS [ 25.864 s]
[INFO] Apache Juneau Bill of Materials .................... SUCCESS [  3.784 s]
[INFO] Apache Juneau Core ................................. SUCCESS [  5.860 s]
[INFO] Apache Juneau Commons .............................. SUCCESS [01:32 min]
[INFO] Apache Juneau Test Utilities ....................... SUCCESS [  5.562 s]
[INFO] Apache Juneau Testing Toolkit ...................... SUCCESS [ 14.566 s]
[INFO] Apache Juneau Marshall ............................. SUCCESS [02:26 min]
[INFO] Apache Juneau Beans ................................ SUCCESS [  4.310 s]
[INFO] Apache Juneau RFC 7807 Beans ....................... SUCCESS [  7.670 s]
[INFO] Apache Juneau Marshall Test Utilities .............. SUCCESS [  6.327 s]
[INFO] Apache Juneau REST ................................. SUCCESS [  6.975 s]
[INFO] Apache Juneau REST Common .......................... SUCCESS [ 20.563 s]
[INFO] Apache Juneau Config ............................... SUCCESS [ 14.185 s]
[INFO] Apache Juneau Common Beans ......................... SUCCESS [ 11.254 s]
[INFO] Apache Juneau HTML5 Beans .......................... SUCCESS [ 25.791 s]
[INFO] Apache Juneau JSON Schema Beans .................... SUCCESS [ 12.075 s]
[INFO] Apache Juneau Swagger 2.0 Beans .................... SUCCESS [ 12.606 s]
[INFO] Apache Juneau OpenAPI 3.0 Beans .................... SUCCESS [ 14.635 s]
[INFO] Apache Juneau REST Server .......................... SUCCESS [ 39.134 s]
[INFO] Apache Juneau REST Client .......................... SUCCESS [ 22.087 s]
[INFO] Apache Juneau REST Common (Classic) ................ SUCCESS [ 19.240 s]
[INFO] Apache Juneau REST Client (Classic) ................ SUCCESS [ 21.494 s]
[INFO] Apache Juneau REST Mock ............................ SUCCESS [ 17.838 s]
[INFO] Apache Juneau Microservices ........................ SUCCESS [  3.825 s]
[INFO] Apache Juneau Microservice ......................... SUCCESS [ 22.876 s]
[INFO] Apache Juneau REST Server Message Bus .............. SUCCESS [ 16.444 s]
[INFO] Apache Juneau REST Server Bus WebSocket ............ SUCCESS [ 16.797 s]
[INFO] Apache Juneau Microservice Jetty ................... SUCCESS [ 54.970 s]
[INFO] Apache Juneau Dependency Bundles ................... SUCCESS [  3.598 s]
[INFO] Apache Juneau Jetty Microservice Bundle ............ SUCCESS [  3.970 s]
[INFO] Apache Juneau Microservice Tomcat .................. SUCCESS [ 14.331 s]
[INFO] Apache Juneau Tomcat Microservice Bundle ........... SUCCESS [  3.819 s]
[INFO] Apache Juneau REST Server Spring Boot .............. SUCCESS [ 27.431 s]
[INFO] Apache Juneau Spring Boot Bundle ................... SUCCESS [  3.982 s]
[INFO] Apache Juneau REST Server Micrometer ............... SUCCESS [ 14.495 s]
[INFO] Apache Juneau REST Server OpenTelemetry ............ SUCCESS [ 13.963 s]
[INFO] Apache Juneau OTLP Observability Bundle ............ SUCCESS [  3.883 s]
[INFO] Apache Juneau BeanQuery SQL ........................ SUCCESS [  8.780 s]
[INFO] Apache Juneau BeanQuery Postgres ................... SUCCESS [  8.329 s]
[INFO] juneau/core/marshall-rdf ........................... SUCCESS [ 52.175 s]
[INFO] Apache Juneau REST Server RDF ...................... SUCCESS [  6.532 s]
[INFO] Apache Juneau JSON-RPC Beans ....................... SUCCESS [  8.239 s]
[INFO] Apache Juneau REST Server MCP ...................... SUCCESS [ 19.533 s]
[INFO] Apache Juneau MCP Beans (2025-06-18) ............... SUCCESS [ 10.089 s]
[INFO] Apache Juneau REST Server MCP (2025-06-18) ......... SUCCESS [ 29.872 s]
[INFO] Apache Juneau MCP Beans (2026-07-28) ............... SUCCESS [ 12.341 s]
[INFO] Apache Juneau REST Server Reactive Streams Core .... SUCCESS [ 12.230 s]
[INFO] Apache Juneau REST Auth OAuth Flow ................. SUCCESS [  8.938 s]
[INFO] Apache Juneau REST Server JWT ...................... SUCCESS [ 19.899 s]
[INFO] Apache Juneau REST Server OAuth .................... SUCCESS [ 13.125 s]
[INFO] Apache Juneau REST Server MCP (2026-07-28) ......... SUCCESS [ 51.741 s]
[INFO] Apache Juneau REST Server SAML ..................... SUCCESS [ 47.048 s]
[INFO] Apache Juneau REST Server OIDC Relying Party ....... SUCCESS [ 25.787 s]
[INFO] Apache Juneau REST Server Logging Backends ......... SUCCESS [  8.683 s]
[INFO] Apache Juneau REST Server DataTables ............... SUCCESS [ 12.694 s]
[INFO] Apache Juneau Run Report ........................... SUCCESS [  9.664 s]
[INFO] Apache Juneau REST Server Widgets .................. SUCCESS [ 20.966 s]
[INFO] Apache Juneau REST Server Console UI ............... SUCCESS [ 30.240 s]
[INFO] Apache Juneau REST Server Views .................... SUCCESS [01:29 min]
[INFO] Apache Juneau REST Server Views Markdown ........... SUCCESS [  7.666 s]
[INFO] Apache Juneau REST Server Terminal ................. SUCCESS [ 21.084 s]
[INFO] Apache Juneau REST Server View — FreeMarker ........ SUCCESS [ 19.632 s]
[INFO] Apache Juneau REST Server Console UI — FreeMarker .. SUCCESS [01:27 min]
[INFO] Apache Juneau REST Server Terminal Bus ............. SUCCESS [  9.124 s]
[INFO] Apache Juneau REST Server Reactive Streams ......... SUCCESS [ 10.183 s]
[INFO] Apache Juneau REST Server View — JSP ............... SUCCESS [ 24.131 s]
[INFO] Apache Juneau REST Server View — Thymeleaf ......... SUCCESS [ 19.388 s]
[INFO] Apache Juneau REST Server View — Mustache .......... SUCCESS [ 17.924 s]
[INFO] Apache Juneau REST Client MCP ...................... SUCCESS [  9.486 s]
[INFO] Apache Juneau REST Client MCP (2025-06-18) ......... SUCCESS [  9.033 s]
[INFO] Apache Juneau REST Client MCP (2026-07-28) ......... SUCCESS [ 11.467 s]
[INFO] Apache Juneau REST Client MCP Auth ................. SUCCESS [ 11.962 s]
[INFO] Apache Juneau NG REST Client — Apache HttpClient 4.5 Transport SUCCESS [ 14.098 s]
[INFO] Apache Juneau NG REST Client — Apache HttpClient 5.x Transport FAILURE [ 10.528 s]
[INFO] Apache Juneau NG REST Client — OkHttp Transport .... SKIPPED
[INFO] Apache Juneau NG REST Client — Jetty HttpClient Transport SKIPPED
[INFO] Apache Juneau Microservice Test Support ............ SKIPPED
[INFO] Apache Juneau Microservice Examples ................ SKIPPED
[INFO] Apache Juneau Server Config ........................ SKIPPED
[INFO] Apache Juneau Server Config Server ................. SKIPPED
[INFO] Apache Juneau Secret Store - macOS Keychain ........ SKIPPED
[INFO] Apache Juneau Run Wrapper .......................... SKIPPED
[INFO] Apache Juneau Atom Beans ........................... SKIPPED
[INFO] Apache Juneau Examples ............................. SKIPPED
[INFO] Apache Juneau Core Examples ........................ SKIPPED
[INFO] Apache Juneau MCP Examples ......................... SKIPPED
[INFO] Apache Juneau Petstore ............................. SKIPPED
[INFO] Apache Juneau Petstore Core ........................ SKIPPED
[INFO] Apache Juneau Petstore Jetty ....................... SKIPPED
[INFO] Apache Juneau Petstore Spring Boot ................. SKIPPED
[INFO] Apache Juneau HAL Beans ............................ SKIPPED
[INFO] Apache Juneau JSON:API Beans ....................... SKIPPED
[INFO] Apache Juneau JSON Patch Beans ..................... SKIPPED
[INFO] Apache Juneau Integration Tests .................... SKIPPED
[INFO] Apache Juneau Shaded Artifacts ..................... SKIPPED
[INFO] Apache Juneau Core (Shaded) ........................ SKIPPED
[INFO] Apache Juneau REST Client (Shaded) ................. SKIPPED
[INFO] Apache Juneau REST Server (Shaded) ................. SKIPPED
[INFO] Apache Juneau REST Server Spring Boot (Shaded) ..... SKIPPED
[INFO] Apache Juneau All (Shaded) ......................... SKIPPED
[INFO] Apache Juneau Distribution ......................... SKIPPED
[INFO] ------------------------------------------------------------------------
[INFO] BUILD FAILURE
[INFO] ------------------------------------------------------------------------
[INFO] Total time:  25:46 min
[INFO] Finished at: 2026-10-16T20:46:06Z
[INFO] ------------------------------------------------------------------------
[ERROR] Failed to execute goal org.apache.maven.plugins:maven-surefire-plugin:3.5.4:test (default-test) on project juneau-rest-client-apache-httpclient-50: 
[ERROR] 
[ERROR] See <https://ci-builds.apache.org/job/Juneau/job/Juneau-Java-17/ws/juneau-rest/juneau-rest-client-apache-httpclient-50/target/surefire-reports> for the individual test results.
[ERROR] See dump files (if any exist) [date].dump, [date]-jvmRun[N].dump and [date].dumpstream.
[ERROR] -> [Help 1]
[ERROR] 
[ERROR] To see the full stack trace of the errors, re-run Maven with the -e switch.
[ERROR] Re-run Maven using the -X switch to enable full debug logging.
[ERROR] 
[ERROR] For more information about the errors and possible solutions, please read the following articles:
[ERROR] [Help 1] http://cwiki.apache.org/confluence/display/MAVEN/MojoFailureException
[ERROR] 
[ERROR] After correcting the problems, you can resume the build with the command
[ERROR]   mvn <args> -rf :juneau-rest-client-apache-httpclient-50
Build step 'Invoke top-level Maven targets' marked build as failure
Recording test results
[Checks API] No suitable checks publisher found.

Build failed in Jenkins: Juneau » Juneau-Java-17 #2752

Posted by Apache Jenkins Server <je...@builds.apache.org>.
See <https://ci-builds.apache.org/job/Juneau/job/Juneau-Java-17/2752/display/redirect?page=changes>

Changes:

[James Bognar] Fall back to the HTTP/2 :authority when Host is absent in CsrfBoundary/LoopbackBoundary and bus handshakes (J0814); make boundary dispatch agree on method-override headers (J0815); dedupe the petstore boundary's effective-method logic (J0816); cache only Class args in both MockRestClient variants (J0819); show tested-only units and an in-flight glyph on the run console unit bar (J0820); add a terminal mount nudge hook (J0822); and stop HC4.5 retries from re-sending caller credentials across origins (J0823)


------------------------------------------
[...truncated 1.73 MiB...]
[INFO] Compiling 6 source files with javac [debug release 17] to target/classes
[INFO] 
[INFO] --- bundle:6.2.0:manifest (bundle-manifest) @ juneau-rest-client-apache-httpclient-50 ---
[INFO] No MANIFEST.MF file found, generating manifest.
[INFO] Writing manifest: <https://ci-builds.apache.org/job/Juneau/job/Juneau-Java-17/ws/juneau-rest/juneau-rest-client-apache-httpclient-50/target/classes/META-INF/MANIFEST.MF>
[INFO] 
[INFO] --- resources:3.4.0:testResources (default-testResources) @ juneau-rest-client-apache-httpclient-50 ---
[INFO] skip non existing resourceDirectory <https://ci-builds.apache.org/job/Juneau/job/Juneau-Java-17/ws/juneau-rest/juneau-rest-client-apache-httpclient-50/src/test/resources>
[INFO] Copying 3 resources from target/maven-shared-archive-resources to target/test-classes
[INFO] 
[INFO] --- compiler:3.16.0:testCompile (default-testCompile) @ juneau-rest-client-apache-httpclient-50 ---
[INFO] Recompiling the module because of changed dependency.
[INFO] Compiling 9 source files with javac [debug release 17] to target/test-classes
[INFO] 
[INFO] --- surefire:3.5.4:test (default-test) @ juneau-rest-client-apache-httpclient-50 ---
[INFO] Using auto detected provider org.apache.maven.surefire.junitplatform.JUnitPlatformProvider
[WARNING] The system property java.util.logging.config.file is configured twice! The property appears in <argLine/> and any of <systemPropertyVariables/>, <systemProperties/> or user property.
[INFO] 
[INFO] -------------------------------------------------------
[INFO]  T E S T S
[INFO] -------------------------------------------------------
[INFO] Running org.apache.juneau.rest.client.ApacheHc5Transport_Test
SLF4J: Failed to load class "org.slf4j.impl.StaticLoggerBinder".
SLF4J: Defaulting to no-operation (NOP) logger implementation
SLF4J: See http://www.slf4j.org/codes.html#StaticLoggerBinder for further details.
[INFO] Tests run: 18, Failures: 0, Errors: 0, Skipped: 0, Time elapsed: 1.503 s -- in org.apache.juneau.rest.client.ApacheHc5Transport_Test
[INFO] Running org.apache.juneau.rest.client.ApacheHc5Transport_SsrfGuard_Test
[INFO] Tests run: 8, Failures: 0, Errors: 0, Skipped: 0, Time elapsed: 0.135 s -- in org.apache.juneau.rest.client.ApacheHc5Transport_SsrfGuard_Test
[INFO] Running org.apache.juneau.rest.client.ApacheHc5Transport_CallerClientRedirectCredentials_Test
[ERROR] Tests run: 15, Failures: 0, Errors: 1, Skipped: 0, Time elapsed: 1.266 s <<< FAILURE! -- in org.apache.juneau.rest.client.ApacheHc5Transport_CallerClientRedirectCredentials_Test
[ERROR] org.apache.juneau.rest.client.ApacheHc5Transport_CallerClientRedirectCredentials_Test.b08_crossOrigin_retriedAfter503_laxRedirectStrategy_retryStaysStripped -- Time elapsed: 1.035 s <<< ERROR!
org.apache.juneau.rest.client.TransportException: HTTP transport error: 127.0.0.1:37735 failed to respond
	at org.apache.juneau.rest.client.apachehttpclient50.ApacheHc5Transport.sendOnce(ApacheHc5Transport.java:202)
	at org.apache.juneau.rest.client.apachehttpclient50.ApacheHc5Transport.execute(ApacheHc5Transport.java:158)
	at org.apache.juneau.rest.client.RestRequest.run(RestRequest.java:621)
	at org.apache.juneau.rest.client.ApacheHc5Transport_CallerClientRedirectCredentials_Test.get(ApacheHc5Transport_CallerClientRedirectCredentials_Test.java:235)
	at org.apache.juneau.rest.client.ApacheHc5Transport_CallerClientRedirectCredentials_Test.get(ApacheHc5Transport_CallerClientRedirectCredentials_Test.java:224)
	at org.apache.juneau.rest.client.ApacheHc5Transport_CallerClientRedirectCredentials_Test.b08_crossOrigin_retriedAfter503_laxRedirectStrategy_retryStaysStripped(ApacheHc5Transport_CallerClientRedirectCredentials_Test.java:348)
Caused by: org.apache.hc.core5.http.NoHttpResponseException: 127.0.0.1:37735 failed to respond
	at org.apache.hc.core5.http.impl.io.DefaultBHttpClientConnection.receiveResponseHeader(DefaultBHttpClientConnection.java:333)
	at org.apache.hc.core5.http.impl.io.HttpRequestExecutor.execute(HttpRequestExecutor.java:197)
	at org.apache.hc.client5.http.impl.classic.InternalExecRuntime.lambda$execute$0(InternalExecRuntime.java:236)
	at org.apache.hc.client5.http.impl.io.PoolingHttpClientConnectionManager$InternalConnectionEndpoint.execute(PoolingHttpClientConnectionManager.java:851)
	at org.apache.hc.client5.http.impl.classic.InternalExecRuntime.execute(InternalExecRuntime.java:233)
	at org.apache.hc.client5.http.impl.classic.MainClientExec.execute(MainClientExec.java:120)
	at org.apache.hc.client5.http.impl.classic.ExecChainElement.execute(ExecChainElement.java:51)
	at org.apache.hc.client5.http.impl.classic.ConnectExec.execute(ConnectExec.java:192)
	at org.apache.hc.client5.http.impl.classic.ExecChainElement.execute(ExecChainElement.java:51)
	at org.apache.hc.client5.http.impl.classic.ProtocolExec.execute(ProtocolExec.java:192)
	at org.apache.hc.client5.http.impl.classic.ExecChainElement.execute(ExecChainElement.java:51)
	at org.apache.hc.client5.http.impl.classic.ContentCompressionExec.execute(ContentCompressionExec.java:138)
	at org.apache.hc.client5.http.impl.classic.ExecChainElement.execute(ExecChainElement.java:51)
	at org.apache.hc.client5.http.impl.classic.HttpRequestRetryExec.execute(HttpRequestRetryExec.java:112)
	at org.apache.hc.client5.http.impl.classic.ExecChainElement.execute(ExecChainElement.java:51)
	at org.apache.hc.client5.http.impl.classic.RedirectExec.execute(RedirectExec.java:110)
	at org.apache.hc.client5.http.impl.classic.ExecChainElement.execute(ExecChainElement.java:51)
	at org.apache.hc.client5.http.impl.classic.InternalHttpClient.doExecute(InternalHttpClient.java:186)
	at org.apache.hc.client5.http.impl.classic.CloseableHttpClient.execute(CloseableHttpClient.java:87)
	at org.apache.hc.client5.http.impl.classic.CloseableHttpClient.execute(CloseableHttpClient.java:55)
	at org.apache.hc.client5.http.classic.HttpClient.executeOpen(HttpClient.java:183)
	at org.apache.juneau.rest.client.apachehttpclient50.ApacheHc5Transport.sendOnce(ApacheHc5Transport.java:200)
	... 5 more

[INFO] Running org.apache.juneau.rest.client.ApacheHc5Transport_BuiltClientRedirectCredentials_Test
[ERROR] Tests run: 12, Failures: 0, Errors: 1, Skipped: 0, Time elapsed: 1.422 s <<< FAILURE! -- in org.apache.juneau.rest.client.ApacheHc5Transport_BuiltClientRedirectCredentials_Test
[ERROR] org.apache.juneau.rest.client.ApacheHc5Transport_BuiltClientRedirectCredentials_Test.b06_crossOrigin_retriedAfter503_retryStaysStripped -- Time elapsed: 1.023 s <<< ERROR!
org.apache.juneau.rest.client.TransportException: HTTP transport error: 127.0.0.1:37307 failed to respond
	at org.apache.juneau.rest.client.apachehttpclient50.ApacheHc5Transport.sendOnce(ApacheHc5Transport.java:202)
	at org.apache.juneau.rest.client.apachehttpclient50.ApacheHc5Transport.execute(ApacheHc5Transport.java:158)
	at org.apache.juneau.rest.client.RestRequest.run(RestRequest.java:621)
	at org.apache.juneau.rest.client.ApacheHc5Transport_BuiltClientRedirectCredentials_Test.send(ApacheHc5Transport_BuiltClientRedirectCredentials_Test.java:178)
	at org.apache.juneau.rest.client.ApacheHc5Transport_BuiltClientRedirectCredentials_Test.get(ApacheHc5Transport_BuiltClientRedirectCredentials_Test.java:185)
	at org.apache.juneau.rest.client.ApacheHc5Transport_BuiltClientRedirectCredentials_Test.b06_crossOrigin_retriedAfter503_retryStaysStripped(ApacheHc5Transport_BuiltClientRedirectCredentials_Test.java:282)
Caused by: org.apache.hc.core5.http.NoHttpResponseException: 127.0.0.1:37307 failed to respond
	at org.apache.hc.core5.http.impl.io.DefaultBHttpClientConnection.receiveResponseHeader(DefaultBHttpClientConnection.java:333)
	at org.apache.hc.core5.http.impl.io.HttpRequestExecutor.execute(HttpRequestExecutor.java:197)
	at org.apache.hc.client5.http.impl.classic.InternalExecRuntime.lambda$execute$0(InternalExecRuntime.java:236)
	at org.apache.hc.client5.http.impl.io.PoolingHttpClientConnectionManager$InternalConnectionEndpoint.execute(PoolingHttpClientConnectionManager.java:851)
	at org.apache.hc.client5.http.impl.classic.InternalExecRuntime.execute(InternalExecRuntime.java:233)
	at org.apache.hc.client5.http.impl.classic.MainClientExec.execute(MainClientExec.java:120)
	at org.apache.hc.client5.http.impl.classic.ExecChainElement.execute(ExecChainElement.java:51)
	at org.apache.hc.client5.http.impl.classic.ConnectExec.execute(ConnectExec.java:192)
	at org.apache.hc.client5.http.impl.classic.ExecChainElement.execute(ExecChainElement.java:51)
	at org.apache.hc.client5.http.impl.classic.ProtocolExec.execute(ProtocolExec.java:192)
	at org.apache.hc.client5.http.impl.classic.ExecChainElement.execute(ExecChainElement.java:51)
	at org.apache.hc.client5.http.impl.classic.ContentCompressionExec.execute(ContentCompressionExec.java:138)
	at org.apache.hc.client5.http.impl.classic.ExecChainElement.execute(ExecChainElement.java:51)
	at org.apache.hc.client5.http.impl.classic.HttpRequestRetryExec.execute(HttpRequestRetryExec.java:112)
	at org.apache.hc.client5.http.impl.classic.ExecChainElement.execute(ExecChainElement.java:51)
	at org.apache.hc.client5.http.impl.classic.RedirectExec.execute(RedirectExec.java:110)
	at org.apache.hc.client5.http.impl.classic.ExecChainElement.execute(ExecChainElement.java:51)
	at org.apache.hc.client5.http.impl.classic.InternalHttpClient.doExecute(InternalHttpClient.java:186)
	at org.apache.hc.client5.http.impl.classic.CloseableHttpClient.execute(CloseableHttpClient.java:87)
	at org.apache.hc.client5.http.impl.classic.CloseableHttpClient.execute(CloseableHttpClient.java:55)
	at org.apache.hc.client5.http.classic.HttpClient.executeOpen(HttpClient.java:183)
	at org.apache.juneau.rest.client.apachehttpclient50.ApacheHc5Transport.sendOnce(ApacheHc5Transport.java:200)
	... 5 more

[INFO] Running org.apache.juneau.rest.client.apachehttpclient50.PolicyPinningDnsResolver_Test
[INFO] Tests run: 3, Failures: 0, Errors: 0, Skipped: 0, Time elapsed: 0.010 s -- in org.apache.juneau.rest.client.apachehttpclient50.PolicyPinningDnsResolver_Test
[INFO] Running org.apache.juneau.rest.client.apachehttpclient50.ApacheHc5Transport_RedirectCredentials_Test
[INFO] Tests run: 6, Failures: 0, Errors: 0, Skipped: 0, Time elapsed: 0.060 s -- in org.apache.juneau.rest.client.apachehttpclient50.ApacheHc5Transport_RedirectCredentials_Test
[INFO] Running org.apache.juneau.rest.client.apachehttpclient50.CredentialGuardingContext_Test
[INFO] Tests run: 19, Failures: 0, Errors: 0, Skipped: 0, Time elapsed: 0.032 s -- in org.apache.juneau.rest.client.apachehttpclient50.CredentialGuardingContext_Test
[INFO] Running org.apache.juneau.rest.client.ApacheHc5Transport_Edge_Test
[INFO] Tests run: 7, Failures: 0, Errors: 0, Skipped: 0, Time elapsed: 0.014 s -- in org.apache.juneau.rest.client.ApacheHc5Transport_Edge_Test
[INFO] Running org.apache.juneau.rest.client.ApacheHc5Transport_Timeout_Test
[INFO] Tests run: 5, Failures: 0, Errors: 0, Skipped: 0, Time elapsed: 4.244 s -- in org.apache.juneau.rest.client.ApacheHc5Transport_Timeout_Test
[INFO] 
[INFO] Results:
[INFO] 
[ERROR] Errors: 
[ERROR]   ApacheHc5Transport_BuiltClientRedirectCredentials_Test.b06_crossOrigin_retriedAfter503_retryStaysStripped:282->get:185->send:178 » Transport HTTP transport error: 127.0.0.1:37307 failed to respond
[ERROR]   ApacheHc5Transport_CallerClientRedirectCredentials_Test.b08_crossOrigin_retriedAfter503_laxRedirectStrategy_retryStaysStripped:348->get:224->get:235 » Transport HTTP transport error: 127.0.0.1:37735 failed to respond
[INFO] 
[ERROR] Tests run: 93, Failures: 0, Errors: 2, Skipped: 0
[INFO] 
[INFO] 
[INFO] ------------------------------------------------------------------------
[INFO] Skipping Apache Juneau
[INFO] This project has been banned from the build due to previous failures.
[INFO] ------------------------------------------------------------------------
[INFO] ------------------------------------------------------------------------
[INFO] Reactor Summary for Apache Juneau 10.0.0-SNAPSHOT:
[INFO] 
[INFO] Apache Juneau ...................................... SUCCESS [ 45.444 s]
[INFO] Apache Juneau Bill of Materials .................... SUCCESS [  3.842 s]
[INFO] Apache Juneau Core ................................. SUCCESS [  7.712 s]
[INFO] Apache Juneau Commons .............................. SUCCESS [01:49 min]
[INFO] Apache Juneau Test Utilities ....................... SUCCESS [  6.572 s]
[INFO] Apache Juneau Testing Toolkit ...................... SUCCESS [ 28.000 s]
[INFO] Apache Juneau Marshall ............................. SUCCESS [04:03 min]
[INFO] Apache Juneau Beans ................................ SUCCESS [  4.875 s]
[INFO] Apache Juneau RFC 7807 Beans ....................... SUCCESS [ 13.426 s]
[INFO] Apache Juneau Marshall Test Utilities .............. SUCCESS [  9.852 s]
[INFO] Apache Juneau REST ................................. SUCCESS [  9.437 s]
[INFO] Apache Juneau REST Common .......................... SUCCESS [ 32.590 s]
[INFO] Apache Juneau Config ............................... SUCCESS [ 22.773 s]
[INFO] Apache Juneau Common Beans ......................... SUCCESS [ 17.634 s]
[INFO] Apache Juneau HTML5 Beans .......................... SUCCESS [ 42.288 s]
[INFO] Apache Juneau JSON Schema Beans .................... SUCCESS [ 18.038 s]
[INFO] Apache Juneau Swagger 2.0 Beans .................... SUCCESS [ 21.472 s]
[INFO] Apache Juneau OpenAPI 3.0 Beans .................... SUCCESS [ 23.699 s]
[INFO] Apache Juneau REST Server .......................... SUCCESS [01:01 min]
[INFO] Apache Juneau REST Client .......................... SUCCESS [ 30.349 s]
[INFO] Apache Juneau REST Common (Classic) ................ SUCCESS [ 31.774 s]
[INFO] Apache Juneau REST Client (Classic) ................ SUCCESS [ 31.971 s]
[INFO] Apache Juneau REST Mock ............................ SUCCESS [ 29.854 s]
[INFO] Apache Juneau Microservices ........................ SUCCESS [  4.123 s]
[INFO] Apache Juneau Microservice ......................... SUCCESS [ 40.177 s]
[INFO] Apache Juneau REST Server Message Bus .............. SUCCESS [ 27.408 s]
[INFO] Apache Juneau REST Server Bus WebSocket ............ SUCCESS [ 26.161 s]
[INFO] Apache Juneau Microservice Jetty ................... SUCCESS [01:00 min]
[INFO] Apache Juneau Dependency Bundles ................... SUCCESS [  3.653 s]
[INFO] Apache Juneau Jetty Microservice Bundle ............ SUCCESS [  4.210 s]
[INFO] Apache Juneau Microservice Tomcat .................. SUCCESS [ 20.360 s]
[INFO] Apache Juneau Tomcat Microservice Bundle ........... SUCCESS [  3.972 s]
[INFO] Apache Juneau REST Server Spring Boot .............. SUCCESS [ 42.821 s]
[INFO] Apache Juneau Spring Boot Bundle ................... SUCCESS [  3.979 s]
[INFO] Apache Juneau REST Server Micrometer ............... SUCCESS [ 24.965 s]
[INFO] Apache Juneau REST Server OpenTelemetry ............ SUCCESS [ 21.498 s]
[INFO] Apache Juneau OTLP Observability Bundle ............ SUCCESS [  3.990 s]
[INFO] Apache Juneau BeanQuery SQL ........................ SUCCESS [ 12.183 s]
[INFO] Apache Juneau BeanQuery Postgres ................... SUCCESS [  9.157 s]
[INFO] juneau/core/marshall-rdf ........................... SUCCESS [01:20 min]
[INFO] Apache Juneau REST Server RDF ...................... SUCCESS [  9.654 s]
[INFO] Apache Juneau JSON-RPC Beans ....................... SUCCESS [ 12.802 s]
[INFO] Apache Juneau REST Server MCP ...................... SUCCESS [ 31.666 s]
[INFO] Apache Juneau MCP Beans (2025-06-18) ............... SUCCESS [ 14.811 s]
[INFO] Apache Juneau REST Server MCP (2025-06-18) ......... SUCCESS [ 59.763 s]
[INFO] Apache Juneau MCP Beans (2026-07-28) ............... SUCCESS [ 18.871 s]
[INFO] Apache Juneau REST Server Reactive Streams Core .... SUCCESS [ 18.451 s]
[INFO] Apache Juneau REST Auth OAuth Flow ................. SUCCESS [ 12.221 s]
[INFO] Apache Juneau REST Server JWT ...................... SUCCESS [ 26.590 s]
[INFO] Apache Juneau REST Server OAuth .................... SUCCESS [ 17.389 s]
[INFO] Apache Juneau REST Server MCP (2026-07-28) ......... SUCCESS [01:32 min]
[INFO] Apache Juneau REST Server SAML ..................... SUCCESS [01:00 min]
[INFO] Apache Juneau REST Server OIDC Relying Party ....... SUCCESS [ 34.572 s]
[INFO] Apache Juneau REST Server Logging Backends ......... SUCCESS [ 13.240 s]
[INFO] Apache Juneau REST Server DataTables ............... SUCCESS [ 19.615 s]
[INFO] Apache Juneau Run Report ........................... SUCCESS [ 15.246 s]
[INFO] Apache Juneau REST Server Widgets .................. SUCCESS [ 32.660 s]
[INFO] Apache Juneau REST Server Console UI ............... SUCCESS [01:01 min]
[INFO] Apache Juneau REST Server Views .................... SUCCESS [02:16 min]
[INFO] Apache Juneau REST Server Views Markdown ........... SUCCESS [ 11.088 s]
[INFO] Apache Juneau REST Server Terminal ................. SUCCESS [ 28.460 s]
[INFO] Apache Juneau REST Server View — FreeMarker ........ SUCCESS [ 34.023 s]
[INFO] Apache Juneau REST Server Console UI — FreeMarker .. SUCCESS [03:32 min]
[INFO] Apache Juneau REST Server Terminal Bus ............. SUCCESS [ 15.452 s]
[INFO] Apache Juneau REST Server Reactive Streams ......... SUCCESS [ 15.907 s]
[INFO] Apache Juneau REST Server View — JSP ............... SUCCESS [ 41.765 s]
[INFO] Apache Juneau REST Server View — Thymeleaf ......... SUCCESS [ 28.508 s]
[INFO] Apache Juneau REST Server View — Mustache .......... SUCCESS [ 28.192 s]
[INFO] Apache Juneau REST Client MCP ...................... SUCCESS [ 14.422 s]
[INFO] Apache Juneau REST Client MCP (2025-06-18) ......... SUCCESS [ 14.124 s]
[INFO] Apache Juneau REST Client MCP (2026-07-28) ......... SUCCESS [ 17.025 s]
[INFO] Apache Juneau REST Client MCP Auth ................. SUCCESS [ 17.725 s]
[INFO] Apache Juneau NG REST Client — Apache HttpClient 4.5 Transport SUCCESS [ 18.775 s]
[INFO] Apache Juneau NG REST Client — Apache HttpClient 5.x Transport FAILURE [ 11.863 s]
[INFO] Apache Juneau NG REST Client — OkHttp Transport .... SKIPPED
[INFO] Apache Juneau NG REST Client — Jetty HttpClient Transport SKIPPED
[INFO] Apache Juneau Microservice Test Support ............ SKIPPED
[INFO] Apache Juneau Microservice Examples ................ SKIPPED
[INFO] Apache Juneau Server Config ........................ SKIPPED
[INFO] Apache Juneau Server Config Server ................. SKIPPED
[INFO] Apache Juneau Secret Store - macOS Keychain ........ SKIPPED
[INFO] Apache Juneau Run Wrapper .......................... SKIPPED
[INFO] Apache Juneau Atom Beans ........................... SKIPPED
[INFO] Apache Juneau Examples ............................. SKIPPED
[INFO] Apache Juneau Core Examples ........................ SKIPPED
[INFO] Apache Juneau MCP Examples ......................... SKIPPED
[INFO] Apache Juneau Petstore ............................. SKIPPED
[INFO] Apache Juneau Petstore Core ........................ SKIPPED
[INFO] Apache Juneau Petstore Jetty ....................... SKIPPED
[INFO] Apache Juneau Petstore Spring Boot ................. SKIPPED
[INFO] Apache Juneau HAL Beans ............................ SKIPPED
[INFO] Apache Juneau JSON:API Beans ....................... SKIPPED
[INFO] Apache Juneau JSON Patch Beans ..................... SKIPPED
[INFO] Apache Juneau Integration Tests .................... SKIPPED
[INFO] Apache Juneau Shaded Artifacts ..................... SKIPPED
[INFO] Apache Juneau Core (Shaded) ........................ SKIPPED
[INFO] Apache Juneau REST Client (Shaded) ................. SKIPPED
[INFO] Apache Juneau REST Server (Shaded) ................. SKIPPED
[INFO] Apache Juneau REST Server Spring Boot (Shaded) ..... SKIPPED
[INFO] Apache Juneau All (Shaded) ......................... SKIPPED
[INFO] Apache Juneau Distribution ......................... SKIPPED
[INFO] ------------------------------------------------------------------------
[INFO] BUILD FAILURE
[INFO] ------------------------------------------------------------------------
[INFO] Total time:  40:36 min
[INFO] Finished at: 2026-10-16T18:50:53Z
[INFO] ------------------------------------------------------------------------
[ERROR] Failed to execute goal org.apache.maven.plugins:maven-surefire-plugin:3.5.4:test (default-test) on project juneau-rest-client-apache-httpclient-50: 
[ERROR] 
[ERROR] See <https://ci-builds.apache.org/job/Juneau/job/Juneau-Java-17/ws/juneau-rest/juneau-rest-client-apache-httpclient-50/target/surefire-reports> for the individual test results.
[ERROR] See dump files (if any exist) [date].dump, [date]-jvmRun[N].dump and [date].dumpstream.
[ERROR] -> [Help 1]
[ERROR] 
[ERROR] To see the full stack trace of the errors, re-run Maven with the -e switch.
[ERROR] Re-run Maven using the -X switch to enable full debug logging.
[ERROR] 
[ERROR] For more information about the errors and possible solutions, please read the following articles:
[ERROR] [Help 1] http://cwiki.apache.org/confluence/display/MAVEN/MojoFailureException
[ERROR] 
[ERROR] After correcting the problems, you can resume the build with the command
[ERROR]   mvn <args> -rf :juneau-rest-client-apache-httpclient-50
Build step 'Invoke top-level Maven targets' marked build as failure
Recording test results
[Checks API] No suitable checks publisher found.

Build failed in Jenkins: Juneau » Juneau-Java-17 #2751

Posted by Apache Jenkins Server <je...@builds.apache.org>.
See <https://ci-builds.apache.org/job/Juneau/job/Juneau-Java-17/2751/display/redirect?page=changes>

Changes:

[James Bognar] Add an admin CSRF/Host boundary for the microservice admin resources (J0813: loopback-only by default with a petstore.admin.allowedHosts override, POST-only shutdown with an injectable exit, GET-only log views, config edit form removed); run petstore and terminal browser tests locally in test.py and exclude *_BrowserTest from the default surefire pass (J0818); and fix the ConsoleData_Test h_source flake with a synchronous SHA-256 stub in the test harness


------------------------------------------
[...truncated 1.73 MiB...]
[INFO] --- apache-rat:0.16.1:check (default) @ juneau-rest-client-mcp-auth ---
[INFO] Rat check: Summary over all files. Unapproved: 0, unknown: 0, generated: 0, approved: 38 licenses.
[INFO] 
[INFO] --- install:3.1.4:install (default-install) @ juneau-rest-client-mcp-auth ---
[INFO] Installing <https://ci-builds.apache.org/job/Juneau/job/Juneau-Java-17/ws/juneau-rest/juneau-rest-client-mcp-auth/pom.xml> to /home/jenkins/.m2/repository/org/apache/juneau/juneau-rest-client-mcp-auth/10.0.0-SNAPSHOT/juneau-rest-client-mcp-auth-10.0.0-SNAPSHOT.pom
[INFO] Installing <https://ci-builds.apache.org/job/Juneau/job/Juneau-Java-17/ws/juneau-rest/juneau-rest-client-mcp-auth/target/juneau-rest-client-mcp-auth-10.0.0-SNAPSHOT.jar> to /home/jenkins/.m2/repository/org/apache/juneau/juneau-rest-client-mcp-auth/10.0.0-SNAPSHOT/juneau-rest-client-mcp-auth-10.0.0-SNAPSHOT.jar
[INFO] Installing <https://ci-builds.apache.org/job/Juneau/job/Juneau-Java-17/ws/juneau-rest/juneau-rest-client-mcp-auth/target/juneau-rest-client-mcp-auth-10.0.0-SNAPSHOT-sources.jar> to /home/jenkins/.m2/repository/org/apache/juneau/juneau-rest-client-mcp-auth/10.0.0-SNAPSHOT/juneau-rest-client-mcp-auth-10.0.0-SNAPSHOT-sources.jar
[INFO] 
[INFO] --- bundle:6.2.0:install (default-install) @ juneau-rest-client-mcp-auth ---
[INFO] Installing org/apache/juneau/juneau-rest-client-mcp-auth/10.0.0-SNAPSHOT/juneau-rest-client-mcp-auth-10.0.0-SNAPSHOT.jar
[INFO] Writing OBR metadata
[INFO] 
[INFO] --- deploy:3.1.4:deploy (default-deploy) @ juneau-rest-client-mcp-auth ---
Downloading from apache.snapshots.https: https://repository.apache.org/content/repositories/snapshots/org/apache/juneau/juneau-rest-client-mcp-auth/10.0.0-SNAPSHOT/maven-metadata.xml
Progress (1): 1.0 kB                    Downloaded from apache.snapshots.https: https://repository.apache.org/content/repositories/snapshots/org/apache/juneau/juneau-rest-client-mcp-auth/10.0.0-SNAPSHOT/maven-metadata.xml (1.0 kB at 5.8 kB/s)
Uploading to apache.snapshots.https: https://repository.apache.org/content/repositories/snapshots/org/apache/juneau/juneau-rest-client-mcp-auth/10.0.0-SNAPSHOT/juneau-rest-client-mcp-auth-10.0.0-20261016.163528-138.pom
Progress (1): 5.2 kB                    Uploaded to apache.snapshots.https: https://repository.apache.org/content/repositories/snapshots/org/apache/juneau/juneau-rest-client-mcp-auth/10.0.0-SNAPSHOT/juneau-rest-client-mcp-auth-10.0.0-20261016.163528-138.pom (5.2 kB at 5.0 kB/s)
Uploading to apache.snapshots.https: https://repository.apache.org/content/repositories/snapshots/org/apache/juneau/juneau-rest-client-mcp-auth/10.0.0-SNAPSHOT/juneau-rest-client-mcp-auth-10.0.0-20261016.163528-138.jar
Uploading to apache.snapshots.https: https://repository.apache.org/content/repositories/snapshots/org/apache/juneau/juneau-rest-client-mcp-auth/10.0.0-SNAPSHOT/juneau-rest-client-mcp-auth-10.0.0-20261016.163528-138-sources.jar
Progress (1): 33/64 kBProgress (1): 64 kB   Progress (2): 64 kB | 33/78 kBProgress (2): 64 kB | 66/78 kBProgress (2): 64 kB | 78 kB                              Uploaded to apache.snapshots.https: https://repository.apache.org/content/repositories/snapshots/org/apache/juneau/juneau-rest-client-mcp-auth/10.0.0-SNAPSHOT/juneau-rest-client-mcp-auth-10.0.0-20261016.163528-138-sources.jar (64 kB at 47 kB/s)
Uploaded to apache.snapshots.https: https://repository.apache.org/content/repositories/snapshots/org/apache/juneau/juneau-rest-client-mcp-auth/10.0.0-SNAPSHOT/juneau-rest-client-mcp-auth-10.0.0-20261016.163528-138.jar (78 kB at 46 kB/s)
Downloading from apache.snapshots.https: https://repository.apache.org/content/repositories/snapshots/org/apache/juneau/juneau-rest-client-mcp-auth/maven-metadata.xml
Progress (1): 305 B                   Downloaded from apache.snapshots.https: https://repository.apache.org/content/repositories/snapshots/org/apache/juneau/juneau-rest-client-mcp-auth/maven-metadata.xml (305 B at 1.8 kB/s)
Uploading to apache.snapshots.https: https://repository.apache.org/content/repositories/snapshots/org/apache/juneau/juneau-rest-client-mcp-auth/10.0.0-SNAPSHOT/maven-metadata.xml
Progress (1): 1.0 kB                    Uploaded to apache.snapshots.https: https://repository.apache.org/content/repositories/snapshots/org/apache/juneau/juneau-rest-client-mcp-auth/10.0.0-SNAPSHOT/maven-metadata.xml (1.0 kB at 989 B/s)
Uploading to apache.snapshots.https: https://repository.apache.org/content/repositories/snapshots/org/apache/juneau/juneau-rest-client-mcp-auth/maven-metadata.xml
Progress (1): 305 B                   Uploaded to apache.snapshots.https: https://repository.apache.org/content/repositories/snapshots/org/apache/juneau/juneau-rest-client-mcp-auth/maven-metadata.xml (305 B at 295 B/s)
[INFO] 
[INFO] --- bundle:6.2.0:deploy (default-deploy) @ juneau-rest-client-mcp-auth ---
[INFO] Remote OBR update disabled (enable with -DremoteOBR)
[INFO] 
[INFO] -----< org.apache.juneau:juneau-rest-client-apache-httpclient-45 >------
[INFO] Building Apache Juneau NG REST Client — Apache HttpClient 4.5 Transport 10.0.0-SNAPSHOT [73/101]
[INFO]   from juneau-rest/juneau-rest-client-apache-httpclient-45/pom.xml
[INFO] -------------------------------[ bundle ]-------------------------------
[INFO] 
[INFO] --- clean:3.5.0:clean (default-clean) @ juneau-rest-client-apache-httpclient-45 ---
[INFO] Deleting <https://ci-builds.apache.org/job/Juneau/job/Juneau-Java-17/ws/juneau-rest/juneau-rest-client-apache-httpclient-45/target>
[INFO] 
[INFO] --- enforcer:3.6.2:enforce (enforce-maven-version) @ juneau-rest-client-apache-httpclient-45 ---
[INFO] 
[INFO] --- enforcer:3.6.2:enforce (enforce-java-version) @ juneau-rest-client-apache-httpclient-45 ---
[INFO] 
[INFO] --- enforcer:3.6.2:enforce (enforce-maven) @ juneau-rest-client-apache-httpclient-45 ---
[INFO] 
[INFO] --- jacoco:0.8.15:prepare-agent (prepare-agent) @ juneau-rest-client-apache-httpclient-45 ---
[INFO] argLine set to -javaagent:/home/jenkins/.m2/repository/org/jacoco/org.jacoco.agent/0.8.15/org.jacoco.agent-0.8.15-runtime.jar=destfile=<https://ci-builds.apache.org/job/Juneau/job/Juneau-Java-17/ws/juneau-rest/juneau-rest-client-apache-httpclient-45/target/jacoco.exec>
[INFO] 
[INFO] --- remote-resources:3.3.0:process (process-resource-bundles) @ juneau-rest-client-apache-httpclient-45 ---
[INFO] Preparing remote bundle org.apache.apache.resources:apache-jar-resource-bundle:1.7
[INFO] Copying 3 resources from 1 bundle.
[INFO] 
[INFO] --- resources:3.4.0:resources (default-resources) @ juneau-rest-client-apache-httpclient-45 ---
[INFO] Copying 1 resource from src/main/resources to target/classes
[INFO] Copying 3 resources from target/maven-shared-archive-resources to target/classes
[INFO] 
[INFO] --- compiler:3.16.0:compile (default-compile) @ juneau-rest-client-apache-httpclient-45 ---
[INFO] Recompiling the module because of changed dependency.
[INFO] Compiling 6 source files with javac [debug release 17] to target/classes
[INFO] 
[INFO] --- bundle:6.2.0:manifest (bundle-manifest) @ juneau-rest-client-apache-httpclient-45 ---
[INFO] No MANIFEST.MF file found, generating manifest.
[INFO] Writing manifest: <https://ci-builds.apache.org/job/Juneau/job/Juneau-Java-17/ws/juneau-rest/juneau-rest-client-apache-httpclient-45/target/classes/META-INF/MANIFEST.MF>
[INFO] 
[INFO] --- resources:3.4.0:testResources (default-testResources) @ juneau-rest-client-apache-httpclient-45 ---
[INFO] skip non existing resourceDirectory <https://ci-builds.apache.org/job/Juneau/job/Juneau-Java-17/ws/juneau-rest/juneau-rest-client-apache-httpclient-45/src/test/resources>
[INFO] Copying 3 resources from target/maven-shared-archive-resources to target/test-classes
[INFO] 
[INFO] --- compiler:3.16.0:testCompile (default-testCompile) @ juneau-rest-client-apache-httpclient-45 ---
[INFO] Recompiling the module because of changed dependency.
[INFO] Compiling 10 source files with javac [debug release 17] to target/test-classes
[INFO] 
[INFO] --- surefire:3.5.4:test (default-test) @ juneau-rest-client-apache-httpclient-45 ---
[INFO] Using auto detected provider org.apache.maven.surefire.junitplatform.JUnitPlatformProvider
[WARNING] The system property java.util.logging.config.file is configured twice! The property appears in <argLine/> and any of <systemPropertyVariables/>, <systemProperties/> or user property.
[INFO] 
[INFO] -------------------------------------------------------
[INFO]  T E S T S
[INFO] -------------------------------------------------------
[INFO] Running org.apache.juneau.rest.client.ApacheHc45Transport_ErrorPaths_Test
[INFO] Tests run: 7, Failures: 0, Errors: 0, Skipped: 0, Time elapsed: 0.308 s -- in org.apache.juneau.rest.client.ApacheHc45Transport_ErrorPaths_Test
[INFO] Running org.apache.juneau.rest.client.ApacheHc45Transport_SsrfGuard_Test
[INFO] Tests run: 6, Failures: 0, Errors: 0, Skipped: 0, Time elapsed: 1.039 s -- in org.apache.juneau.rest.client.ApacheHc45Transport_SsrfGuard_Test
[INFO] Running org.apache.juneau.rest.client.ApacheHc45Transport_CallerClientRedirectCredentials_Test
[ERROR] Tests run: 7, Failures: 1, Errors: 0, Skipped: 0, Time elapsed: 0.300 s <<< FAILURE! -- in org.apache.juneau.rest.client.ApacheHc45Transport_CallerClientRedirectCredentials_Test
[ERROR] org.apache.juneau.rest.client.ApacheHc45Transport_CallerClientRedirectCredentials_Test.a07_originBackToFirstOrigin_callerClient_credentialsStayStripped -- Time elapsed: 0.029 s <<< FAILURE!
org.opentest4j.AssertionFailedError: expected: <auth=none|cookie=none|key=none|trace=t-1> but was: <auth=Bearer secret-token|cookie=session=abc123|key=k-1|trace=t-1>
	at org.junit.jupiter.api.AssertionFailureBuilder.build(AssertionFailureBuilder.java:158)
	at org.junit.jupiter.api.AssertionFailureBuilder.buildAndThrow(AssertionFailureBuilder.java:139)
	at org.junit.jupiter.api.AssertEquals.failNotEqual(AssertEquals.java:201)
	at org.junit.jupiter.api.AssertEquals.assertEquals(AssertEquals.java:184)
	at org.junit.jupiter.api.AssertEquals.assertEquals(AssertEquals.java:179)
	at org.junit.jupiter.api.Assertions.assertEquals(Assertions.java:1188)
	at org.apache.juneau.rest.client.ApacheHc45Transport_CallerClientRedirectCredentials_Test.a07_originBackToFirstOrigin_callerClient_credentialsStayStripped(ApacheHc45Transport_CallerClientRedirectCredentials_Test.java:178)

[INFO] Running org.apache.juneau.rest.client.ApacheHc45Transport_Test
[INFO] Tests run: 17, Failures: 0, Errors: 0, Skipped: 0, Time elapsed: 0.179 s -- in org.apache.juneau.rest.client.ApacheHc45Transport_Test
[INFO] Running org.apache.juneau.rest.client.ApacheHc45Transport_RedirectCredentials_Test
[INFO] Tests run: 3, Failures: 0, Errors: 0, Skipped: 0, Time elapsed: 0.052 s -- in org.apache.juneau.rest.client.ApacheHc45Transport_RedirectCredentials_Test
[INFO] Running org.apache.juneau.rest.client.apachehttpclient45.ApacheHc45Transport_TransportBodyEntity_Test
[INFO] Tests run: 2, Failures: 0, Errors: 0, Skipped: 0, Time elapsed: 0.007 s -- in org.apache.juneau.rest.client.apachehttpclient45.ApacheHc45Transport_TransportBodyEntity_Test
[INFO] Running org.apache.juneau.rest.client.apachehttpclient45.ApacheHc45Transport_Policy_Test
[INFO] Tests run: 9, Failures: 0, Errors: 0, Skipped: 0, Time elapsed: 0.026 s -- in org.apache.juneau.rest.client.apachehttpclient45.ApacheHc45Transport_Policy_Test
[INFO] Running org.apache.juneau.rest.client.apachehttpclient45.Hc45RedirectCredentialGuard_Test
[INFO] Tests run: 8, Failures: 0, Errors: 0, Skipped: 0, Time elapsed: 0.021 s -- in org.apache.juneau.rest.client.apachehttpclient45.Hc45RedirectCredentialGuard_Test
[INFO] Running org.apache.juneau.rest.client.ApacheHc45Transport_Timeout_Test
[INFO] Tests run: 5, Failures: 0, Errors: 0, Skipped: 0, Time elapsed: 4.253 s -- in org.apache.juneau.rest.client.ApacheHc45Transport_Timeout_Test
[INFO] Running org.apache.juneau.rest.client.ApacheHc45Transport_StaleConnectionRetry_Test
[INFO] Tests run: 2, Failures: 0, Errors: 0, Skipped: 0, Time elapsed: 0.031 s -- in org.apache.juneau.rest.client.ApacheHc45Transport_StaleConnectionRetry_Test
[INFO] 
[INFO] Results:
[INFO] 
[ERROR] Failures: 
[ERROR]   ApacheHc45Transport_CallerClientRedirectCredentials_Test.a07_originBackToFirstOrigin_callerClient_credentialsStayStripped:178 expected: <auth=none|cookie=none|key=none|trace=t-1> but was: <auth=Bearer secret-token|cookie=session=abc123|key=k-1|trace=t-1>
[INFO] 
[ERROR] Tests run: 66, Failures: 1, Errors: 0, Skipped: 0
[INFO] 
[INFO] 
[INFO] ------------------------------------------------------------------------
[INFO] Skipping Apache Juneau
[INFO] This project has been banned from the build due to previous failures.
[INFO] ------------------------------------------------------------------------
[INFO] ------------------------------------------------------------------------
[INFO] Reactor Summary for Apache Juneau 10.0.0-SNAPSHOT:
[INFO] 
[INFO] Apache Juneau ...................................... SUCCESS [ 52.884 s]
[INFO] Apache Juneau Bill of Materials .................... SUCCESS [  3.913 s]
[INFO] Apache Juneau Core ................................. SUCCESS [  7.650 s]
[INFO] Apache Juneau Commons .............................. SUCCESS [02:00 min]
[INFO] Apache Juneau Test Utilities ....................... SUCCESS [  6.546 s]
[INFO] Apache Juneau Testing Toolkit ...................... SUCCESS [ 27.397 s]
[INFO] Apache Juneau Marshall ............................. SUCCESS [04:01 min]
[INFO] Apache Juneau Beans ................................ SUCCESS [  5.032 s]
[INFO] Apache Juneau RFC 7807 Beans ....................... SUCCESS [ 12.239 s]
[INFO] Apache Juneau Marshall Test Utilities .............. SUCCESS [  9.182 s]
[INFO] Apache Juneau REST ................................. SUCCESS [  8.338 s]
[INFO] Apache Juneau REST Common .......................... SUCCESS [ 31.867 s]
[INFO] Apache Juneau Config ............................... SUCCESS [ 22.183 s]
[INFO] Apache Juneau Common Beans ......................... SUCCESS [ 17.140 s]
[INFO] Apache Juneau HTML5 Beans .......................... SUCCESS [ 37.655 s]
[INFO] Apache Juneau JSON Schema Beans .................... SUCCESS [ 19.497 s]
[INFO] Apache Juneau Swagger 2.0 Beans .................... SUCCESS [ 22.011 s]
[INFO] Apache Juneau OpenAPI 3.0 Beans .................... SUCCESS [ 23.242 s]
[INFO] Apache Juneau REST Server .......................... SUCCESS [01:01 min]
[INFO] Apache Juneau REST Client .......................... SUCCESS [ 29.108 s]
[INFO] Apache Juneau REST Common (Classic) ................ SUCCESS [ 30.280 s]
[INFO] Apache Juneau REST Client (Classic) ................ SUCCESS [ 29.968 s]
[INFO] Apache Juneau REST Mock ............................ SUCCESS [ 27.286 s]
[INFO] Apache Juneau Microservices ........................ SUCCESS [  4.096 s]
[INFO] Apache Juneau Microservice ......................... SUCCESS [ 39.964 s]
[INFO] Apache Juneau REST Server Message Bus .............. SUCCESS [ 29.635 s]
[INFO] Apache Juneau REST Server Bus WebSocket ............ SUCCESS [ 26.420 s]
[INFO] Apache Juneau Microservice Jetty ................... SUCCESS [01:01 min]
[INFO] Apache Juneau Dependency Bundles ................... SUCCESS [  3.806 s]
[INFO] Apache Juneau Jetty Microservice Bundle ............ SUCCESS [  4.284 s]
[INFO] Apache Juneau Microservice Tomcat .................. SUCCESS [ 19.499 s]
[INFO] Apache Juneau Tomcat Microservice Bundle ........... SUCCESS [  3.987 s]
[INFO] Apache Juneau REST Server Spring Boot .............. SUCCESS [ 45.619 s]
[INFO] Apache Juneau Spring Boot Bundle ................... SUCCESS [  3.898 s]
[INFO] Apache Juneau REST Server Micrometer ............... SUCCESS [ 25.815 s]
[INFO] Apache Juneau REST Server OpenTelemetry ............ SUCCESS [ 23.795 s]
[INFO] Apache Juneau OTLP Observability Bundle ............ SUCCESS [  4.053 s]
[INFO] Apache Juneau BeanQuery SQL ........................ SUCCESS [ 12.923 s]
[INFO] Apache Juneau BeanQuery Postgres ................... SUCCESS [  9.018 s]
[INFO] juneau/core/marshall-rdf ........................... SUCCESS [01:34 min]
[INFO] Apache Juneau REST Server RDF ...................... SUCCESS [  9.657 s]
[INFO] Apache Juneau JSON-RPC Beans ....................... SUCCESS [ 13.431 s]
[INFO] Apache Juneau REST Server MCP ...................... SUCCESS [ 35.631 s]
[INFO] Apache Juneau MCP Beans (2025-06-18) ............... SUCCESS [ 15.045 s]
[INFO] Apache Juneau REST Server MCP (2025-06-18) ......... SUCCESS [01:10 min]
[INFO] Apache Juneau MCP Beans (2026-07-28) ............... SUCCESS [ 18.201 s]
[INFO] Apache Juneau REST Server Reactive Streams Core .... SUCCESS [ 18.543 s]
[INFO] Apache Juneau REST Auth OAuth Flow ................. SUCCESS [ 12.765 s]
[INFO] Apache Juneau REST Server JWT ...................... SUCCESS [ 28.563 s]
[INFO] Apache Juneau REST Server OAuth .................... SUCCESS [ 17.746 s]
[INFO] Apache Juneau REST Server MCP (2026-07-28) ......... SUCCESS [01:32 min]
[INFO] Apache Juneau REST Server SAML ..................... SUCCESS [01:04 min]
[INFO] Apache Juneau REST Server OIDC Relying Party ....... SUCCESS [ 37.869 s]
[INFO] Apache Juneau REST Server Logging Backends ......... SUCCESS [ 14.637 s]
[INFO] Apache Juneau REST Server DataTables ............... SUCCESS [ 21.899 s]
[INFO] Apache Juneau Run Report ........................... SUCCESS [ 15.859 s]
[INFO] Apache Juneau REST Server Widgets .................. SUCCESS [ 38.458 s]
[INFO] Apache Juneau REST Server Console UI ............... SUCCESS [ 57.520 s]
[INFO] Apache Juneau REST Server Views .................... SUCCESS [02:22 min]
[INFO] Apache Juneau REST Server Views Markdown ........... SUCCESS [ 11.520 s]
[INFO] Apache Juneau REST Server Terminal ................. SUCCESS [ 29.950 s]
[INFO] Apache Juneau REST Server View — FreeMarker ........ SUCCESS [ 32.450 s]
[INFO] Apache Juneau REST Server Console UI — FreeMarker .. SUCCESS [03:12 min]
[INFO] Apache Juneau REST Server Terminal Bus ............. SUCCESS [ 14.024 s]
[INFO] Apache Juneau REST Server Reactive Streams ......... SUCCESS [ 16.623 s]
[INFO] Apache Juneau REST Server View — JSP ............... SUCCESS [ 42.681 s]
[INFO] Apache Juneau REST Server View — Thymeleaf ......... SUCCESS [ 29.709 s]
[INFO] Apache Juneau REST Server View — Mustache .......... SUCCESS [ 28.565 s]
[INFO] Apache Juneau REST Client MCP ...................... SUCCESS [ 13.060 s]
[INFO] Apache Juneau REST Client MCP (2025-06-18) ......... SUCCESS [ 13.042 s]
[INFO] Apache Juneau REST Client MCP (2026-07-28) ......... SUCCESS [ 16.873 s]
[INFO] Apache Juneau REST Client MCP Auth ................. SUCCESS [ 17.356 s]
[INFO] Apache Juneau NG REST Client — Apache HttpClient 4.5 Transport FAILURE [  9.256 s]
[INFO] Apache Juneau NG REST Client — Apache HttpClient 5.x Transport SKIPPED
[INFO] Apache Juneau NG REST Client — OkHttp Transport .... SKIPPED
[INFO] Apache Juneau NG REST Client — Jetty HttpClient Transport SKIPPED
[INFO] Apache Juneau Microservice Test Support ............ SKIPPED
[INFO] Apache Juneau Microservice Examples ................ SKIPPED
[INFO] Apache Juneau Server Config ........................ SKIPPED
[INFO] Apache Juneau Server Config Server ................. SKIPPED
[INFO] Apache Juneau Secret Store - macOS Keychain ........ SKIPPED
[INFO] Apache Juneau Run Wrapper .......................... SKIPPED
[INFO] Apache Juneau Atom Beans ........................... SKIPPED
[INFO] Apache Juneau Examples ............................. SKIPPED
[INFO] Apache Juneau Core Examples ........................ SKIPPED
[INFO] Apache Juneau MCP Examples ......................... SKIPPED
[INFO] Apache Juneau Petstore ............................. SKIPPED
[INFO] Apache Juneau Petstore Core ........................ SKIPPED
[INFO] Apache Juneau Petstore Jetty ....................... SKIPPED
[INFO] Apache Juneau Petstore Spring Boot ................. SKIPPED
[INFO] Apache Juneau HAL Beans ............................ SKIPPED
[INFO] Apache Juneau JSON:API Beans ....................... SKIPPED
[INFO] Apache Juneau JSON Patch Beans ..................... SKIPPED
[INFO] Apache Juneau Integration Tests .................... SKIPPED
[INFO] Apache Juneau Shaded Artifacts ..................... SKIPPED
[INFO] Apache Juneau Core (Shaded) ........................ SKIPPED
[INFO] Apache Juneau REST Client (Shaded) ................. SKIPPED
[INFO] Apache Juneau REST Server (Shaded) ................. SKIPPED
[INFO] Apache Juneau REST Server Spring Boot (Shaded) ..... SKIPPED
[INFO] Apache Juneau All (Shaded) ......................... SKIPPED
[INFO] Apache Juneau Distribution ......................... SKIPPED
[INFO] ------------------------------------------------------------------------
[INFO] BUILD FAILURE
[INFO] ------------------------------------------------------------------------
[INFO] Total time:  40:56 min
[INFO] Finished at: 2026-10-16T17:16:24Z
[INFO] ------------------------------------------------------------------------
[ERROR] Failed to execute goal org.apache.maven.plugins:maven-surefire-plugin:3.5.4:test (default-test) on project juneau-rest-client-apache-httpclient-45: There are test failures.
[ERROR] 
[ERROR] See <https://ci-builds.apache.org/job/Juneau/job/Juneau-Java-17/ws/juneau-rest/juneau-rest-client-apache-httpclient-45/target/surefire-reports> for the individual test results.
[ERROR] See dump files (if any exist) [date].dump, [date]-jvmRun[N].dump and [date].dumpstream.
[ERROR] -> [Help 1]
[ERROR] 
[ERROR] To see the full stack trace of the errors, re-run Maven with the -e switch.
[ERROR] Re-run Maven using the -X switch to enable full debug logging.
[ERROR] 
[ERROR] For more information about the errors and possible solutions, please read the following articles:
[ERROR] [Help 1] http://cwiki.apache.org/confluence/display/MAVEN/MojoFailureException
[ERROR] 
[ERROR] After correcting the problems, you can resume the build with the command
[ERROR]   mvn <args> -rf :juneau-rest-client-apache-httpclient-45
Build step 'Invoke top-level Maven targets' marked build as failure
Recording test results
[Checks API] No suitable checks publisher found.

Build failed in Jenkins: Juneau » Juneau-Java-17 #2750

Posted by Apache Jenkins Server <je...@builds.apache.org>.
See <https://ci-builds.apache.org/job/Juneau/job/Juneau-Java-17/2750/display/redirect?page=changes>

Changes:

[github] build(deps): bump github/codeql-action/init from 4.38.2 to 4.38.3


------------------------------------------
[...truncated 1.72 MiB...]
[INFO] --- apache-rat:0.16.1:check (default) @ juneau-rest-client-mcp-auth ---
[INFO] Rat check: Summary over all files. Unapproved: 0, unknown: 0, generated: 0, approved: 38 licenses.
[INFO] 
[INFO] --- install:3.1.4:install (default-install) @ juneau-rest-client-mcp-auth ---
[INFO] Installing <https://ci-builds.apache.org/job/Juneau/job/Juneau-Java-17/ws/juneau-rest/juneau-rest-client-mcp-auth/pom.xml> to /home/jenkins/.m2/repository/org/apache/juneau/juneau-rest-client-mcp-auth/10.0.0-SNAPSHOT/juneau-rest-client-mcp-auth-10.0.0-SNAPSHOT.pom
[INFO] Installing <https://ci-builds.apache.org/job/Juneau/job/Juneau-Java-17/ws/juneau-rest/juneau-rest-client-mcp-auth/target/juneau-rest-client-mcp-auth-10.0.0-SNAPSHOT.jar> to /home/jenkins/.m2/repository/org/apache/juneau/juneau-rest-client-mcp-auth/10.0.0-SNAPSHOT/juneau-rest-client-mcp-auth-10.0.0-SNAPSHOT.jar
[INFO] Installing <https://ci-builds.apache.org/job/Juneau/job/Juneau-Java-17/ws/juneau-rest/juneau-rest-client-mcp-auth/target/juneau-rest-client-mcp-auth-10.0.0-SNAPSHOT-sources.jar> to /home/jenkins/.m2/repository/org/apache/juneau/juneau-rest-client-mcp-auth/10.0.0-SNAPSHOT/juneau-rest-client-mcp-auth-10.0.0-SNAPSHOT-sources.jar
[INFO] 
[INFO] --- bundle:6.2.0:install (default-install) @ juneau-rest-client-mcp-auth ---
[INFO] Installing org/apache/juneau/juneau-rest-client-mcp-auth/10.0.0-SNAPSHOT/juneau-rest-client-mcp-auth-10.0.0-SNAPSHOT.jar
[INFO] Writing OBR metadata
[INFO] 
[INFO] --- deploy:3.1.4:deploy (default-deploy) @ juneau-rest-client-mcp-auth ---
Downloading from apache.snapshots.https: https://repository.apache.org/content/repositories/snapshots/org/apache/juneau/juneau-rest-client-mcp-auth/10.0.0-SNAPSHOT/maven-metadata.xml
Progress (1): 1.0 kB                    Downloaded from apache.snapshots.https: https://repository.apache.org/content/repositories/snapshots/org/apache/juneau/juneau-rest-client-mcp-auth/10.0.0-SNAPSHOT/maven-metadata.xml (1.0 kB at 5.6 kB/s)
Uploading to apache.snapshots.https: https://repository.apache.org/content/repositories/snapshots/org/apache/juneau/juneau-rest-client-mcp-auth/10.0.0-SNAPSHOT/juneau-rest-client-mcp-auth-10.0.0-20261016.145118-137.pom
Progress (1): 5.2 kB                    Uploaded to apache.snapshots.https: https://repository.apache.org/content/repositories/snapshots/org/apache/juneau/juneau-rest-client-mcp-auth/10.0.0-SNAPSHOT/juneau-rest-client-mcp-auth-10.0.0-20261016.145118-137.pom (5.2 kB at 5.0 kB/s)
Uploading to apache.snapshots.https: https://repository.apache.org/content/repositories/snapshots/org/apache/juneau/juneau-rest-client-mcp-auth/10.0.0-SNAPSHOT/juneau-rest-client-mcp-auth-10.0.0-20261016.145118-137.jar
Uploading to apache.snapshots.https: https://repository.apache.org/content/repositories/snapshots/org/apache/juneau/juneau-rest-client-mcp-auth/10.0.0-SNAPSHOT/juneau-rest-client-mcp-auth-10.0.0-20261016.145118-137-sources.jar
Progress (1): 33/78 kBProgress (1): 66/78 kBProgress (1): 78 kB   Progress (2): 78 kB | 33/64 kBProgress (2): 78 kB | 64 kB                              Uploaded to apache.snapshots.https: https://repository.apache.org/content/repositories/snapshots/org/apache/juneau/juneau-rest-client-mcp-auth/10.0.0-SNAPSHOT/juneau-rest-client-mcp-auth-10.0.0-20261016.145118-137.jar (78 kB at 57 kB/s)
Uploaded to apache.snapshots.https: https://repository.apache.org/content/repositories/snapshots/org/apache/juneau/juneau-rest-client-mcp-auth/10.0.0-SNAPSHOT/juneau-rest-client-mcp-auth-10.0.0-20261016.145118-137-sources.jar (64 kB at 38 kB/s)
Downloading from apache.snapshots.https: https://repository.apache.org/content/repositories/snapshots/org/apache/juneau/juneau-rest-client-mcp-auth/maven-metadata.xml
Progress (1): 305 B                   Downloaded from apache.snapshots.https: https://repository.apache.org/content/repositories/snapshots/org/apache/juneau/juneau-rest-client-mcp-auth/maven-metadata.xml (305 B at 1.8 kB/s)
Uploading to apache.snapshots.https: https://repository.apache.org/content/repositories/snapshots/org/apache/juneau/juneau-rest-client-mcp-auth/10.0.0-SNAPSHOT/maven-metadata.xml
Progress (1): 1.0 kB                    Uploaded to apache.snapshots.https: https://repository.apache.org/content/repositories/snapshots/org/apache/juneau/juneau-rest-client-mcp-auth/10.0.0-SNAPSHOT/maven-metadata.xml (1.0 kB at 994 B/s)
Uploading to apache.snapshots.https: https://repository.apache.org/content/repositories/snapshots/org/apache/juneau/juneau-rest-client-mcp-auth/maven-metadata.xml
Progress (1): 305 B                   Uploaded to apache.snapshots.https: https://repository.apache.org/content/repositories/snapshots/org/apache/juneau/juneau-rest-client-mcp-auth/maven-metadata.xml (305 B at 297 B/s)
[INFO] 
[INFO] --- bundle:6.2.0:deploy (default-deploy) @ juneau-rest-client-mcp-auth ---
[INFO] Remote OBR update disabled (enable with -DremoteOBR)
[INFO] 
[INFO] -----< org.apache.juneau:juneau-rest-client-apache-httpclient-45 >------
[INFO] Building Apache Juneau NG REST Client — Apache HttpClient 4.5 Transport 10.0.0-SNAPSHOT [73/101]
[INFO]   from juneau-rest/juneau-rest-client-apache-httpclient-45/pom.xml
[INFO] -------------------------------[ bundle ]-------------------------------
[INFO] 
[INFO] --- clean:3.5.0:clean (default-clean) @ juneau-rest-client-apache-httpclient-45 ---
[INFO] Deleting <https://ci-builds.apache.org/job/Juneau/job/Juneau-Java-17/ws/juneau-rest/juneau-rest-client-apache-httpclient-45/target>
[INFO] 
[INFO] --- enforcer:3.6.2:enforce (enforce-maven-version) @ juneau-rest-client-apache-httpclient-45 ---
[INFO] 
[INFO] --- enforcer:3.6.2:enforce (enforce-java-version) @ juneau-rest-client-apache-httpclient-45 ---
[INFO] 
[INFO] --- enforcer:3.6.2:enforce (enforce-maven) @ juneau-rest-client-apache-httpclient-45 ---
[INFO] 
[INFO] --- jacoco:0.8.15:prepare-agent (prepare-agent) @ juneau-rest-client-apache-httpclient-45 ---
[INFO] argLine set to -javaagent:/home/jenkins/.m2/repository/org/jacoco/org.jacoco.agent/0.8.15/org.jacoco.agent-0.8.15-runtime.jar=destfile=<https://ci-builds.apache.org/job/Juneau/job/Juneau-Java-17/ws/juneau-rest/juneau-rest-client-apache-httpclient-45/target/jacoco.exec>
[INFO] 
[INFO] --- remote-resources:3.3.0:process (process-resource-bundles) @ juneau-rest-client-apache-httpclient-45 ---
[INFO] Preparing remote bundle org.apache.apache.resources:apache-jar-resource-bundle:1.7
[INFO] Copying 3 resources from 1 bundle.
[INFO] 
[INFO] --- resources:3.4.0:resources (default-resources) @ juneau-rest-client-apache-httpclient-45 ---
[INFO] Copying 1 resource from src/main/resources to target/classes
[INFO] Copying 3 resources from target/maven-shared-archive-resources to target/classes
[INFO] 
[INFO] --- compiler:3.16.0:compile (default-compile) @ juneau-rest-client-apache-httpclient-45 ---
[INFO] Recompiling the module because of changed dependency.
[INFO] Compiling 6 source files with javac [debug release 17] to target/classes
[INFO] 
[INFO] --- bundle:6.2.0:manifest (bundle-manifest) @ juneau-rest-client-apache-httpclient-45 ---
[INFO] No MANIFEST.MF file found, generating manifest.
[INFO] Writing manifest: <https://ci-builds.apache.org/job/Juneau/job/Juneau-Java-17/ws/juneau-rest/juneau-rest-client-apache-httpclient-45/target/classes/META-INF/MANIFEST.MF>
[INFO] 
[INFO] --- resources:3.4.0:testResources (default-testResources) @ juneau-rest-client-apache-httpclient-45 ---
[INFO] skip non existing resourceDirectory <https://ci-builds.apache.org/job/Juneau/job/Juneau-Java-17/ws/juneau-rest/juneau-rest-client-apache-httpclient-45/src/test/resources>
[INFO] Copying 3 resources from target/maven-shared-archive-resources to target/test-classes
[INFO] 
[INFO] --- compiler:3.16.0:testCompile (default-testCompile) @ juneau-rest-client-apache-httpclient-45 ---
[INFO] Recompiling the module because of changed dependency.
[INFO] Compiling 10 source files with javac [debug release 17] to target/test-classes
[INFO] 
[INFO] --- surefire:3.5.4:test (default-test) @ juneau-rest-client-apache-httpclient-45 ---
[INFO] Using auto detected provider org.apache.maven.surefire.junitplatform.JUnitPlatformProvider
[WARNING] The system property java.util.logging.config.file is configured twice! The property appears in <argLine/> and any of <systemPropertyVariables/>, <systemProperties/> or user property.
[INFO] 
[INFO] -------------------------------------------------------
[INFO]  T E S T S
[INFO] -------------------------------------------------------
[INFO] Running org.apache.juneau.rest.client.ApacheHc45Transport_CallerClientRedirectCredentials_Test
[ERROR] Tests run: 7, Failures: 1, Errors: 0, Skipped: 0, Time elapsed: 1.573 s <<< FAILURE! -- in org.apache.juneau.rest.client.ApacheHc45Transport_CallerClientRedirectCredentials_Test
[ERROR] org.apache.juneau.rest.client.ApacheHc45Transport_CallerClientRedirectCredentials_Test.a07_originBackToFirstOrigin_callerClient_credentialsStayStripped -- Time elapsed: 0.039 s <<< FAILURE!
org.opentest4j.AssertionFailedError: expected: <auth=none|cookie=none|key=none|trace=t-1> but was: <auth=Bearer secret-token|cookie=session=abc123|key=k-1|trace=t-1>
	at org.junit.jupiter.api.AssertionFailureBuilder.build(AssertionFailureBuilder.java:158)
	at org.junit.jupiter.api.AssertionFailureBuilder.buildAndThrow(AssertionFailureBuilder.java:139)
	at org.junit.jupiter.api.AssertEquals.failNotEqual(AssertEquals.java:201)
	at org.junit.jupiter.api.AssertEquals.assertEquals(AssertEquals.java:184)
	at org.junit.jupiter.api.AssertEquals.assertEquals(AssertEquals.java:179)
	at org.junit.jupiter.api.Assertions.assertEquals(Assertions.java:1188)
	at org.apache.juneau.rest.client.ApacheHc45Transport_CallerClientRedirectCredentials_Test.a07_originBackToFirstOrigin_callerClient_credentialsStayStripped(ApacheHc45Transport_CallerClientRedirectCredentials_Test.java:178)

[INFO] Running org.apache.juneau.rest.client.ApacheHc45Transport_SsrfGuard_Test
[INFO] Tests run: 6, Failures: 0, Errors: 0, Skipped: 0, Time elapsed: 0.162 s -- in org.apache.juneau.rest.client.ApacheHc45Transport_SsrfGuard_Test
[INFO] Running org.apache.juneau.rest.client.ApacheHc45Transport_Test
[INFO] Tests run: 17, Failures: 0, Errors: 0, Skipped: 0, Time elapsed: 0.252 s -- in org.apache.juneau.rest.client.ApacheHc45Transport_Test
[INFO] Running org.apache.juneau.rest.client.ApacheHc45Transport_ErrorPaths_Test
[INFO] Tests run: 7, Failures: 0, Errors: 0, Skipped: 0, Time elapsed: 0.047 s -- in org.apache.juneau.rest.client.ApacheHc45Transport_ErrorPaths_Test
[INFO] Running org.apache.juneau.rest.client.ApacheHc45Transport_RedirectCredentials_Test
[INFO] Tests run: 3, Failures: 0, Errors: 0, Skipped: 0, Time elapsed: 0.073 s -- in org.apache.juneau.rest.client.ApacheHc45Transport_RedirectCredentials_Test
[INFO] Running org.apache.juneau.rest.client.apachehttpclient45.Hc45RedirectCredentialGuard_Test
[INFO] Tests run: 8, Failures: 0, Errors: 0, Skipped: 0, Time elapsed: 0.024 s -- in org.apache.juneau.rest.client.apachehttpclient45.Hc45RedirectCredentialGuard_Test
[INFO] Running org.apache.juneau.rest.client.apachehttpclient45.ApacheHc45Transport_TransportBodyEntity_Test
[INFO] Tests run: 2, Failures: 0, Errors: 0, Skipped: 0, Time elapsed: 0.011 s -- in org.apache.juneau.rest.client.apachehttpclient45.ApacheHc45Transport_TransportBodyEntity_Test
[INFO] Running org.apache.juneau.rest.client.apachehttpclient45.ApacheHc45Transport_Policy_Test
[INFO] Tests run: 9, Failures: 0, Errors: 0, Skipped: 0, Time elapsed: 0.045 s -- in org.apache.juneau.rest.client.apachehttpclient45.ApacheHc45Transport_Policy_Test
[INFO] Running org.apache.juneau.rest.client.ApacheHc45Transport_StaleConnectionRetry_Test
[INFO] Tests run: 2, Failures: 0, Errors: 0, Skipped: 0, Time elapsed: 0.041 s -- in org.apache.juneau.rest.client.ApacheHc45Transport_StaleConnectionRetry_Test
[INFO] Running org.apache.juneau.rest.client.ApacheHc45Transport_Timeout_Test
[INFO] Tests run: 5, Failures: 0, Errors: 0, Skipped: 0, Time elapsed: 4.260 s -- in org.apache.juneau.rest.client.ApacheHc45Transport_Timeout_Test
[INFO] 
[INFO] Results:
[INFO] 
[ERROR] Failures: 
[ERROR]   ApacheHc45Transport_CallerClientRedirectCredentials_Test.a07_originBackToFirstOrigin_callerClient_credentialsStayStripped:178 expected: <auth=none|cookie=none|key=none|trace=t-1> but was: <auth=Bearer secret-token|cookie=session=abc123|key=k-1|trace=t-1>
[INFO] 
[ERROR] Tests run: 66, Failures: 1, Errors: 0, Skipped: 0
[INFO] 
[INFO] 
[INFO] ------------------------------------------------------------------------
[INFO] Skipping Apache Juneau
[INFO] This project has been banned from the build due to previous failures.
[INFO] ------------------------------------------------------------------------
[INFO] ------------------------------------------------------------------------
[INFO] Reactor Summary for Apache Juneau 10.0.0-SNAPSHOT:
[INFO] 
[INFO] Apache Juneau ...................................... SUCCESS [ 56.436 s]
[INFO] Apache Juneau Bill of Materials .................... SUCCESS [  3.789 s]
[INFO] Apache Juneau Core ................................. SUCCESS [  8.750 s]
[INFO] Apache Juneau Commons .............................. SUCCESS [02:18 min]
[INFO] Apache Juneau Test Utilities ....................... SUCCESS [  6.764 s]
[INFO] Apache Juneau Testing Toolkit ...................... SUCCESS [ 31.931 s]
[INFO] Apache Juneau Marshall ............................. SUCCESS [05:09 min]
[INFO] Apache Juneau Beans ................................ SUCCESS [  5.085 s]
[INFO] Apache Juneau RFC 7807 Beans ....................... SUCCESS [ 12.791 s]
[INFO] Apache Juneau Marshall Test Utilities .............. SUCCESS [  9.966 s]
[INFO] Apache Juneau REST ................................. SUCCESS [ 12.229 s]
[INFO] Apache Juneau REST Common .......................... SUCCESS [ 38.235 s]
[INFO] Apache Juneau Config ............................... SUCCESS [ 26.574 s]
[INFO] Apache Juneau Common Beans ......................... SUCCESS [ 18.148 s]
[INFO] Apache Juneau HTML5 Beans .......................... SUCCESS [ 49.141 s]
[INFO] Apache Juneau JSON Schema Beans .................... SUCCESS [ 21.405 s]
[INFO] Apache Juneau Swagger 2.0 Beans .................... SUCCESS [ 24.792 s]
[INFO] Apache Juneau OpenAPI 3.0 Beans .................... SUCCESS [ 26.097 s]
[INFO] Apache Juneau REST Server .......................... SUCCESS [01:18 min]
[INFO] Apache Juneau REST Client .......................... SUCCESS [ 31.837 s]
[INFO] Apache Juneau REST Common (Classic) ................ SUCCESS [ 35.518 s]
[INFO] Apache Juneau REST Client (Classic) ................ SUCCESS [ 36.719 s]
[INFO] Apache Juneau REST Mock ............................ SUCCESS [ 34.383 s]
[INFO] Apache Juneau Microservices ........................ SUCCESS [  4.078 s]
[INFO] Apache Juneau Microservice ......................... SUCCESS [ 44.681 s]
[INFO] Apache Juneau REST Server Message Bus .............. SUCCESS [ 31.351 s]
[INFO] Apache Juneau REST Server Bus WebSocket ............ SUCCESS [ 28.770 s]
[INFO] Apache Juneau Microservice Jetty ................... SUCCESS [01:04 min]
[INFO] Apache Juneau Dependency Bundles ................... SUCCESS [  3.651 s]
[INFO] Apache Juneau Jetty Microservice Bundle ............ SUCCESS [  4.440 s]
[INFO] Apache Juneau Microservice Tomcat .................. SUCCESS [ 23.394 s]
[INFO] Apache Juneau Tomcat Microservice Bundle ........... SUCCESS [  4.242 s]
[INFO] Apache Juneau REST Server Spring Boot .............. SUCCESS [ 54.864 s]
[INFO] Apache Juneau Spring Boot Bundle ................... SUCCESS [  3.987 s]
[INFO] Apache Juneau REST Server Micrometer ............... SUCCESS [ 31.454 s]
[INFO] Apache Juneau REST Server OpenTelemetry ............ SUCCESS [ 25.961 s]
[INFO] Apache Juneau OTLP Observability Bundle ............ SUCCESS [  3.934 s]
[INFO] Apache Juneau BeanQuery SQL ........................ SUCCESS [ 13.536 s]
[INFO] Apache Juneau BeanQuery Postgres ................... SUCCESS [  9.592 s]
[INFO] juneau/core/marshall-rdf ........................... SUCCESS [01:40 min]
[INFO] Apache Juneau REST Server RDF ...................... SUCCESS [ 11.955 s]
[INFO] Apache Juneau JSON-RPC Beans ....................... SUCCESS [ 14.821 s]
[INFO] Apache Juneau REST Server MCP ...................... SUCCESS [ 41.308 s]
[INFO] Apache Juneau MCP Beans (2025-06-18) ............... SUCCESS [ 17.440 s]
[INFO] Apache Juneau REST Server MCP (2025-06-18) ......... SUCCESS [01:15 min]
[INFO] Apache Juneau MCP Beans (2026-07-28) ............... SUCCESS [ 22.015 s]
[INFO] Apache Juneau REST Server Reactive Streams Core .... SUCCESS [ 21.815 s]
[INFO] Apache Juneau REST Auth OAuth Flow ................. SUCCESS [ 14.653 s]
[INFO] Apache Juneau REST Server JWT ...................... SUCCESS [ 33.698 s]
[INFO] Apache Juneau REST Server OAuth .................... SUCCESS [ 21.158 s]
[INFO] Apache Juneau REST Server MCP (2026-07-28) ......... SUCCESS [01:58 min]
[INFO] Apache Juneau REST Server SAML ..................... SUCCESS [01:28 min]
[INFO] Apache Juneau REST Server OIDC Relying Party ....... SUCCESS [ 50.085 s]
[INFO] Apache Juneau REST Server Logging Backends ......... SUCCESS [ 16.260 s]
[INFO] Apache Juneau REST Server DataTables ............... SUCCESS [ 24.356 s]
[INFO] Apache Juneau Run Report ........................... SUCCESS [ 17.012 s]
[INFO] Apache Juneau REST Server Widgets .................. SUCCESS [ 43.757 s]
[INFO] Apache Juneau REST Server Console UI ............... SUCCESS [01:22 min]
[INFO] Apache Juneau REST Server Views .................... SUCCESS [02:57 min]
[INFO] Apache Juneau REST Server Views Markdown ........... SUCCESS [ 13.638 s]
[INFO] Apache Juneau REST Server Terminal ................. SUCCESS [ 34.287 s]
[INFO] Apache Juneau REST Server View — FreeMarker ........ SUCCESS [ 41.775 s]
[INFO] Apache Juneau REST Server Console UI — FreeMarker .. SUCCESS [04:20 min]
[INFO] Apache Juneau REST Server Terminal Bus ............. SUCCESS [ 18.370 s]
[INFO] Apache Juneau REST Server Reactive Streams ......... SUCCESS [ 18.488 s]
[INFO] Apache Juneau REST Server View — JSP ............... SUCCESS [ 55.045 s]
[INFO] Apache Juneau REST Server View — Thymeleaf ......... SUCCESS [ 34.605 s]
[INFO] Apache Juneau REST Server View — Mustache .......... SUCCESS [ 36.257 s]
[INFO] Apache Juneau REST Client MCP ...................... SUCCESS [ 16.412 s]
[INFO] Apache Juneau REST Client MCP (2025-06-18) ......... SUCCESS [ 14.595 s]
[INFO] Apache Juneau REST Client MCP (2026-07-28) ......... SUCCESS [ 20.655 s]
[INFO] Apache Juneau REST Client MCP Auth ................. SUCCESS [ 19.864 s]
[INFO] Apache Juneau NG REST Client — Apache HttpClient 4.5 Transport FAILURE [  9.697 s]
[INFO] Apache Juneau NG REST Client — Apache HttpClient 5.x Transport SKIPPED
[INFO] Apache Juneau NG REST Client — OkHttp Transport .... SKIPPED
[INFO] Apache Juneau NG REST Client — Jetty HttpClient Transport SKIPPED
[INFO] Apache Juneau Microservice Test Support ............ SKIPPED
[INFO] Apache Juneau Microservice Examples ................ SKIPPED
[INFO] Apache Juneau Server Config ........................ SKIPPED
[INFO] Apache Juneau Server Config Server ................. SKIPPED
[INFO] Apache Juneau Secret Store - macOS Keychain ........ SKIPPED
[INFO] Apache Juneau Run Wrapper .......................... SKIPPED
[INFO] Apache Juneau Atom Beans ........................... SKIPPED
[INFO] Apache Juneau Examples ............................. SKIPPED
[INFO] Apache Juneau Core Examples ........................ SKIPPED
[INFO] Apache Juneau MCP Examples ......................... SKIPPED
[INFO] Apache Juneau Petstore ............................. SKIPPED
[INFO] Apache Juneau Petstore Core ........................ SKIPPED
[INFO] Apache Juneau Petstore Jetty ....................... SKIPPED
[INFO] Apache Juneau Petstore Spring Boot ................. SKIPPED
[INFO] Apache Juneau HAL Beans ............................ SKIPPED
[INFO] Apache Juneau JSON:API Beans ....................... SKIPPED
[INFO] Apache Juneau JSON Patch Beans ..................... SKIPPED
[INFO] Apache Juneau Integration Tests .................... SKIPPED
[INFO] Apache Juneau Shaded Artifacts ..................... SKIPPED
[INFO] Apache Juneau Core (Shaded) ........................ SKIPPED
[INFO] Apache Juneau REST Client (Shaded) ................. SKIPPED
[INFO] Apache Juneau REST Server (Shaded) ................. SKIPPED
[INFO] Apache Juneau REST Server Spring Boot (Shaded) ..... SKIPPED
[INFO] Apache Juneau All (Shaded) ......................... SKIPPED
[INFO] Apache Juneau Distribution ......................... SKIPPED
[INFO] ------------------------------------------------------------------------
[INFO] BUILD FAILURE
[INFO] ------------------------------------------------------------------------
[INFO] Total time:  49:19 min
[INFO] Finished at: 2026-10-16T15:40:38Z
[INFO] ------------------------------------------------------------------------
[ERROR] Failed to execute goal org.apache.maven.plugins:maven-surefire-plugin:3.5.4:test (default-test) on project juneau-rest-client-apache-httpclient-45: There are test failures.
[ERROR] 
[ERROR] See <https://ci-builds.apache.org/job/Juneau/job/Juneau-Java-17/ws/juneau-rest/juneau-rest-client-apache-httpclient-45/target/surefire-reports> for the individual test results.
[ERROR] See dump files (if any exist) [date].dump, [date]-jvmRun[N].dump and [date].dumpstream.
[ERROR] -> [Help 1]
[ERROR] 
[ERROR] To see the full stack trace of the errors, re-run Maven with the -e switch.
[ERROR] Re-run Maven using the -X switch to enable full debug logging.
[ERROR] 
[ERROR] For more information about the errors and possible solutions, please read the following articles:
[ERROR] [Help 1] http://cwiki.apache.org/confluence/display/MAVEN/MojoFailureException
[ERROR] 
[ERROR] After correcting the problems, you can resume the build with the command
[ERROR]   mvn <args> -rf :juneau-rest-client-apache-httpclient-45
Build step 'Invoke top-level Maven targets' marked build as failure
Recording test results
[Checks API] No suitable checks publisher found.