You are viewing a plain text version of this content. The canonical link for it is here.
Posted to commits@tuscany.apache.org by Apache Hudson Server <hu...@hudson.zones.apache.org> on 2010/03/22 14:36:44 UTC
Build failed in Hudson: Tuscany-2x #572
See <http://hudson.zones.apache.org/hudson/job/Tuscany-2x/572/changes>
Changes:
[antelder] Remove old testcase
------------------------------------------
[...truncated 10804 lines...]
T E S T S
-------------------------------------------------------
Running calculator.dosgi.operations.test.OperationsOSGiNodeTestCase
1 org.apache.tuscany.sca.node.launcher.equinox ACTIVE
2 org.apache.tuscany.sca.node.launcher.equinox.libraries.jaxb-api ACTIVE
3 org.apache.tuscany.sca.node.launcher.equinox.libraries.howl ACTIVE
4 org.apache.tuscany.sca.node.launcher.equinox.libraries.activation ACTIVE
5 org.apache.tuscany.sca.node.launcher.equinox.libraries.servlet-api ACTIVE
6 org.apache.tuscany.sca.node.launcher.equinox.libraries.surefire-api ACTIVE
7 org.apache.tuscany.sca.node.launcher.equinox.libraries.jsr181-api ACTIVE
8 org.apache.tuscany.sca.node.launcher.equinox.libraries.surefire-junit4 ACTIVE
9 org.apache.tuscany.sca.node.launcher.equinox.libraries.wstx-asl ACTIVE
10 org.apache.tuscany.sca.node.launcher.equinox.libraries.jaxws-api ACTIVE
11 org.apache.tuscany.sca.node.launcher.equinox.libraries.junit ACTIVE
12 org.apache.tuscany.sca.node.launcher.equinox.libraries.asm ACTIVE
13 org.apache.tuscany.sca.node.launcher.equinox.libraries.wsdl4j ACTIVE
14 org.apache.tuscany.sca.node.launcher.equinox.libraries.commons-logging ACTIVE
15 org.apache.tuscany.sca.node.launcher.equinox.libraries.hazelcast ACTIVE
16 org.apache.tuscany.sca.node.launcher.equinox.libraries.cglib ACTIVE
17 org.apache.tuscany.sca.node.launcher.equinox.libraries.hazelcast-client ACTIVE
18 org.apache.tuscany.sca.node.launcher.equinox.libraries.aopalliance ACTIVE
19 org.apache.tuscany.sca.node.launcher.equinox.libraries.jaxb-impl ACTIVE
20 org.apache.tuscany.sca.node.launcher.equinox.libraries.jsr250-api ACTIVE
21 org.apache.tuscany.sca.gateway ACTIVE
23 org.apache.tuscany.sca.extensibility.equinox ACTIVE
24 org.apache.tuscany.sca.builder ACTIVE
25 org.apache.tuscany.sca.monitor ACTIVE
26 org.apache.tuscany.sca.assembly.xsd ACTIVE
28 org.apache.tuscany.sca.endpoint.hazelcast.client ACTIVE
30 org.apache.tuscany.sca.contribution.osgi ACTIVE
31 org.apache.tuscany.sca.implementation.spring ACTIVE
32 org.apache.tuscany.sca.common.java ACTIVE
33 org.apache.tuscany.sca.extensibility ACTIVE
34 org.apache.tuscany.sca.binding.rmi.runtime ACTIVE
36 org.apache.tuscany.sca.host.http ACTIVE
37 org.apache.tuscany.sca.policy.transaction.runtime.geronimo ACTIVE
38 org.apache.tuscany.sca.implementation.java.runtime ACTIVE
39 org.apache.tuscany.sca.binding.rmi ACTIVE
40 org.apache.tuscany.sca.interface.wsdl ACTIVE
42 org.apache.tuscany.sca.deployment ACTIVE
43 org.apache.tuscany.sca.assembly.xml ACTIVE
44 org.apache.tuscany.sca.implementation.osgi ACTIVE
46 org.apache.tuscany.sca.implementation.spring.runtime ACTIVE
47 org.apache.tuscany.sca.assembly ACTIVE
49 org.apache.tuscany.sca.databinding.jaxb ACTIVE
51 org.apache.tuscany.sca.common.xml ACTIVE
53 org.apache.tuscany.sca.policy.transaction ACTIVE
55 org.apache.tuscany.sca.databinding ACTIVE
56 org.apache.tuscany.sca.xsd ACTIVE
57 org.eclipse.equinox.ds ACTIVE
58 org.apache.tuscany.sca.core.spi ACTIVE
59 org.apache.tuscany.sca.interface.java.jaxws ACTIVE
60 org.apache.tuscany.sca.policy.security ACTIVE
61 org.apache.tuscany.sca.binding.sca.runtime ACTIVE
62 org.apache.tuscany.sca.node.impl ACTIVE
63 org.apache.tuscany.sca.core.databinding ACTIVE
64 org.apache.tuscany.sca.host.rmi ACTIVE
65 org.apache.tuscany.sca.node.api ACTIVE
Mar 22, 2010 1:35:26 PM org.apache.tuscany.sca.core.DefaultModuleActivatorExtensionPoint start
SEVERE: org/apache/geronimo/transaction/manager/XidFactory
java.lang.NoClassDefFoundError: org/apache/geronimo/transaction/manager/XidFactory
at org.apache.tuscany.sca.policy.transaction.runtime.geronimo.TransactionModuleActivator.start(TransactionModuleActivator.java:56)
at org.apache.tuscany.sca.core.DefaultModuleActivatorExtensionPoint.start(DefaultModuleActivatorExtensionPoint.java:130)
at org.apache.tuscany.sca.extensibility.ServiceHelper.start(ServiceHelper.java:45)
at org.apache.tuscany.sca.core.DefaultExtensionPointRegistry.addExtensionPoint(DefaultExtensionPointRegistry.java:73)
at org.apache.tuscany.sca.core.DefaultExtensionPointRegistry.getExtensionPoint(DefaultExtensionPointRegistry.java:108)
at org.apache.tuscany.sca.node.impl.NodeFactoryImpl.init(NodeFactoryImpl.java:245)
at org.apache.tuscany.sca.node.osgi.impl.OSGiNodeFactoryImpl.init(OSGiNodeFactoryImpl.java:107)
at org.apache.tuscany.sca.osgi.remoteserviceadmin.impl.AbstractOSGiServiceHandler.init(AbstractOSGiServiceHandler.java:67)
at org.apache.tuscany.sca.osgi.remoteserviceadmin.impl.OSGiServiceExporter.start(OSGiServiceExporter.java:69)
at org.apache.tuscany.sca.osgi.remoteserviceadmin.impl.RemoteServiceAdminImpl.start(RemoteServiceAdminImpl.java:78)
at org.apache.tuscany.sca.node.osgi.impl.NodeActivator.start(NodeActivator.java:69)
at org.eclipse.osgi.framework.internal.core.BundleContextImpl$1.run(BundleContextImpl.java:782)
at java.security.AccessController.doPrivileged(Native Method)
at org.eclipse.osgi.framework.internal.core.BundleContextImpl.startActivator(BundleContextImpl.java:773)
at org.eclipse.osgi.framework.internal.core.BundleContextImpl.start(BundleContextImpl.java:754)
at org.eclipse.osgi.framework.internal.core.BundleHost.startWorker(BundleHost.java:352)
at org.eclipse.osgi.framework.internal.core.AbstractBundle.start(AbstractBundle.java:280)
at org.eclipse.osgi.framework.internal.core.AbstractBundle.start(AbstractBundle.java:272)
at calculator.dosgi.operations.test.OperationsOSGiNodeTestCase.setUpBeforeClass(OperationsOSGiNodeTestCase.java:61)
at sun.reflect.NativeMethodAccessorImpl.invoke0(Native Method)
at sun.reflect.NativeMethodAccessorImpl.invoke(NativeMethodAccessorImpl.java:39)
at sun.reflect.DelegatingMethodAccessorImpl.invoke(DelegatingMethodAccessorImpl.java:25)
at java.lang.reflect.Method.invoke(Method.java:597)
at org.junit.runners.model.FrameworkMethod$1.runReflectiveCall(FrameworkMethod.java:44)
at org.junit.internal.runners.model.ReflectiveCallable.run(ReflectiveCallable.java:15)
at org.junit.runners.model.FrameworkMethod.invokeExplosively(FrameworkMethod.java:41)
at org.junit.internal.runners.statements.RunBefores.evaluate(RunBefores.java:27)
at org.junit.internal.runners.statements.RunAfters.evaluate(RunAfters.java:31)
at org.junit.runners.ParentRunner.run(ParentRunner.java:236)
at org.apache.maven.surefire.junit4.JUnit4TestSet.execute(JUnit4TestSet.java:62)
at org.apache.maven.surefire.suite.AbstractDirectoryTestSuite.executeTestSet(AbstractDirectoryTestSuite.java:140)
at org.apache.maven.surefire.suite.AbstractDirectoryTestSuite.execute(AbstractDirectoryTestSuite.java:127)
at org.apache.maven.surefire.Surefire.run(Surefire.java:177)
at sun.reflect.NativeMethodAccessorImpl.invoke0(Native Method)
at sun.reflect.NativeMethodAccessorImpl.invoke(NativeMethodAccessorImpl.java:39)
at sun.reflect.DelegatingMethodAccessorImpl.invoke(DelegatingMethodAccessorImpl.java:25)
at java.lang.reflect.Method.invoke(Method.java:597)
at org.apache.tuscany.maven.plugin.surefire.OSGiSurefireBooter.runSuitesInProcess(OSGiSurefireBooter.java:355)
at org.apache.tuscany.maven.plugin.surefire.OSGiSurefireBooter.main(OSGiSurefireBooter.java:852)
Caused by: java.lang.ClassNotFoundException: org.apache.geronimo.transaction.manager.XidFactory
at org.eclipse.osgi.internal.loader.BundleLoader.findClassInternal(BundleLoader.java:489)
at org.eclipse.osgi.internal.loader.BundleLoader.findClass(BundleLoader.java:405)
at org.eclipse.osgi.internal.loader.BundleLoader.findClass(BundleLoader.java:393)
at org.eclipse.osgi.internal.baseadaptor.DefaultClassLoader.loadClass(DefaultClassLoader.java:105)
at java.lang.ClassLoader.loadClass(ClassLoader.java:248)
at java.lang.ClassLoader.loadClassInternal(ClassLoader.java:316)
... 39 more
Mar 22, 2010 1:35:27 PM org.apache.tuscany.sca.node.impl.NodeImpl start
INFO: Starting node: osgi.service.a13fa780-0730-4b20-bb67-e837fa0b682f domain: default
Mar 22, 2010 1:35:27 PM org.apache.tuscany.sca.host.rmi.DefaultRMIHost registerService
INFO: RMI service registered: rmi://localhost:8085/AddService
Mar 22, 2010 1:35:27 PM org.apache.tuscany.sca.core.assembly.impl.EndpointRegistryImpl addEndpoint
INFO: Add endpoint - (@24641333)Endpoint: URI = osgi.service.a13fa780-0730-4b20-bb67-e837fa0b682f#service-binding(AddService/Add)
Mar 22, 2010 1:35:27 PM org.apache.tuscany.sca.node.impl.NodeImpl start
INFO: Starting node: osgi.service.2b05f30c-b718-4b74-9844-03756e31651a domain: default
Mar 22, 2010 1:35:27 PM org.apache.tuscany.sca.host.rmi.DefaultRMIHost registerService
INFO: RMI service registered: rmi://localhost:8085/SubtractService
Mar 22, 2010 1:35:27 PM org.apache.tuscany.sca.core.assembly.impl.EndpointRegistryImpl addEndpoint
INFO: Add endpoint - (@31598130)Endpoint: URI = osgi.service.2b05f30c-b718-4b74-9844-03756e31651a#service-binding(SubtractService/Subtract)
Mar 22, 2010 1:35:27 PM org.apache.tuscany.sca.node.impl.NodeImpl start
INFO: Starting node: osgi.service.d6a4569f-a558-42bc-abe3-d459eb687b2a domain: default
Mar 22, 2010 1:35:27 PM org.apache.tuscany.sca.host.rmi.DefaultRMIHost registerService
INFO: RMI service registered: rmi://localhost:8085/MultiplyService
Mar 22, 2010 1:35:27 PM org.apache.tuscany.sca.core.assembly.impl.EndpointRegistryImpl addEndpoint
INFO: Add endpoint - (@14505601)Endpoint: URI = osgi.service.d6a4569f-a558-42bc-abe3-d459eb687b2a#service-binding(MultiplyService/Multiply)
Mar 22, 2010 1:35:27 PM org.apache.tuscany.sca.node.impl.NodeImpl start
INFO: Starting node: osgi.service.acc8b364-ce31-44ee-84a1-061be59fbc63 domain: default
Mar 22, 2010 1:35:27 PM org.apache.tuscany.sca.host.rmi.DefaultRMIHost registerService
INFO: RMI service registered: rmi://localhost:8085/DivideService
Mar 22, 2010 1:35:27 PM org.apache.tuscany.sca.core.assembly.impl.EndpointRegistryImpl addEndpoint
INFO: Add endpoint - (@17299266)Endpoint: URI = osgi.service.acc8b364-ce31-44ee-84a1-061be59fbc63#service-binding(DivideService/Divide)
67 org.apache.tuscany.sca.node.osgi.impl ACTIVE
68 org.apache.tuscany.sca.contribution ACTIVE
69 org.apache.tuscany.sca.core ACTIVE
72 org.apache.tuscany.sca.data.api ACTIVE
74 org.apache.tuscany.sca.policy.transaction.runtime ACTIVE
75 org.apache.tuscany.sca.client.impl ACTIVE
76 org.apache.tuscany.sca.api ACTIVE
77 org.apache.tuscany.sca.implementation.java ACTIVE
78 org.apache.tuscany.sca.implementation.osgi.runtime ACTIVE
79 org.apache.tuscany.sca.node.launcher ACTIVE
80 org.apache.tuscany.sca.interface.java ACTIVE
82 org.apache.tuscany.sca.endpoint.hazelcast ACTIVE
54 calculator.dosgi.dynamic.operations ACTIVE
Mar 22, 2010 1:35:27 PM calculator.dosgi.operations.impl.AddServiceImpl add
INFO: Adding 1.0 and 2.0
Tests run: 1, Failures: 0, Errors: 0, Skipped: 0, Time elapsed: 1.229 sec
Results :
Tests run: 1, Failures: 0, Errors: 0, Skipped: 0
Mar 22, 2010 1:35:27 PM org.apache.tuscany.sca.node.impl.NodeImpl stop
INFO: Stopping node: osgi.service.2b05f30c-b718-4b74-9844-03756e31651a
Mar 22, 2010 1:35:27 PM org.apache.tuscany.sca.host.rmi.DefaultRMIHost unregisterService
INFO: RMI service unregistered: rmi://localhost:8085/SubtractService
Mar 22, 2010 1:35:27 PM org.apache.tuscany.sca.node.impl.NodeImpl stop
INFO: Stopping node: osgi.service.d6a4569f-a558-42bc-abe3-d459eb687b2a
Mar 22, 2010 1:35:27 PM org.apache.tuscany.sca.host.rmi.DefaultRMIHost unregisterService
INFO: RMI service unregistered: rmi://localhost:8085/MultiplyService
Mar 22, 2010 1:35:27 PM org.apache.tuscany.sca.node.impl.NodeImpl stop
INFO: Stopping node: osgi.service.acc8b364-ce31-44ee-84a1-061be59fbc63
Mar 22, 2010 1:35:27 PM org.apache.tuscany.sca.host.rmi.DefaultRMIHost unregisterService
INFO: RMI service unregistered: rmi://localhost:8085/DivideService
Mar 22, 2010 1:35:27 PM org.apache.tuscany.sca.node.impl.NodeImpl stop
INFO: Stopping node: osgi.service.a13fa780-0730-4b20-bb67-e837fa0b682f
Mar 22, 2010 1:35:27 PM org.apache.tuscany.sca.host.rmi.DefaultRMIHost unregisterService
INFO: RMI service unregistered: rmi://localhost:8085/AddService
Mar 22, 2010 1:35:27 PM calculator.dosgi.operations.impl.OperationsActivator stop
INFO: Stopping calculator.dosgi.dynamic.operations_1.0.0 [54]
[INFO] [jar:jar {execution: default-jar}]
[INFO] Building jar: <http://hudson.zones.apache.org/hudson/job/Tuscany-2x/ws/sca-2x/samples/dosgi-dynamic-calculator-operations/target/sample-dosgi-dynamic-calculator-operations.jar>
[INFO] [install:install {execution: default-install}]
[INFO] Installing <http://hudson.zones.apache.org/hudson/job/Tuscany-2x/ws/sca-2x/samples/dosgi-dynamic-calculator-operations/target/sample-dosgi-dynamic-calculator-operations.jar> to /home/hudson/.m2/repository/org/apache/tuscany/sca/sample-dosgi-dynamic-calculator-operations/2.0-SNAPSHOT/sample-dosgi-dynamic-calculator-operations-2.0-SNAPSHOT.jar
[HUDSON] Archiving <http://hudson.zones.apache.org/hudson/job/Tuscany-2x/ws/sca-2x/samples/dosgi-dynamic-calculator-operations/pom.xml> to /export/home/hudson/hudson/jobs/Tuscany-2x/modules/org.apache.tuscany.sca$sample-dosgi-dynamic-calculator-operations/builds/2010-03-22_13-26-37/archive/org.apache.tuscany.sca/sample-dosgi-dynamic-calculator-operations/2.0-SNAPSHOT/pom.xml
[HUDSON] Archiving <http://hudson.zones.apache.org/hudson/job/Tuscany-2x/ws/sca-2x/samples/dosgi-dynamic-calculator-operations/target/sample-dosgi-dynamic-calculator-operations.jar> to /export/home/hudson/hudson/jobs/Tuscany-2x/modules/org.apache.tuscany.sca$sample-dosgi-dynamic-calculator-operations/builds/2010-03-22_13-26-37/archive/org.apache.tuscany.sca/sample-dosgi-dynamic-calculator-operations/2.0-SNAPSHOT/sample-dosgi-dynamic-calculator-operations.jar
[INFO] ------------------------------------------------------------------------
[INFO] Building Apache Tuscany SCA Sample Helloworld
[INFO] task-segment: [clean, install]
[INFO] ------------------------------------------------------------------------
[INFO] snapshot org.apache.tuscany.maven.plugins:maven-tuscany-plugin:2.0-SNAPSHOT: checking for updates from apache.snapshots
[INFO] snapshot org.apache.tuscany.maven.plugins:maven-tuscany-plugin:2.0-SNAPSHOT: checking for updates from codehaus-snapshot
[INFO] snapshot org.apache.tuscany.maven.plugins:maven-tuscany-plugin:2.0-SNAPSHOT: checking for updates from apache.snapshots
Downloading: http://repository.apache.org/snapshots/org/apache/tuscany/maven/plugins/maven-tuscany-plugin/2.0-SNAPSHOT/maven-tuscany-plugin-2.0-SNAPSHOT.pom
10K downloaded (maven-tuscany-plugin-2.0-SNAPSHOT.pom)
Downloading: http://repository.apache.org/snapshots/org/apache/tuscany/maven/plugins/maven-tuscany-plugin/2.0-SNAPSHOT/maven-tuscany-plugin-2.0-SNAPSHOT.jar
14K downloaded (maven-tuscany-plugin-2.0-SNAPSHOT.jar)
[INFO] [clean:clean {execution: default-clean}]
[INFO] Deleting file set: <http://hudson.zones.apache.org/hudson/job/Tuscany-2x/ws/sca-2x/samples/helloworld/target> (included: [**], excluded: [])
Downloading: http://repository.apache.org/snapshots/org/apache/tuscany/maven/plugins/maven-tuscany-plugin/2.0-SNAPSHOT/maven-tuscany-plugin-2.0-SNAPSHOT.jar
[INFO] [enforcer:enforce {execution: enforce-plugin-versions}]
[INFO] [resources:resources {execution: default-resources}]
[INFO] Using 'UTF-8' encoding to copy filtered resources.
[INFO] Copying 2 resources
[INFO] Copying 0 resource
[INFO] [compiler:compile {execution: default-compile}]
[INFO] Invoking Tuscany Eclipse JDT compiler
[INFO] Compiling 2 to <http://hudson.zones.apache.org/hudson/job/Tuscany-2x/ws/sca-2x/samples/helloworld/target/classes>
[INFO] [zip:zip {execution: default-zip}]
[INFO] Exploding webapp...
[INFO] Assembling webapp sample-helloworld in <http://hudson.zones.apache.org/hudson/job/Tuscany-2x/ws/sca-2x/samples/helloworld/target/sample-helloworld>
[INFO] Generating SCA ZIP contribution <http://hudson.zones.apache.org/hudson/job/Tuscany-2x/ws/sca-2x/samples/helloworld/target/sample-helloworld.zip>
[INFO] Building scazip: <http://hudson.zones.apache.org/hudson/job/Tuscany-2x/ws/sca-2x/samples/helloworld/target/sample-helloworld.zip>
[INFO] [install:install {execution: default-install}]
[INFO] Installing <http://hudson.zones.apache.org/hudson/job/Tuscany-2x/ws/sca-2x/samples/helloworld/target/sample-helloworld.zip> to /home/hudson/.m2/repository/org/apache/tuscany/sca/sample-helloworld/2.0-SNAPSHOT/sample-helloworld-2.0-SNAPSHOT.zip
[HUDSON] Archiving <http://hudson.zones.apache.org/hudson/job/Tuscany-2x/ws/sca-2x/samples/helloworld/pom.xml> to /export/home/hudson/hudson/jobs/Tuscany-2x/modules/org.apache.tuscany.sca$sample-helloworld/builds/2010-03-22_13-26-37/archive/org.apache.tuscany.sca/sample-helloworld/2.0-SNAPSHOT/pom.xml
[HUDSON] Archiving <http://hudson.zones.apache.org/hudson/job/Tuscany-2x/ws/sca-2x/samples/helloworld/target/sample-helloworld.zip> to /export/home/hudson/hudson/jobs/Tuscany-2x/modules/org.apache.tuscany.sca$sample-helloworld/builds/2010-03-22_13-26-37/archive/org.apache.tuscany.sca/sample-helloworld/2.0-SNAPSHOT/sample-helloworld.zip
[INFO] ------------------------------------------------------------------------
[INFO] Building Apache Tuscany SCA Sample HelloWorld BPEL
[INFO] task-segment: [clean, install]
[INFO] ------------------------------------------------------------------------
Downloading: http://repository.apache.org/snapshots/org/apache/tuscany/maven/plugins/maven-tuscany-plugin/2.0-SNAPSHOT/maven-tuscany-plugin-2.0-SNAPSHOT.jar
[INFO] Reloading plugin container for: org.apache.tuscany.maven.plugins:maven-tuscany-plugin:2.0-SNAPSHOT. The plugin artifact has changed.
[INFO] [clean:clean {execution: default-clean}]
[INFO] Deleting file set: <http://hudson.zones.apache.org/hudson/job/Tuscany-2x/ws/sca-2x/samples/helloworld-bpel/target> (included: [**], excluded: [])
Downloading: http://repository.apache.org/snapshots/org/apache/tuscany/maven/plugins/maven-tuscany-plugin/2.0-SNAPSHOT/maven-tuscany-plugin-2.0-SNAPSHOT.jar
[INFO] [enforcer:enforce {execution: enforce-plugin-versions}]
[INFO] [resources:resources {execution: default-resources}]
[INFO] Using 'UTF-8' encoding to copy filtered resources.
[INFO] Copying 5 resources
[INFO] Copying 1 resource
[INFO] [compiler:compile {execution: default-compile}]
[INFO] Invoking Tuscany Eclipse JDT compiler
[INFO] Compiling 2 to <http://hudson.zones.apache.org/hudson/job/Tuscany-2x/ws/sca-2x/samples/helloworld-bpel/target/classes>
[HUDSON] Archiving <http://hudson.zones.apache.org/hudson/job/Tuscany-2x/ws/sca-2x/samples/helloworld-bpel/pom.xml> to /export/home/hudson/hudson/jobs/Tuscany-2x/modules/org.apache.tuscany.sca$sample-helloworld-bpel/builds/2010-03-22_13-26-37/archive/org.apache.tuscany.sca/sample-helloworld-bpel/2.0-SNAPSHOT/pom.xml
[INFO] ------------------------------------------------------------------------
[ERROR] BUILD FAILURE
[INFO] ------------------------------------------------------------------------
[INFO] Compilation failure
helloworld/BPELClient.java:[22,843] Only a type can be imported. org.apache.tuscany.sca.node.Contribution resolves to a package
helloworld/BPELClient.java:[23,892] Only a type can be imported. org.apache.tuscany.sca.node.ContributionLocationHelper resolves to a package
helloworld/BPELClient.java:[24,955] Only a type can be imported. org.apache.tuscany.sca.node.Node resolves to a package
helloworld/BPELClient.java:[25,996] Only a type can be imported. org.apache.tuscany.sca.node.NodeFactory resolves to a package
helloworld/BPELClient.java:[35,1307] ContributionLocationHelper cannot be resolved
helloworld/BPELClient.java:[36,1385] Node cannot be resolved to a type
helloworld/BPELClient.java:[36,1397] NodeFactory cannot be resolved
helloworld/BPELClient.java:[36,1462] Contribution cannot be resolved to a type
[INFO] ------------------------------------------------------------------------
[INFO] For more information, run Maven with the -e switch
[INFO] ------------------------------------------------------------------------
[INFO] Total time: 8 minutes 31 seconds
[INFO] Finished at: Mon Mar 22 13:35:32 UTC 2010
[INFO] Final Memory: 91M/751M
[INFO] ------------------------------------------------------------------------
Sending e-mails to: commits@tuscany.apache.org
channel stopped
Hudson build is back to normal : Tuscany-2x #574
Posted by Apache Hudson Server <hu...@hudson.zones.apache.org>.
See <http://hudson.zones.apache.org/hudson/job/Tuscany-2x/574/changes>
Build failed in Hudson: Tuscany-2x #573
Posted by Apache Hudson Server <hu...@hudson.zones.apache.org>.
See <http://hudson.zones.apache.org/hudson/job/Tuscany-2x/573/changes>
Changes:
[antelder] Remove old testcase
[antelder] Add sample testcase
[antelder] Correct case in component name to match the java helloworld sample
------------------------------------------
[...truncated 33824 lines...]
[INFO] Excluding org.apache.rampart:rampart-core:jar:1.4 from the shaded jar.
[INFO] Excluding org.apache.rampart:rampart-policy:jar:1.4 from the shaded jar.
[INFO] Excluding backport-util-concurrent:backport-util-concurrent:jar:3.1 from the shaded jar.
[INFO] Excluding annogen:annogen:jar:0.1.0 from the shaded jar.
[INFO] Replacing original artifact with shaded artifact.
[INFO] Replacing <http://hudson.zones.apache.org/hudson/job/Tuscany-2x/ws/sca-2x/shades/webservices/target/tuscany-webservices-2.0-SNAPSHOT.jar> with <http://hudson.zones.apache.org/hudson/job/Tuscany-2x/ws/sca-2x/shades/webservices/target/tuscany-webservices-2.0-SNAPSHOT-shaded.jar>
Downloading: http://repo2.maven.org/maven2/bouncycastle/bcprov-jdk13/132/bcprov-jdk13-132.pom
[INFO] Unable to find resource 'bouncycastle:bcprov-jdk13:pom:132' in repository maven.central (http://repo2.maven.org/maven2)
Downloading: http://people.apache.org/repo/m2-incubating-repository/bouncycastle/bcprov-jdk13/132/bcprov-jdk13-132.pom
[INFO] Unable to find resource 'bouncycastle:bcprov-jdk13:pom:132' in repository apache.incubator (http://people.apache.org/repo/m2-incubating-repository)
Downloading: http://svn.apache.org/repos/asf/tuscany/maven/bouncycastle/bcprov-jdk13/132/bcprov-jdk13-132.pom
[INFO] Unable to find resource 'bouncycastle:bcprov-jdk13:pom:132' in repository tuscany.repo (http://svn.apache.org/repos/asf/tuscany/maven)
Downloading: http://ws.zones.apache.org/repository2/bouncycastle/bcprov-jdk13/132/bcprov-jdk13-132.pom
[INFO] Unable to find resource 'bouncycastle:bcprov-jdk13:pom:132' in repository apache.ws.zone (http://ws.zones.apache.org/repository2)
Downloading: http://ftp.ussg.iu.edu/eclipse/modeling/emf/emf/maven2//bouncycastle/bcprov-jdk13/132/bcprov-jdk13-132.pom
[INFO] Unable to find resource 'bouncycastle:bcprov-jdk13:pom:132' in repository indiana (http://ftp.ussg.iu.edu/eclipse/modeling/emf/emf/maven2/)
Downloading: http://ftp.osuosl.org/pub/eclipse/tools/emf/maven2/bouncycastle/bcprov-jdk13/132/bcprov-jdk13-132.pom
[INFO] Unable to find resource 'bouncycastle:bcprov-jdk13:pom:132' in repository osuosl.org (http://ftp.osuosl.org/pub/eclipse/tools/emf/maven2)
Downloading: http://www.intalio.org/public/maven2/bouncycastle/bcprov-jdk13/132/bcprov-jdk13-132.pom
[INFO] Unable to find resource 'bouncycastle:bcprov-jdk13:pom:132' in repository intalio.org (http://www.intalio.org/public/maven2)
Downloading: http://download.java.net/maven/1/bouncycastle/poms/bcprov-jdk13-132.pom
[INFO] Unable to find resource 'bouncycastle:bcprov-jdk13:pom:132' in repository java.net (http://download.java.net/maven/1)
Downloading: http://download.java.net/maven/2/bouncycastle/bcprov-jdk13/132/bcprov-jdk13-132.pom
[INFO] Unable to find resource 'bouncycastle:bcprov-jdk13:pom:132' in repository java.net2 (http://download.java.net/maven/2)
Downloading: http://ws.zones.apache.org/repository2//bouncycastle/bcprov-jdk13/132/bcprov-jdk13-132.pom
[INFO] Unable to find resource 'bouncycastle:bcprov-jdk13:pom:132' in repository apache-ws-snapshots2 (http://ws.zones.apache.org/repository2/)
Downloading: http://repo1.maven.org/maven2//bouncycastle/bcprov-jdk13/132/bcprov-jdk13-132.pom
[INFO] Unable to find resource 'bouncycastle:bcprov-jdk13:pom:132' in repository maven2 (http://repo1.maven.org/maven2/)
Downloading: http://repo1.maven.org/maven2/bouncycastle/bcprov-jdk13/132/bcprov-jdk13-132.pom
[INFO] Unable to find resource 'bouncycastle:bcprov-jdk13:pom:132' in repository central (http://repo1.maven.org/maven2)
[INFO] [install:install {execution: default-install}]
[INFO] Installing <http://hudson.zones.apache.org/hudson/job/Tuscany-2x/ws/sca-2x/shades/webservices/target/tuscany-webservices-2.0-SNAPSHOT.jar> to /home/hudson/.m2/repository/org/apache/tuscany/sca/shades/tuscany-webservices/2.0-SNAPSHOT/tuscany-webservices-2.0-SNAPSHOT.jar
[HUDSON] Archiving <http://hudson.zones.apache.org/hudson/job/Tuscany-2x/ws/sca-2x/shades/webservices/dependency-reduced-pom.xml> to /export/home/hudson/hudson/jobs/Tuscany-2x/modules/org.apache.tuscany.sca.shades$tuscany-webservices/builds/2010-03-22_13-42-04/archive/org.apache.tuscany.sca.shades/tuscany-webservices/2.0-SNAPSHOT/dependency-reduced-pom.xml
[HUDSON] Archiving <http://hudson.zones.apache.org/hudson/job/Tuscany-2x/ws/sca-2x/shades/webservices/target/tuscany-webservices-2.0-SNAPSHOT.jar> to /export/home/hudson/hudson/jobs/Tuscany-2x/modules/org.apache.tuscany.sca.shades$tuscany-webservices/builds/2010-03-22_13-42-04/archive/org.apache.tuscany.sca.shades/tuscany-webservices/2.0-SNAPSHOT/tuscany-webservices-2.0-SNAPSHOT.jar
[INFO] ------------------------------------------------------------------------
[INFO] Building Apache Tuscany SCA Web Services Jar including dependencies
[INFO] task-segment: [clean, install]
[INFO] ------------------------------------------------------------------------
[INFO] [clean:clean {execution: default-clean}]
[INFO] [enforcer:enforce {execution: enforce-plugin-versions}]
[INFO] [resources:resources {execution: default-resources}]
[INFO] Using 'UTF-8' encoding to copy filtered resources.
[INFO] skip non existing resourceDirectory <http://hudson.zones.apache.org/hudson/job/Tuscany-2x/ws/sca-2x/shades/webservices-nodep/src/main/resources>
[INFO] Copying 0 resource
[INFO] [compiler:compile {execution: default-compile}]
[INFO] No sources to compile
[INFO] [resources:testResources {execution: default-testResources}]
[INFO] Using 'UTF-8' encoding to copy filtered resources.
[INFO] skip non existing resourceDirectory <http://hudson.zones.apache.org/hudson/job/Tuscany-2x/ws/sca-2x/shades/webservices-nodep/src/test/resources>
[INFO] [compiler:testCompile {execution: default-testCompile}]
[INFO] No sources to compile
[INFO] [surefire:test {execution: default-test}]
[INFO] No tests to run.
[HUDSON] Recording test results
[INFO] [jar:jar {execution: default-jar}]
[INFO] Building jar: <http://hudson.zones.apache.org/hudson/job/Tuscany-2x/ws/sca-2x/shades/webservices-nodep/target/tuscany-webservices-nodep-2.0-SNAPSHOT.jar>
[INFO] [shade:shade {execution: default}]
[INFO] Including org.apache.tuscany.sca.shades:tuscany-webservices:jar:2.0-SNAPSHOT in the shaded jar.
[INFO] Including org.apache.ws.commons.axiom:axiom-api:jar:1.2.8 in the shaded jar.
[INFO] Including org.apache.geronimo.specs:geronimo-javamail_1.4_spec:jar:1.6 in the shaded jar.
[INFO] Including org.apache.ws.commons.axiom:axiom-impl:jar:1.2.8 in the shaded jar.
[INFO] Including org.apache.axis2:axis2-kernel:jar:1.5.1 in the shaded jar.
[INFO] Including org.apache.ws.commons.axiom:axiom-dom:jar:1.2.8 in the shaded jar.
[INFO] Including org.apache.geronimo.specs:geronimo-activation_1.1_spec:jar:1.0.1 in the shaded jar.
[INFO] Including org.apache.geronimo.specs:geronimo-ws-metadata_2.0_spec:jar:1.1.2 in the shaded jar.
[INFO] Including org.apache.geronimo.specs:geronimo-jta_1.1_spec:jar:1.1 in the shaded jar.
[INFO] Including commons-httpclient:commons-httpclient:jar:3.1 in the shaded jar.
[INFO] Including commons-codec:commons-codec:jar:1.2 in the shaded jar.
[INFO] Including commons-fileupload:commons-fileupload:jar:1.2 in the shaded jar.
[INFO] Including wsdl4j:wsdl4j:jar:1.6.2 in the shaded jar.
[INFO] Including org.apache.neethi:neethi:jar:2.0.4 in the shaded jar.
[INFO] Including org.apache.woden:woden-api:jar:1.0M8 in the shaded jar.
[INFO] Including org.apache.woden:woden-impl-dom:jar:1.0M8 in the shaded jar.
[INFO] Including commons-io:commons-io:jar:1.4 in the shaded jar.
[INFO] Including org.apache.axis2:axis2-java2wsdl:jar:1.5.1 in the shaded jar.
[INFO] Including org.apache.axis2:axis2-transport-http:jar:1.5.1 in the shaded jar.
[INFO] Including org.apache.httpcomponents:httpcore:jar:4.0.1 in the shaded jar.
[INFO] Including org.apache.axis2:axis2-transport-local:jar:1.5.1 in the shaded jar.
[INFO] Including org.apache.axis2:axis2-codegen:jar:1.4 in the shaded jar.
[INFO] Including org.apache.axis2:axis2-mtompolicy:jar:1.5.1 in the shaded jar.
[INFO] Including org.apache.axis2:mex:jar:impl:1.5.1 in the shaded jar.
[INFO] Including org.apache.axis2:axis2-transport-jms:jar:1.0.0 in the shaded jar.
[INFO] Including org.apache.axis2:axis2-transport-base:jar:1.0.0 in the shaded jar.
[INFO] Including org.apache.geronimo.specs:geronimo-jms_1.1_spec:jar:1.1 in the shaded jar.
[INFO] Including org.apache.geronimo.specs:geronimo-jta_1.0.1B_spec:jar:1.0 in the shaded jar.
[INFO] Including org.apache.httpcomponents:httpcore-nio:jar:4.0.1 in the shaded jar.
[INFO] Including commons-collections:commons-collections:jar:3.2 in the shaded jar.
[INFO] Including commons-discovery:commons-discovery:jar:0.4 in the shaded jar.
[INFO] Including org.apache.santuario:xmlsec:jar:1.4.3 in the shaded jar.
[INFO] Including org.apache.ws.security:wss4j:jar:1.5.4 in the shaded jar.
[INFO] Including org.apache.axis:axis-ant:jar:1.4 in the shaded jar.
[INFO] Including org.apache.rampart:rampart-core:jar:1.4 in the shaded jar.
[INFO] Including org.apache.rampart:rampart-policy:jar:1.4 in the shaded jar.
[INFO] Including org.apache.axis2:axis2-adb:jar:1.4 in the shaded jar.
[INFO] Including org.apache.geronimo.specs:geronimo-stax-api_1.0_spec:jar:1.0.1 in the shaded jar.
[INFO] Including backport-util-concurrent:backport-util-concurrent:jar:3.1 in the shaded jar.
[INFO] Including annogen:annogen:jar:0.1.0 in the shaded jar.
[WARNING] We have a duplicate org/apache/axis2/transport/http/ApplicationXMLFormatter.class in /home/hudson/.m2/repository/org/apache/axis2/axis2-transport-http/1.5.1/axis2-transport-http-1.5.1.jar
[WARNING] We have a duplicate org/apache/axis2/transport/http/HTTPConstants.class in /home/hudson/.m2/repository/org/apache/axis2/axis2-transport-http/1.5.1/axis2-transport-http-1.5.1.jar
[WARNING] We have a duplicate org/apache/axis2/transport/http/MultipartFormDataFormatter.class in /home/hudson/.m2/repository/org/apache/axis2/axis2-transport-http/1.5.1/axis2-transport-http-1.5.1.jar
[WARNING] We have a duplicate org/apache/axis2/transport/http/SOAPMessageFormatter.class in /home/hudson/.m2/repository/org/apache/axis2/axis2-transport-http/1.5.1/axis2-transport-http-1.5.1.jar
[WARNING] We have a duplicate org/apache/axis2/transport/http/XFormURLEncodedFormatter.class in /home/hudson/.m2/repository/org/apache/axis2/axis2-transport-http/1.5.1/axis2-transport-http-1.5.1.jar
[WARNING] We have a duplicate org/apache/axis2/transport/http/util/ComplexPart.class in /home/hudson/.m2/repository/org/apache/axis2/axis2-transport-http/1.5.1/axis2-transport-http-1.5.1.jar
[WARNING] We have a duplicate org/apache/axis2/transport/http/util/QueryStringParser.class in /home/hudson/.m2/repository/org/apache/axis2/axis2-transport-http/1.5.1/axis2-transport-http-1.5.1.jar
[WARNING] We have a duplicate org/apache/axis2/transport/http/util/URIEncoderDecoder.class in /home/hudson/.m2/repository/org/apache/axis2/axis2-transport-http/1.5.1/axis2-transport-http-1.5.1.jar
[WARNING] We have a duplicate org/apache/axis2/transport/http/util/URLTemplatingUtil.class in /home/hudson/.m2/repository/org/apache/axis2/axis2-transport-http/1.5.1/axis2-transport-http-1.5.1.jar
[WARNING] We have a duplicate javax/transaction/xa/XAResource.class in /home/hudson/.m2/repository/org/apache/geronimo/specs/geronimo-jta_1.0.1B_spec/1.0/geronimo-jta_1.0.1B_spec-1.0.jar
[WARNING] We have a duplicate javax/transaction/xa/Xid.class in /home/hudson/.m2/repository/org/apache/geronimo/specs/geronimo-jta_1.0.1B_spec/1.0/geronimo-jta_1.0.1B_spec-1.0.jar
[WARNING] We have a duplicate javax/transaction/xa/XAException.class in /home/hudson/.m2/repository/org/apache/geronimo/specs/geronimo-jta_1.0.1B_spec/1.0/geronimo-jta_1.0.1B_spec-1.0.jar
[WARNING] We have a duplicate javax/transaction/Transaction.class in /home/hudson/.m2/repository/org/apache/geronimo/specs/geronimo-jta_1.0.1B_spec/1.0/geronimo-jta_1.0.1B_spec-1.0.jar
[WARNING] We have a duplicate javax/transaction/HeuristicMixedException.class in /home/hudson/.m2/repository/org/apache/geronimo/specs/geronimo-jta_1.0.1B_spec/1.0/geronimo-jta_1.0.1B_spec-1.0.jar
[WARNING] We have a duplicate javax/transaction/HeuristicRollbackException.class in /home/hudson/.m2/repository/org/apache/geronimo/specs/geronimo-jta_1.0.1B_spec/1.0/geronimo-jta_1.0.1B_spec-1.0.jar
[WARNING] We have a duplicate javax/transaction/RollbackException.class in /home/hudson/.m2/repository/org/apache/geronimo/specs/geronimo-jta_1.0.1B_spec/1.0/geronimo-jta_1.0.1B_spec-1.0.jar
[WARNING] We have a duplicate javax/transaction/SystemException.class in /home/hudson/.m2/repository/org/apache/geronimo/specs/geronimo-jta_1.0.1B_spec/1.0/geronimo-jta_1.0.1B_spec-1.0.jar
[WARNING] We have a duplicate javax/transaction/Synchronization.class in /home/hudson/.m2/repository/org/apache/geronimo/specs/geronimo-jta_1.0.1B_spec/1.0/geronimo-jta_1.0.1B_spec-1.0.jar
[WARNING] We have a duplicate javax/transaction/Status.class in /home/hudson/.m2/repository/org/apache/geronimo/specs/geronimo-jta_1.0.1B_spec/1.0/geronimo-jta_1.0.1B_spec-1.0.jar
[WARNING] We have a duplicate javax/transaction/InvalidTransactionException.class in /home/hudson/.m2/repository/org/apache/geronimo/specs/geronimo-jta_1.0.1B_spec/1.0/geronimo-jta_1.0.1B_spec-1.0.jar
[WARNING] We have a duplicate javax/transaction/NotSupportedException.class in /home/hudson/.m2/repository/org/apache/geronimo/specs/geronimo-jta_1.0.1B_spec/1.0/geronimo-jta_1.0.1B_spec-1.0.jar
[WARNING] We have a duplicate javax/transaction/TransactionRequiredException.class in /home/hudson/.m2/repository/org/apache/geronimo/specs/geronimo-jta_1.0.1B_spec/1.0/geronimo-jta_1.0.1B_spec-1.0.jar
[WARNING] We have a duplicate javax/transaction/TransactionManager.class in /home/hudson/.m2/repository/org/apache/geronimo/specs/geronimo-jta_1.0.1B_spec/1.0/geronimo-jta_1.0.1B_spec-1.0.jar
[WARNING] We have a duplicate javax/transaction/UserTransaction.class in /home/hudson/.m2/repository/org/apache/geronimo/specs/geronimo-jta_1.0.1B_spec/1.0/geronimo-jta_1.0.1B_spec-1.0.jar
[WARNING] We have a duplicate javax/transaction/HeuristicCommitException.class in /home/hudson/.m2/repository/org/apache/geronimo/specs/geronimo-jta_1.0.1B_spec/1.0/geronimo-jta_1.0.1B_spec-1.0.jar
[WARNING] We have a duplicate javax/transaction/TransactionRolledbackException.class in /home/hudson/.m2/repository/org/apache/geronimo/specs/geronimo-jta_1.0.1B_spec/1.0/geronimo-jta_1.0.1B_spec-1.0.jar
[INFO] Replacing original artifact with shaded artifact.
[INFO] Replacing <http://hudson.zones.apache.org/hudson/job/Tuscany-2x/ws/sca-2x/shades/webservices-nodep/target/tuscany-webservices-nodep-2.0-SNAPSHOT.jar> with <http://hudson.zones.apache.org/hudson/job/Tuscany-2x/ws/sca-2x/shades/webservices-nodep/target/tuscany-webservices-nodep-2.0-SNAPSHOT-shaded.jar>
[INFO] [install:install {execution: default-install}]
[INFO] Installing <http://hudson.zones.apache.org/hudson/job/Tuscany-2x/ws/sca-2x/shades/webservices-nodep/target/tuscany-webservices-nodep-2.0-SNAPSHOT.jar> to /home/hudson/.m2/repository/org/apache/tuscany/sca/shades/tuscany-webservices-nodep/2.0-SNAPSHOT/tuscany-webservices-nodep-2.0-SNAPSHOT.jar
[HUDSON] Archiving <http://hudson.zones.apache.org/hudson/job/Tuscany-2x/ws/sca-2x/shades/webservices-nodep/dependency-reduced-pom.xml> to /export/home/hudson/hudson/jobs/Tuscany-2x/modules/org.apache.tuscany.sca.shades$tuscany-webservices-nodep/builds/2010-03-22_13-42-04/archive/org.apache.tuscany.sca.shades/tuscany-webservices-nodep/2.0-SNAPSHOT/dependency-reduced-pom.xml
[HUDSON] Archiving <http://hudson.zones.apache.org/hudson/job/Tuscany-2x/ws/sca-2x/shades/webservices-nodep/target/tuscany-webservices-nodep-2.0-SNAPSHOT.jar> to /export/home/hudson/hudson/jobs/Tuscany-2x/modules/org.apache.tuscany.sca.shades$tuscany-webservices-nodep/builds/2010-03-22_13-42-04/archive/org.apache.tuscany.sca.shades/tuscany-webservices-nodep/2.0-SNAPSHOT/tuscany-webservices-nodep-2.0-SNAPSHOT.jar
[INFO] ------------------------------------------------------------------------
[INFO] Building Apache Tuscany SCA Tomcat Hook
[INFO] task-segment: [clean, install]
[INFO] ------------------------------------------------------------------------
[INFO] [clean:clean {execution: default-clean}]
[INFO] [enforcer:enforce {execution: enforce-plugin-versions}]
[INFO] snapshot org.apache.tuscany.sca:tuscany-modules:2.0-SNAPSHOT: checking for updates from apache.snapshots
[INFO] [resources:resources {execution: default-resources}]
[INFO] Using 'UTF-8' encoding to copy filtered resources.
[INFO] skip non existing resourceDirectory <http://hudson.zones.apache.org/hudson/job/Tuscany-2x/ws/sca-2x/distribution/tomcat/tomcat-hook/src/main/resources>
[INFO] Copying 3 resources
[INFO] [compiler:compile {execution: default-compile}]
[INFO] Invoking Tuscany Eclipse JDT compiler
[INFO] Compiling 5 to <http://hudson.zones.apache.org/hudson/job/Tuscany-2x/ws/sca-2x/distribution/tomcat/tomcat-hook/target/classes>
[INFO] Resolving OSGi bundle: org.apache.tuscany.sca.tomcat
[ERROR] --> [org.apache.tuscany.sca.tomcat] Missing Constraint: Import-Package: org.apache.tuscany.sca.core; version="2.0.0"
[INFO] [resources:testResources {execution: default-testResources}]
[INFO] Using 'UTF-8' encoding to copy filtered resources.
[INFO] skip non existing resourceDirectory <http://hudson.zones.apache.org/hudson/job/Tuscany-2x/ws/sca-2x/distribution/tomcat/tomcat-hook/src/test/resources>
[INFO] [compiler:testCompile {execution: default-testCompile}]
[INFO] No sources to compile
[INFO] [surefire:test {execution: default-test}]
[INFO] No tests to run.
[HUDSON] Recording test results
[INFO] [jar:jar {execution: default-jar}]
[INFO] Building jar: <http://hudson.zones.apache.org/hudson/job/Tuscany-2x/ws/sca-2x/distribution/tomcat/tomcat-hook/target/tuscany-tomcat-hook-2.0-SNAPSHOT.jar>
[INFO] [install:install {execution: default-install}]
[INFO] Installing <http://hudson.zones.apache.org/hudson/job/Tuscany-2x/ws/sca-2x/distribution/tomcat/tomcat-hook/target/tuscany-tomcat-hook-2.0-SNAPSHOT.jar> to /home/hudson/.m2/repository/org/apache/tuscany/sca/tuscany-tomcat-hook/2.0-SNAPSHOT/tuscany-tomcat-hook-2.0-SNAPSHOT.jar
[HUDSON] Archiving <http://hudson.zones.apache.org/hudson/job/Tuscany-2x/ws/sca-2x/distribution/tomcat/tomcat-hook/pom.xml> to /export/home/hudson/hudson/jobs/Tuscany-2x/modules/org.apache.tuscany.sca$tuscany-tomcat-hook/builds/2010-03-22_13-42-04/archive/org.apache.tuscany.sca/tuscany-tomcat-hook/2.0-SNAPSHOT/pom.xml
[HUDSON] Archiving <http://hudson.zones.apache.org/hudson/job/Tuscany-2x/ws/sca-2x/distribution/tomcat/tomcat-hook/target/tuscany-tomcat-hook-2.0-SNAPSHOT.jar> to /export/home/hudson/hudson/jobs/Tuscany-2x/modules/org.apache.tuscany.sca$tuscany-tomcat-hook/builds/2010-03-22_13-42-04/archive/org.apache.tuscany.sca/tuscany-tomcat-hook/2.0-SNAPSHOT/tuscany-tomcat-hook-2.0-SNAPSHOT.jar
[INFO] ------------------------------------------------------------------------
[INFO] Building Apache Tuscany SCA Tomcat Integration Servlet
[INFO] task-segment: [clean, install]
[INFO] ------------------------------------------------------------------------
[INFO] [clean:clean {execution: default-clean}]
[INFO] [enforcer:enforce {execution: enforce-plugin-versions}]
[INFO] [resources:resources {execution: default-resources}]
[INFO] Using 'UTF-8' encoding to copy filtered resources.
[INFO] skip non existing resourceDirectory <http://hudson.zones.apache.org/hudson/job/Tuscany-2x/ws/sca-2x/distribution/tomcat/tomcat-servlet/src/main/resources>
[INFO] Copying 1 resource
[INFO] [compiler:compile {execution: default-compile}]
[INFO] Invoking Tuscany Eclipse JDT compiler
[INFO] Compiling 2 to <http://hudson.zones.apache.org/hudson/job/Tuscany-2x/ws/sca-2x/distribution/tomcat/tomcat-servlet/target/classes>
[INFO] Resolving OSGi bundle: org.apache.tuscany.sca.tomcat.servlet
[ERROR] --> [org.apache.tuscany.sca.tomcat.servlet] Missing Constraint: Import-Package: org.apache.tuscany.sca.tomcat; version="2.0.0"
[ERROR] --> [org.apache.tuscany.sca.tomcat] Bundle unresolved: Export-Package: org.apache.tuscany.sca.tomcat; version="2.0.0"
[ERROR] ----> [org.apache.tuscany.sca.tomcat] Missing Constraint: Import-Package: org.apache.tuscany.sca.core; version="2.0.0"
[INFO] [resources:testResources {execution: default-testResources}]
[INFO] Using 'UTF-8' encoding to copy filtered resources.
[INFO] skip non existing resourceDirectory <http://hudson.zones.apache.org/hudson/job/Tuscany-2x/ws/sca-2x/distribution/tomcat/tomcat-servlet/src/test/resources>
[INFO] [compiler:testCompile {execution: default-testCompile}]
[INFO] No sources to compile
[INFO] [surefire:test {execution: default-test}]
[INFO] No tests to run.
[HUDSON] Recording test results
[INFO] [jar:jar {execution: default-jar}]
[INFO] Building jar: <http://hudson.zones.apache.org/hudson/job/Tuscany-2x/ws/sca-2x/distribution/tomcat/tomcat-servlet/target/tuscany-tomcat-servlet-2.0-SNAPSHOT.jar>
[INFO] [install:install {execution: default-install}]
[INFO] Installing <http://hudson.zones.apache.org/hudson/job/Tuscany-2x/ws/sca-2x/distribution/tomcat/tomcat-servlet/target/tuscany-tomcat-servlet-2.0-SNAPSHOT.jar> to /home/hudson/.m2/repository/org/apache/tuscany/sca/tuscany-tomcat-servlet/2.0-SNAPSHOT/tuscany-tomcat-servlet-2.0-SNAPSHOT.jar
[HUDSON] Archiving <http://hudson.zones.apache.org/hudson/job/Tuscany-2x/ws/sca-2x/distribution/tomcat/tomcat-servlet/pom.xml> to /export/home/hudson/hudson/jobs/Tuscany-2x/modules/org.apache.tuscany.sca$tuscany-tomcat-servlet/builds/2010-03-22_13-42-04/archive/org.apache.tuscany.sca/tuscany-tomcat-servlet/2.0-SNAPSHOT/pom.xml
[HUDSON] Archiving <http://hudson.zones.apache.org/hudson/job/Tuscany-2x/ws/sca-2x/distribution/tomcat/tomcat-servlet/target/tuscany-tomcat-servlet-2.0-SNAPSHOT.jar> to /export/home/hudson/hudson/jobs/Tuscany-2x/modules/org.apache.tuscany.sca$tuscany-tomcat-servlet/builds/2010-03-22_13-42-04/archive/org.apache.tuscany.sca/tuscany-tomcat-servlet/2.0-SNAPSHOT/tuscany-tomcat-servlet-2.0-SNAPSHOT.jar
[INFO] ------------------------------------------------------------------------
[INFO] Building Apache Tuscany SCA Tomcat Deep Integration WAR
[INFO] task-segment: [clean, install]
[INFO] ------------------------------------------------------------------------
[INFO] [clean:clean {execution: default-clean}]
[INFO] [enforcer:enforce {execution: enforce-plugin-versions}]
[INFO] snapshot org.apache.tuscany.sca:tuscany-distribution:2.0-SNAPSHOT: checking for updates from apache.snapshots
[INFO] [site:attach-descriptor {execution: default-attach-descriptor}]
[INFO] [assembly:attached {execution: war}]
[INFO] Reading assembly descriptor: src/main/assembly/war.xml
[INFO] Processing DependencySet (output=tuscany-lib)
[WARNING] Cannot include project artifact: org.apache.tuscany.sca:tuscany-war:pom:2.0-SNAPSHOT; it doesn't have an associated file or directory.
[WARNING] The following patterns were never triggered in this artifact exclusion filter:
o 'org.apache.tomcat:catalina'
o 'org.apache.tomcat:annotations-api'
o 'org.apache.tomcat:juli'
o 'org.apache.tomcat:servlet-api'
[INFO] Processing DependencySet (output=tomcat-lib)
[WARNING] Cannot include project artifact: org.apache.tuscany.sca:tuscany-war:pom:2.0-SNAPSHOT; it doesn't have an associated file or directory.
[INFO] Processing DependencySet (output=WEB-INF/lib)
[WARNING] Cannot include project artifact: org.apache.tuscany.sca:tuscany-war:pom:2.0-SNAPSHOT; it doesn't have an associated file or directory.
[INFO] Building war: <http://hudson.zones.apache.org/hudson/job/Tuscany-2x/ws/sca-2x/distribution/tomcat/tomcat-war/target/tuscany.war>
[WARNING] Configuration options: 'appendAssemblyId' is set to false, and 'classifier' is missing.
Instead of attaching the assembly file: <http://hudson.zones.apache.org/hudson/job/Tuscany-2x/ws/sca-2x/distribution/tomcat/tomcat-war/target/tuscany.war,> it will become the file for main project artifact.
NOTE: If multiple descriptors or descriptor-formats are provided for this project, the value of this file will be non-deterministic!
[INFO] Processing DependencySet (output=tuscany-lib)
[WARNING] The following patterns were never triggered in this artifact exclusion filter:
o 'org.apache.tomcat:catalina'
o 'org.apache.tomcat:annotations-api'
o 'org.apache.tomcat:juli'
o 'org.apache.tomcat:servlet-api'
[HUDSON] Archiving <http://hudson.zones.apache.org/hudson/job/Tuscany-2x/ws/sca-2x/distribution/tomcat/tomcat-war/pom.xml> to /export/home/hudson/hudson/jobs/Tuscany-2x/modules/org.apache.tuscany.sca$tuscany-war/builds/2010-03-22_13-42-04/archive/org.apache.tuscany.sca/tuscany-war/2.0-SNAPSHOT/pom.xml
[HUDSON] Archiving <http://hudson.zones.apache.org/hudson/job/Tuscany-2x/ws/sca-2x/distribution/tomcat/tomcat-war/target/tuscany.war> to /export/home/hudson/hudson/jobs/Tuscany-2x/modules/org.apache.tuscany.sca$tuscany-war/builds/2010-03-22_13-42-04/archive/org.apache.tuscany.sca/tuscany-war/2.0-SNAPSHOT/tuscany.war
[INFO] ------------------------------------------------------------------------
[ERROR] BUILD ERROR
[INFO] ------------------------------------------------------------------------
[INFO] Failed to create assembly: Failed to retrieve OS environment variables. Reason: Cannot run program "env": java.io.IOException: error=24, Too many open files
[INFO] ------------------------------------------------------------------------
[INFO] For more information, run Maven with the -e switch
[INFO] ------------------------------------------------------------------------
[INFO] Total time: 76 minutes 2 seconds
[INFO] Finished at: Mon Mar 22 14:58:18 UTC 2010
[INFO] Final Memory: 132M/751M
[INFO] ------------------------------------------------------------------------
Waiting for Hudson to finish collecting data
Sending e-mails to: commits@tuscany.apache.org
Sending e-mails to: commits@tuscany.apache.org
channel stopped
2010-03-22 14:58:31.970::INFO: Shutdown hook executing
2010-03-22 14:58:31.970::INFO: Shutdown hook complete
2010-03-22 14:58:31.970::INFO: Shutdown hook executing
2010-03-22 14:58:31.971::INFO: Shutdown hook executing
2010-03-22 14:58:31.971::INFO: Shutdown hook executing
2010-03-22 14:58:31.971::INFO: Shutdown hook complete
2010-03-22 14:58:31.971::INFO: Shutdown hook complete
2010-03-22 14:58:31.971::INFO: Shutdown hook complete