You are viewing a plain text version of this content. The canonical link for it is here.
Posted to dev@oozie.apache.org by Apache Jenkins Server <je...@builds.apache.org> on 2017/10/27 10:15:32 UTC

Failed: OOZIE-2296 PreCommit Build #138

Jira: https://issues.apache.org/jira/browse/OOZIE-2296
Build: https://builds.apache.org/job/PreCommit-OOZIE-Build/138/

###################################################################################
########################## LAST 60 LINES OF THE CONSOLE ###########################
[...truncated 1.60 MB...]
 +1 There are no new bugs found in [examples].
 +1 There are no new bugs found in [core].
 +1 There are no new bugs found in [sharelib/distcp].
 +1 There are no new bugs found in [sharelib/hive].
 +1 There are no new bugs found in [sharelib/pig].
 +1 There are no new bugs found in [sharelib/spark].
 +1 There are no new bugs found in [sharelib/hive2].
 +1 There are no new bugs found in [sharelib/hcatalog].
 +1 There are no new bugs found in [sharelib/sqoop].
 +1 There are no new bugs found in [sharelib/oozie].
 +1 There are no new bugs found in [sharelib/streaming].
 0 There are [3] new bugs found in [tools] that would be nice to have fixed.
 You can find the FindBugs diff here: tools/findbugs-new.html
 +1 There are no new bugs found in [docs].
 +1 There are no new bugs found in [server].
 +1 There are no new bugs found in [client].
+1 BACKWARDS_COMPATIBILITY
    +1 the patch does not change any JPA Entity/Colum/Basic/Lob/Transient annotations
    +1 the patch does not modify JPA files
-1 TESTS
    Tests run: 2056
    Tests failed: 0
    Tests errors: 1

    The patch failed the following testcases:

      

    Tests failing with errors:
      testStoreLastWorkflows(org.apache.oozie.tools.diag.TestAppInfoCollector)

+1 DISTRO
    +1 distro tarball builds with the patch 

----------------------------
-1 Overall result, please check the reported -1(s)

 There is at least one warning, please check

The full output of the test-patch run is available at

 https://builds.apache.org/job/PreCommit-OOZIE-Build/138/

  % Total    % Received % Xferd  Average Speed   Time    Time     Time  Current
                                 Dload  Upload   Total   Spent    Left  Speed
  0     0    0     0    0     0      0      0 --:--:-- --:--:-- --:--:--     0  0     0    0     0    0     0      0      0 --:--:-- --:--:-- --:--:--     0  0     0    0     0    0     0      0      0 --:--:-- --:--:-- --:--:--     0
100 3706k  100 3706k    0     0  4082k      0 --:--:-- --:--:-- --:--:-- 4082k
Adding comment to JIRA
Comment added.

test-patch exit code: 1

Build step 'Execute shell' marked build as failure
[description-setter] Description set: OOZIE-2296
Archiving artifacts
[Fast Archiver] Compressed 1.80 MB of artifacts by 60.7% relative to #137
Recording test results
Email was triggered for: Failure - Any
Sending email for trigger: Failure - Any



###################################################################################
############################## FAILED TESTS (if any) ##############################
1 tests failed.
FAILED:  org.apache.oozie.tools.diag.TestAppInfoCollector.testStoreLastWorkflows

Error Message:
null

Stack Trace:
java.lang.NullPointerException
	at java.io.Writer.write(Writer.java:157)
	at org.apache.oozie.tools.diag.DiagBundleEntryWriter.writeString(DiagBundleEntryWriter.java:85)
	at org.apache.oozie.tools.diag.AppInfoCollector.persistWorkflowDefinition(AppInfoCollector.java:364)
	at org.apache.oozie.tools.diag.AppInfoCollector.persistResolvedActionDefinition(AppInfoCollector.java:159)
	at org.apache.oozie.tools.diag.AppInfoCollector.persistWorkflowJobInfo(AppInfoCollector.java:138)
	at org.apache.oozie.tools.diag.AppInfoCollector.storeWorkflowJobDetails(AppInfoCollector.java:76)
	at org.apache.oozie.tools.diag.AppInfoCollector.storeLastWorkflows(AppInfoCollector.java:376)
	at org.apache.oozie.tools.diag.TestAppInfoCollector.testStoreLastWorkflows(TestAppInfoCollector.java:121)
	at sun.reflect.NativeMethodAccessorImpl.invoke0(Native Method)
	at sun.reflect.NativeMethodAccessorImpl.invoke(NativeMethodAccessorImpl.java:62)
	at sun.reflect.DelegatingMethodAccessorImpl.invoke(DelegatingMethodAccessorImpl.java:43)
	at java.lang.reflect.Method.invoke(Method.java:498)
	at org.junit.runners.model.FrameworkMethod$1.runReflectiveCall(FrameworkMethod.java:47)
	at org.junit.internal.runners.model.ReflectiveCallable.run(ReflectiveCallable.java:12)
	at org.junit.runners.model.FrameworkMethod.invokeExplosively(FrameworkMethod.java:44)
	at org.junit.internal.runners.statements.InvokeMethod.evaluate(InvokeMethod.java:17)
	at org.junit.internal.runners.statements.RunBefores.evaluate(RunBefores.java:26)
	at org.junit.rules.ExternalResource$1.evaluate(ExternalResource.java:48)
	at org.junit.rules.RunRules.evaluate(RunRules.java:20)
	at org.junit.runners.ParentRunner.runLeaf(ParentRunner.java:271)
	at org.junit.runners.BlockJUnit4ClassRunner.runChild(BlockJUnit4ClassRunner.java:70)
	at org.junit.runners.BlockJUnit4ClassRunner.runChild(BlockJUnit4ClassRunner.java:50)
	at org.junit.runners.ParentRunner$3.run(ParentRunner.java:238)
	at org.junit.runners.ParentRunner$1.schedule(ParentRunner.java:63)
	at org.junit.runners.ParentRunner.runChildren(ParentRunner.java:236)
	at org.junit.runners.ParentRunner.access$000(ParentRunner.java:53)
	at org.junit.runners.ParentRunner$2.evaluate(ParentRunner.java:229)
	at org.junit.runners.ParentRunner.run(ParentRunner.java:309)
	at org.mockito.internal.runners.JUnit45AndHigherRunnerImpl.run(JUnit45AndHigherRunnerImpl.java:37)
	at org.mockito.runners.MockitoJUnitRunner.run(MockitoJUnitRunner.java:62)
	at org.junit.runners.Suite.runChild(Suite.java:127)
	at org.junit.runners.Suite.runChild(Suite.java:26)
	at org.junit.runners.ParentRunner$3.run(ParentRunner.java:238)
	at java.util.concurrent.Executors$RunnableAdapter.call(Executors.java:511)
	at java.util.concurrent.FutureTask.run(FutureTask.java:266)
	at java.util.concurrent.ThreadPoolExecutor.runWorker(ThreadPoolExecutor.java:1149)
	at java.util.concurrent.ThreadPoolExecutor$Worker.run(ThreadPoolExecutor.java:624)
	at java.lang.Thread.run(Thread.java:748)

Success: OOZIE-2896 PreCommit Build #140

Posted by Apache Jenkins Server <je...@builds.apache.org>.
Jira: https://issues.apache.org/jira/browse/OOZIE-2896
Build: https://builds.apache.org/job/PreCommit-OOZIE-Build/140/

###################################################################################
########################## LAST 60 LINES OF THE CONSOLE ###########################
[...truncated 1.97 MB...]
+1 RAT
    +1 the patch does not seem to introduce new RAT warnings
+1 JAVADOC
    +1 the patch does not seem to introduce new Javadoc warnings
    WARNING: the current HEAD has 77 Javadoc warning(s)
+1 COMPILE
    +1 HEAD compiles
    +1 patch compiles
    +1 the patch does not seem to introduce new javac warnings
+1 There are no new bugs found in total.
 +1 There are no new bugs found in [core].
 +1 There are no new bugs found in [client].
 +1 There are no new bugs found in [docs].
 +1 There are no new bugs found in [sharelib/streaming].
 +1 There are no new bugs found in [sharelib/hive].
 +1 There are no new bugs found in [sharelib/hive2].
 +1 There are no new bugs found in [sharelib/sqoop].
 +1 There are no new bugs found in [sharelib/oozie].
 +1 There are no new bugs found in [sharelib/hcatalog].
 +1 There are no new bugs found in [sharelib/pig].
 +1 There are no new bugs found in [sharelib/spark].
 +1 There are no new bugs found in [sharelib/distcp].
 +1 There are no new bugs found in [examples].
 +1 There are no new bugs found in [tools].
 +1 There are no new bugs found in [server].
+1 BACKWARDS_COMPATIBILITY
    +1 the patch does not change any JPA Entity/Colum/Basic/Lob/Transient annotations
    +1 the patch does not modify JPA files
+1 TESTS
    Tests run: 2047
    Tests rerun: 54
    Tests failed at first run: org.apache.oozie.action.hadoop.TestJavaActionExecutor,
+1 DISTRO
    +1 distro tarball builds with the patch 

----------------------------
+1 Overall result, good!, no -1s

 There is at least one warning, please check

The full output of the test-patch run is available at

 https://builds.apache.org/job/PreCommit-OOZIE-Build/140/

  % Total    % Received % Xferd  Average Speed   Time    Time     Time  Current
                                 Dload  Upload   Total   Spent    Left  Speed
  0     0    0     0    0     0      0      0 --:--:-- --:--:-- --:--:--     0  0     0    0     0    0     0      0      0 --:--:-- --:--:-- --:--:--     0  0     0    0     0    0     0      0      0 --:--:-- --:--:-- --:--:--     0
100 3706k  100 3706k    0     0  4435k      0 --:--:-- --:--:-- --:--:-- 4435k
Adding comment to JIRA
Comment added.

test-patch exit code: 0

[description-setter] Description set: OOZIE-2896
Archiving artifacts
[Fast Archiver] Compressed 2.18 MB of artifacts by 53.0% relative to #137
Recording test results
Email was triggered for: Success
Sending email for trigger: Success



###################################################################################
############################## FAILED TESTS (if any) ##############################
All tests passed

Failed: OOZIE-2929 PreCommit Build #139

Posted by Apache Jenkins Server <je...@builds.apache.org>.
Jira: https://issues.apache.org/jira/browse/OOZIE-2929
Build: https://builds.apache.org/job/PreCommit-OOZIE-Build/139/

###################################################################################
########################## LAST 60 LINES OF THE CONSOLE ###########################
[...truncated 1.59 MB...]
+1 There are no new bugs found in total.
 +1 There are no new bugs found in [core].
 +1 There are no new bugs found in [docs].
 +1 There are no new bugs found in [sharelib/hive2].
 +1 There are no new bugs found in [sharelib/streaming].
 +1 There are no new bugs found in [sharelib/oozie].
 +1 There are no new bugs found in [sharelib/spark].
 +1 There are no new bugs found in [sharelib/sqoop].
 +1 There are no new bugs found in [sharelib/hive].
 +1 There are no new bugs found in [sharelib/distcp].
 +1 There are no new bugs found in [sharelib/pig].
 +1 There are no new bugs found in [sharelib/hcatalog].
 +1 There are no new bugs found in [server].
 +1 There are no new bugs found in [client].
 +1 There are no new bugs found in [tools].
 +1 There are no new bugs found in [examples].
+1 BACKWARDS_COMPATIBILITY
    +1 the patch does not change any JPA Entity/Colum/Basic/Lob/Transient annotations
    +1 the patch does not modify JPA files
-1 TESTS
    Tests run: 2042
    Tests failed: 0
    Tests errors: 1

    The patch failed the following testcases:

      

    Tests failing with errors:
      testJMXInstrumentation(org.apache.oozie.util.TestMetricsInstrumentation)

+1 DISTRO
    +1 distro tarball builds with the patch 

----------------------------
-1 Overall result, please check the reported -1(s)

 There is at least one warning, please check

The full output of the test-patch run is available at

 https://builds.apache.org/job/PreCommit-OOZIE-Build/139/

  % Total    % Received % Xferd  Average Speed   Time    Time     Time  Current
                                 Dload  Upload   Total   Spent    Left  Speed
  0     0    0     0    0     0      0      0 --:--:-- --:--:-- --:--:--     0  0     0    0     0    0     0      0      0 --:--:-- --:--:-- --:--:--     0
  0 3706k    0  5792    0     0   6461      0  0:09:47 --:--:--  0:09:47  6461100 3706k  100 3706k    0     0  3338k      0  0:00:01  0:00:01 --:--:-- 16.9M
Adding comment to JIRA
Comment added.

test-patch exit code: 1

Build step 'Execute shell' marked build as failure
[description-setter] Description set: OOZIE-2929
Archiving artifacts
[Fast Archiver] Compressed 1.80 MB of artifacts by 46.9% relative to #137
Recording test results
Email was triggered for: Failure - Any
Sending email for trigger: Failure - Any



###################################################################################
############################## FAILED TESTS (if any) ##############################
1 tests failed.
FAILED:  org.apache.oozie.util.TestMetricsInstrumentation.testJMXInstrumentation

Error Message:
Unable to open socket file: target process not responding or HotSpot VM not loaded

Stack Trace:
com.sun.tools.attach.AttachNotSupportedException: Unable to open socket file: target process not responding or HotSpot VM not loaded
	at sun.tools.attach.LinuxVirtualMachine.<init>(LinuxVirtualMachine.java:106)
	at sun.tools.attach.LinuxAttachProvider.attachVirtualMachine(LinuxAttachProvider.java:78)
	at com.sun.tools.attach.VirtualMachine.attach(VirtualMachine.java:250)
	at org.apache.oozie.util.TestMetricsInstrumentation.testJMXInstrumentation(TestMetricsInstrumentation.java:235)
	at sun.reflect.NativeMethodAccessorImpl.invoke0(Native Method)
	at sun.reflect.NativeMethodAccessorImpl.invoke(NativeMethodAccessorImpl.java:62)
	at sun.reflect.DelegatingMethodAccessorImpl.invoke(DelegatingMethodAccessorImpl.java:43)
	at java.lang.reflect.Method.invoke(Method.java:498)
	at junit.framework.TestCase.runTest(TestCase.java:176)
	at junit.framework.TestCase.runBare(TestCase.java:141)
	at junit.framework.TestResult$1.protect(TestResult.java:122)
	at junit.framework.TestResult.runProtected(TestResult.java:142)
	at junit.framework.TestResult.run(TestResult.java:125)
	at junit.framework.TestCase.run(TestCase.java:129)
	at junit.framework.TestSuite.runTest(TestSuite.java:255)
	at junit.framework.TestSuite.run(TestSuite.java:250)
	at org.junit.internal.runners.JUnit38ClassRunner.run(JUnit38ClassRunner.java:84)
	at org.junit.runners.Suite.runChild(Suite.java:127)
	at org.junit.runners.Suite.runChild(Suite.java:26)
	at org.junit.runners.ParentRunner$3.run(ParentRunner.java:238)
	at java.util.concurrent.Executors$RunnableAdapter.call(Executors.java:511)
	at java.util.concurrent.FutureTask.run(FutureTask.java:266)
	at java.util.concurrent.ThreadPoolExecutor.runWorker(ThreadPoolExecutor.java:1149)
	at java.util.concurrent.ThreadPoolExecutor$Worker.run(ThreadPoolExecutor.java:624)
	at java.lang.Thread.run(Thread.java:748)