You are viewing a plain text version of this content. The canonical link for it is here.
Posted to builds@beam.apache.org by Apache Jenkins Server <je...@builds.apache.org> on 2022/02/08 01:00:24 UTC
Build failed in Jenkins: beam_PostCommit_XVR_Spark #3341
See <https://ci-beam.apache.org/job/beam_PostCommit_XVR_Spark/3341/display/redirect?page=changes>
Changes:
[Kyle Weaver] [BEAM-12976] Log projection pushdown optimizations.
[benjamin.gonzalez] [BEAM-12572] Change jobs to run as cron jobs
[alexander.zhuravlev] [BEAM-13820] Changed color of delete icon in pipeline options dropdown,
[noreply] [BEAM-13193] Aggregates fn api outbound data/timers of different
[noreply] [BEAM-13767] Migrate a bundle of grade tasks to use configuration
[noreply] Merge pull request #16653 from [BEAM-12164]: Add integration tests for
[noreply] Merge pull request #16728 from [BEAM-13823] Update docs for SnowflakeIO
[noreply] Merge pull request #16660 from [BEAM-13771][Playground] Send multifile
[noreply] Merge pull request #16646 from [BEAM-13643][Playground] Setup running
[noreply] [BEAM-13015] Add state caching benchmark and move benchmarks to their
[noreply] [BEAM-13419] Check for initialization in dataflow runner (#16765)
[noreply] Merge pull request #16701 from [BEAM-13786] [Playground] [Bugfix] Update
[noreply] Merge pull request #16754 from [BEAM-13838][Playground] Add logs in case
[noreply] [BEAM-13293] consistent naming for expansion service address and flag
[noreply] Merge pull request #16700 from [BEAM-13790][Playground] Change logic of
[noreply] [BEAM-13830] update dependency for debeziumio expansion service (#16743)
[noreply] [BEAM-13761] consistent namings for expansion address in Debezium IO
[noreply] [BEAM-13806] Shutting down SchemaIO expansion services from Go VR
[noreply] [release-2.36.0] Update website/changelog for release 2.36.0 (#16627)
------------------------------------------
[...truncated 861.30 KB...]
coders: <
key: "rZtmIMPkvnKvCoder2"
value: <
spec: <
urn: "beam:coder:kv:v1"
>
component_coder_ids: "rZtmIMPkvnVarIntCoder"
component_coder_ids: "rZtmIMPkvnSerializableCoder1"
>
>
coders: <
key: "rZtmIMPkvnKvCoder3"
value: <
spec: <
urn: "beam:coder:kv:v1"
>
component_coder_ids: "rZtmIMPkvnVarIntCoder"
component_coder_ids: "rZtmIMPkvnTimestampedValueCoder"
>
>
coders: <
key: "rZtmIMPkvnKvCoder4"
value: <
spec: <
urn: "beam:coder:kv:v1"
>
component_coder_ids: "rZtmIMPkvnVarIntCoder"
component_coder_ids: "rZtmIMPkvnIterableCoder"
>
>
coders: <
key: "rZtmIMPkvnSerializableCoder"
value: <
spec: <
urn: "beam:coders:javasdk:0.1"
payload: "\202SNAPPY\000\000\000\000\001\000\000\000\001\000\000\000\312\241\002\360^\254\355\000\005sr\000,org.apache.beam.sdk.coders.SerializableCoder\010\364 \216\305ynl\002\000\001L\000\004typet\000\021Ljava/lang/Class;xr\000&ofV\000\024Custom\005P8j\260\010\235\013;\035\013\002\000\000xr\000 j\213\000\005/\034C\335\325\211\256\274~\370\001/\020pvr\000$N1\000\\io.BoundedSource!`v\023\177\370QA\0015\010r\000\035Z3\000\t,0\020\213\372\020Y\214\347\323\002\000\000xp"
>
>
>
coders: <
key: "rZtmIMPkvnSerializableCoder1"
value: <
spec: <
urn: "beam:coders:javasdk:0.1"
payload: "\202SNAPPY\000\000\000\000\001\000\000\000\001\000\000\000\312\214\002\360^\254\355\000\005sr\000,org.apache.beam.sdk.coders.SerializableCoder\010\364 \216\305ynl\002\000\001L\000\004typet\000\021Ljava/lang/Class;xr\000&ofV\000\024Custom\005P8j\260\010\235\013;\035\013\002\000\000xr\000 j\213\000\005/\034C\335\325\211\256\274~\370\001/\020pvr\000;N1\000Pio.BoundedReadFromUnb\t\021`Source$Shardd\236\240U\205\000j\363\002\000\000xp"
>
>
>
coders: <
key: "rZtmIMPkvnTimestampedValueCoder"
value: <
spec: <
urn: "beam:coders:javasdk:0.1"
payload: "\202SNAPPY\000\000\000\000\001\000\000\000\001\000\000\001?\315\003\270\254\355\000\005sr\000Aorg.apache.beam.sdk.values.TimestampedV\001\022\000$>\021\000LCoder\364\376\202p\274iX-\002\000\001L\000\nv\001)\005\030\034t\000\"Lorg/\t]\000/\001],/sdk/coders/\005$\020;xr\000*N\202\000\t%(.Structured\005/8s\277\022\016\325\3246\021\002\000\000xr\000 j9\000\005/\034C\335\325\211\256\274~\370\001/\020psr\000,j1\000(Serializabl\t\277\034\010\364 \216\305ynl\005\327\\\004typet\000\021Ljava/lang/Class\001\300\000&jV\000\024Custom\005\215Pj\260\010\235\013;\035\013\002\000\000xq\000~\000\003vr\000;N;\000Pio.BoundedReadFromUnb\t\021`Source$Shardd\236\240U\205\000j\363\002\000\000xp"
>
>
>
coders: <
key: "rZtmIMPkvnValueWithRecordIdCoder"
value: <
spec: <
urn: "beam:coders:javasdk:0.1"
payload: "\202SNAPPY\000\000\000\000\001\000\000\000\001\000\000\001h\364\004\320\254\355\000\005sr\000Corg.apache.beam.sdk.values.ValueWithRecordId$B\022\000LCoder{\343\376bQ\014\204>\002\000\002L\000\007i\t\025\034t\000+Lorg/\t\\\000/\001\\\024/sdk/c\0012(s/ByteArray\005B\014;L\000\n\005u\005\016\010t\000\"n;\000\005$\020;xr\000*N\274\000\t`(.Structured\005/8s\277\022\016\325\3246\021\002\000\000xr\000 j9\000\005/\034C\335\325\211\256\274~\370\001/\020psr\000)j1\0006\312\000\034\351\277\005|\263\3746\333\001:\010r\000&j8\000\024Atomic\005o\034\307\354\265\314\205tPF\0015 q\000~\000\003sr\000-N;\000$io.kafka.K\001\006\000R%\227\005B<I\320\251Y\032\341{#\002\000\001L\000\007kv\005\025\010t\000$nH\001\000K\t&\000;\025s\000\"Ns\000-P\r- j\000\275\271\035\243\3126\002!\353\010\010ke)\277\001\264\000\0022\303\001\005\022\rY$q\000~\000\006q\000~\000\016"
>
>
>
coders: <
key: "rZtmIMPkvnVarIntCoder"
value: <
spec: <
urn: "beam:coders:javasdk:0.1"
payload: "\202SNAPPY\000\000\000\000\001\000\000\000\001\000\000\000\210\330\001\350\254\355\000\005sr\000&org.apache.beam.sdk.coders.VarIntCoder\300K2\332\251KVh\002\000\000xrr5\000\024Atomic\0055 \307\354\265\314\205tPF\002\0055\000*jj\000$Structured\0059\034s\277\022\016\325\3246\021\t9\000 j9\000\005/0C\335\325\211\256\274~\370\002\000\000xp"
>
>
>
coders: <
key: "rZtmIMPkvnVoidCoder"
value: <
spec: <
urn: "beam:coders:javasdk:0.1"
payload: "\202SNAPPY\000\000\000\000\001\000\000\000\001\000\000\000\210\326\001\350\254\355\000\005sr\000$org.apache.beam.sdk.coders.VoidCoder\271\277U\233\350\r\257U\002\000\000xr\000&j3\000\024Atomic\0055 \307\354\265\314\205tPF\002\0055\000*j5\000$Structured\0059\034s\277\022\016\325\3246\021\t9\000 j9\000\005/0C\335\325\211\256\274~\370\002\000\000xp"
>
>
>
environments: <
key: "go"
value: <
urn: "beam:env:docker:v1"
payload: "\n\026apache/beam_go_sdk:dev"
capabilities: "beam:protocol:progress_reporting:v0"
capabilities: "beam:protocol:multi_core_bundle_processing:v1"
capabilities: "beam:version:sdk_base:go"
capabilities: "beam:coder:bytes:v1"
capabilities: "beam:coder:bool:v1"
capabilities: "beam:coder:varint:v1"
capabilities: "beam:coder:double:v1"
capabilities: "beam:coder:string_utf8:v1"
capabilities: "beam:coder:length_prefix:v1"
capabilities: "beam:coder:kv:v1"
capabilities: "beam:coder:iterable:v1"
capabilities: "beam:coder:state_backed_iterable:v1"
capabilities: "beam:coder:windowed_value:v1"
capabilities: "beam:coder:global_window:v1"
capabilities: "beam:coder:interval_window:v1"
capabilities: "beam:coder:row:v1"
dependencies: <
type_urn: "beam:artifact:type:go_worker_binary:v1"
role_urn: "beam:artifact:role:staging_to:v1"
role_payload: "\n\006worker"
>
>
>
environments: <
key: "rZtmIMPkvnbeam:env:docker:v1"
value: <
urn: "beam:env:docker:v1"
payload: "\n apache/beam_java8_sdk:2.37.0.dev"
capabilities: "beam:coder:bytes:v1"
capabilities: "beam:coder:bool:v1"
capabilities: "beam:coder:varint:v1"
capabilities: "beam:coder:string_utf8:v1"
capabilities: "beam:coder:iterable:v1"
capabilities: "beam:coder:timer:v1"
capabilities: "beam:coder:kv:v1"
capabilities: "beam:coder:length_prefix:v1"
capabilities: "beam:coder:global_window:v1"
capabilities: "beam:coder:interval_window:v1"
capabilities: "beam:coder:custom_window:v1"
capabilities: "beam:coder:windowed_value:v1"
capabilities: "beam:coder:double:v1"
capabilities: "beam:coder:row:v1"
capabilities: "beam:coder:param_windowed_value:v1"
capabilities: "beam:coder:state_backed_iterable:v1"
capabilities: "beam:coder:sharded_key:v1"
capabilities: "beam:protocol:multi_core_bundle_processing:v1"
capabilities: "beam:protocol:progress_reporting:v1"
capabilities: "beam:protocol:harness_monitoring_infos:v1"
capabilities: "beam:protocol:control_request_elements_embedding:v1"
capabilities: "beam:protocol:state_caching:v1"
capabilities: "beam:version:sdk_base:apache/beam_java8_sdk:2.37.0.dev"
capabilities: "beam:transform:sdf_truncate_sized_restrictions:v1"
capabilities: "beam:transform:to_string:v1"
dependencies: <
type_urn: "beam:artifact:type:file:v1"
type_payload: "\nL/tmp/artifacts/icedtea-sound-ebvtNFkfFXg4aaYFuDnwKpwDSjzsaZqlqv5iKxPTr-U.jar\022@79bbed34591f15783869a605b839f02a9c034a3cec699aa5aafe622b13d3afe5"
role_urn: "beam:artifact:role:staging_to:v1"
role_payload: "\n=icedtea-sound-ebvtNFkfFXg4aaYFuDnwKpwDSjzsaZqlqv5iKxPTr-U.jar"
>
dependencies: <
type_urn: "beam:artifact:type:file:v1"
type_payload: "\nF/tmp/artifacts/jaccess-ULFTCPsb6cLYZ0f1BG1FQfczmHNaZCx8plXuRDKpBqE.jar\022@50b15308fb1be9c2d86747f5046d4541f73398735a642c7ca655ee4432a906a1"
role_urn: "beam:artifact:role:staging_to:v1"
role_payload: "\n7jaccess-ULFTCPsb6cLYZ0f1BG1FQfczmHNaZCx8plXuRDKpBqE.jar"
>
dependencies: <
type_urn: "beam:artifact:type:file:v1"
type_payload: "\nI/tmp/artifacts/localedata-dUHqyGxaTVCjfTI8MckPYarZ3_mwf62udkxaHi1aKns.jar\022@7541eac86c5a4d50a37d323c31c90f61aad9dff9b07fadae764c5a1e2d5a2a7b"
role_urn: "beam:artifact:role:staging_to:v1"
role_payload: "\n:localedata-dUHqyGxaTVCjfTI8MckPYarZ3_mwf62udkxaHi1aKns.jar"
>
dependencies: <
type_urn: "beam:artifact:type:file:v1"
type_payload: "\nF/tmp/artifacts/nashorn-XdUndQGroXOP9NCsfITpBERYcbbGXVHLjbvNWXCh-3A.jar\022@5dd5277501aba1738ff4d0ac7c84e904445871b6c65d51cb8dbbcd5970a1fb70"
role_urn: "beam:artifact:role:staging_to:v1"
role_payload: "\n7nashorn-XdUndQGroXOP9NCsfITpBERYcbbGXVHLjbvNWXCh-3A.jar"
>
dependencies: <
type_urn: "beam:artifact:type:file:v1"
type_payload: "\nG/tmp/artifacts/cldrdata-YqzuKX1QnLCOo0cwjKRdBhGrip_ltIJZg-APT60tUPA.jar\022@62acee297d509cb08ea347308ca45d0611ab8a9fe5b4825983e00f4fad2d50f0"
role_urn: "beam:artifact:role:staging_to:v1"
role_payload: "\n8cldrdata-YqzuKX1QnLCOo0cwjKRdBhGrip_ltIJZg-APT60tUPA.jar"
>
dependencies: <
type_urn: "beam:artifact:type:file:v1"
type_payload: "\nD/tmp/artifacts/dnsns-dhEp186udEF6X6chZus-RJzWRmzlccxx1_btlXWayVI.jar\022@761129d7ceae74417a5fa72166eb3e449cd6466ce571cc71d7f6ed95759ac952"
role_urn: "beam:artifact:role:staging_to:v1"
role_payload: "\n5dnsns-dhEp186udEF6X6chZus-RJzWRmzlccxx1_btlXWayVI.jar"
>
dependencies: <
type_urn: "beam:artifact:type:file:v1"
type_payload: "\nr/tmp/artifacts/beam-sdks-java-io-expansion-service-2.37.0-SNAPSHOT-5Jr64ifXpHFxNDhZEPaK2F1rNjD2H7yKUyhxIB87quA.jar\022@e49afae227d7a4717134385910f68ad85d6b3630f61fbc8a532871201f3baae0"
role_urn: "beam:artifact:role:staging_to:v1"
role_payload: "\ncbeam-sdks-java-io-expansion-service-2.37.0-SNAPSHOT-5Jr64ifXpHFxNDhZEPaK2F1rNjD2H7yKUyhxIB87quA.jar"
>
>
>
>
root_transform_ids: "e4"
root_transform_ids: "s1"
root_transform_ids: "e5"
root_transform_ids: "s3"
requirements: "beam:requirement:pardo:splittable_dofn:v1"
2022/02/08 00:38:58 Prepared job with id: go-testkafkaio_basicreadwrite_cccf859a-829a-46a7-bea6-de7050ca493f and staging token: go-testkafkaio_basicreadwrite_cccf859a-829a-46a7-bea6-de7050ca493f
2022/02/08 00:38:58 Cross-compiling <https://ci-beam.apache.org/job/beam_PostCommit_XVR_Spark/ws/src/sdks/go/test/integration/io/xlang/kafka/kafka_test.go> as /tmp/worker-2-1644280738747343761
2022/02/08 00:39:00 Staged binary artifact with token:
2022/02/08 00:39:00 Submitted job: go0testkafkaio0basicreadwrite-jenkins-0208003900-94026874_868f186d-b97b-4d0d-9768-2befb422f6f9
2022/02/08 00:39:00 Job state: STOPPED
2022/02/08 00:39:00 Job state: STARTING
2022/02/08 00:39:00 Job state: RUNNING
2022/02/08 00:39:24 Job state: DONE
2022/02/08 00:39:24 Warning: 6 errors during metrics processing: [failed to deduce Step from MonitoringInfo: urn:"beam:metric:element_count:v1" type:"beam:metrics:sum_int64:v1" payload:"\x01" labels:{key:"PCOLLECTION" value:"rZtmIMPkvnExternal/KafkaIO.Read/KafkaIO.Read.ReadFromKafkaViaUnbounded/Read(KafkaUnboundedSource)/Create/Read(CreateSource)/ParDo(OutputSingleSource)/ParMultiDo(OutputSingleSource).output/PairWithRestriction0"} failed to deduce Step from MonitoringInfo: urn:"beam:metric:element_count:v1" type:"beam:metrics:sum_int64:v1" payload:"\x01" labels:{key:"PCOLLECTION" value:"rZtmIMPkvnExternal/KafkaIO.Read/KafkaIO.Read.ReadFromKafkaViaUnbounded/Read(KafkaUnboundedSource)/Create/Read(CreateSource)/ParDo(OutputSingleSource)/ParMultiDo(OutputSingleSource).output/SplitAndSize0"} failed to deduce Step from MonitoringInfo: urn:"beam:metric:sampled_byte_size:v1" type:"beam:metrics:distribution_int64:v1" payload:"\x01\xbcA\xbcA\xbcA" labels:{key:"PCOLLECTION" value:"rZtmIMPkvnExternal/KafkaIO.Read/KafkaIO.Read.ReadFromKafkaViaUnbounded/Read(KafkaUnboundedSource)/Create/Read(CreateSource)/ParDo(OutputSingleSource)/ParMultiDo(OutputSingleSource).output/PairWithRestriction0"} failed to deduce Step from MonitoringInfo: urn:"beam:metric:sampled_byte_size:v1" type:"beam:metrics:distribution_int64:v1" payload:"\x01\xc9A\xc9A\xc9A" labels:{key:"PCOLLECTION" value:"rZtmIMPkvnExternal/KafkaIO.Read/KafkaIO.Read.ReadFromKafkaViaUnbounded/Read(KafkaUnboundedSource)/Create/Read(CreateSource)/ParDo(OutputSingleSource)/ParMultiDo(OutputSingleSource).output/SplitAndSize0"} failed to deduce Step from MonitoringInfo: urn:"beam:metric:element_count:v1" type:"beam:metrics:sum_int64:v1" payload:"\x01" labels:{key:"PCOLLECTION" value:"rZtmIMPkvnExternal/KafkaIO.Read/KafkaIO.Read.ReadFromKafkaViaUnbounded/Read(KafkaUnboundedSource)/Create/Read(CreateSource)/ParDo(OutputSingleSource)/ParMultiDo(OutputSingleSource).output/SplitAndSize0"} failed to deduce Step from MonitoringInfo: urn:"beam:metric:sampled_byte_size:v1" type:"beam:metrics:distribution_int64:v1" payload:"\x01\xc9A\xc9A\xc9A" labels:{key:"PCOLLECTION" value:"rZtmIMPkvnExternal/KafkaIO.Read/KafkaIO.Read.ReadFromKafkaViaUnbounded/Read(KafkaUnboundedSource)/Create/Read(CreateSource)/ParDo(OutputSingleSource)/ParMultiDo(OutputSingleSource).output/SplitAndSize0"}]
--- PASS: TestKafkaIO_BasicReadWrite (39.68s)
PASS
ok github.com/apache/beam/sdks/v2/go/test/integration/io/xlang/kafka 42.727s
FAIL
> Task :runners:spark:2:job-server:validatesCrossLanguageRunnerGoUsingJava FAILED
> Task :runners:spark:2:job-server:validatesCrossLanguageRunnerJavaUsingJava
> Task :runners:spark:2:job-server:validatesCrossLanguageRunnerJavaUsingPython
> Task :runners:spark:2:job-server:validatesCrossLanguageRunnerJavaUsingPythonOnly
> Task :runners:spark:2:job-server:validatesCrossLanguageRunnerPythonUsingJava
> Task :runners:spark:2:job-server:validatesCrossLanguageRunnerPythonUsingPython
> Task :runners:spark:2:job-server:validatesCrossLanguageRunnerPythonUsingSql
> Task :runners:spark:2:job-server:validatesCrossLanguageRunnerCleanup
> Task :runners:spark:2:job-server:sparkJobServerCleanup
FAILURE: Build failed with an exception.
* Where:
Build file '<https://ci-beam.apache.org/job/beam_PostCommit_XVR_Spark/ws/src/sdks/go/test/build.gradle'> line: 173
* What went wrong:
Execution failed for task ':runners:spark:2:job-server:validatesCrossLanguageRunnerGoUsingJava'.
> Process 'command 'sh'' finished with non-zero exit value 1
* Try:
> Run with --stacktrace option to get the stack trace.
> Run with --info or --debug option to get more log output.
> Run with --scan to get full insights.
* Get more help at https://help.gradle.org
Deprecated Gradle features were used in this build, making it incompatible with Gradle 8.0.
You can use '--warning-mode all' to show the individual deprecation warnings and determine if they come from your own scripts or plugins.
See https://docs.gradle.org/7.3.2/userguide/command_line_interface.html#sec:command_line_warnings
Execution optimizations have been disabled for 1 invalid unit(s) of work during this build to ensure correctness.
Please consult deprecation warnings for more details.
BUILD FAILED in 34m
240 actionable tasks: 183 executed, 49 from cache, 8 up-to-date
Publishing build scan...
https://gradle.com/s/d7uk2bkq27d34
Build step 'Invoke Gradle script' changed build result to FAILURE
Build step 'Invoke Gradle script' marked build as failure
---------------------------------------------------------------------
To unsubscribe, e-mail: builds-unsubscribe@beam.apache.org
For additional commands, e-mail: builds-help@beam.apache.org
Jenkins build is back to normal : beam_PostCommit_XVR_Spark #3354
Posted by Apache Jenkins Server <je...@builds.apache.org>.
See <https://ci-beam.apache.org/job/beam_PostCommit_XVR_Spark/3354/display/redirect?page=changes>
---------------------------------------------------------------------
To unsubscribe, e-mail: builds-unsubscribe@beam.apache.org
For additional commands, e-mail: builds-help@beam.apache.org
Build failed in Jenkins: beam_PostCommit_XVR_Spark #3353
Posted by Apache Jenkins Server <je...@builds.apache.org>.
See <https://ci-beam.apache.org/job/beam_PostCommit_XVR_Spark/3353/display/redirect?page=changes>
Changes:
[benjamin.gonzalez] [BEAM-12672] Retry flaky tests
[benjamin.gonzalez] [BEAM-12672] Fix spotlessApply
[laraschmidt] Fixing the log line to properly handle a large allowed skew.
[n] BEAM-13159 Update embedded-redis dependency
[n] address comments
[noreply] Minor: Add 2.38.0 section to CHANGES.md (#16804)
[noreply] [BEAM-12000] Fix typo in portable Python job definition (#16812)
[noreply] [BEAM-12164]: Fixes SpannerChangeStreamIT (#16806)
[noreply] [BEAM-12572] Fix failures in python examples tests (#16781)
[noreply] [BEAM-13921] filter out debeziumIO test for spark runner (#16815)
[noreply] [BEAM-13855] Skip SpannerChangeStreamOrderedWithinKeyIT and
------------------------------------------
[...truncated 902.04 KB...]
return self.runner.run_pipeline(self, self._options)
apache_beam/runners/portability/portable_runner.py:438: in run_pipeline
job_service_handle = self.create_job_service(options)
apache_beam/runners/portability/portable_runner.py:317: in create_job_service
return self.create_job_service_handle(server.start(), options)
apache_beam/runners/portability/job_server.py:54: in start
grpc.channel_ready_future(channel).result(timeout=self._timeout)
../../build/gradleenv/1922375555/lib/python3.6/site-packages/grpc/_utilities.py:139: in result
self._block(timeout)
_ _ _ _ _ _ _ _ _ _ _ _ _ _ _ _ _ _ _ _ _ _ _ _ _ _ _ _ _ _ _ _ _ _ _ _ _ _ _ _
self = <grpc._utilities._ChannelReadyFuture object at 0x7f3df22280b8>
timeout = 60
def _block(self, timeout):
until = None if timeout is None else time.time() + timeout
with self._condition:
while True:
if self._cancelled:
raise grpc.FutureCancelledError()
elif self._matured:
return
else:
if until is None:
self._condition.wait()
else:
remaining = until - time.time()
if remaining < 0:
> raise grpc.FutureTimeoutError()
E grpc.FutureTimeoutError
../../build/gradleenv/1922375555/lib/python3.6/site-packages/grpc/_utilities.py:85: FutureTimeoutError
----------------------------- Captured stderr call -----------------------------
WARNING:root:Make sure that locally built Python SDK docker image has Python 3.6 interpreter.
WARNING:root:Make sure that locally built Python SDK docker image has Python 3.6 interpreter.
------------------------------ Captured log call -------------------------------
WARNING root:environments.py:374 Make sure that locally built Python SDK docker image has Python 3.6 interpreter.
WARNING root:environments.py:374 Make sure that locally built Python SDK docker image has Python 3.6 interpreter.
__________________ SqlTransformTest.test_windowing_before_sql __________________
self = <apache_beam.transforms.sql_test.SqlTransformTest testMethod=test_windowing_before_sql>
def test_windowing_before_sql(self):
with TestPipeline() as p:
out = (
p | beam.Create([
SimpleRow(5, "foo", 1.),
SimpleRow(15, "bar", 2.),
SimpleRow(25, "baz", 3.)
])
| beam.Map(lambda v: beam.window.TimestampedValue(v, v.id)).
with_output_types(SimpleRow)
| beam.WindowInto(
beam.window.FixedWindows(10)).with_output_types(SimpleRow)
| SqlTransform("SELECT COUNT(*) as `count` FROM PCOLLECTION"))
> assert_that(out, equal_to([(1, ), (1, ), (1, )]))
apache_beam/transforms/sql_test.py:175:
_ _ _ _ _ _ _ _ _ _ _ _ _ _ _ _ _ _ _ _ _ _ _ _ _ _ _ _ _ _ _ _ _ _ _ _ _ _ _ _
apache_beam/pipeline.py:596: in __exit__
self.result = self.run()
apache_beam/testing/test_pipeline.py:114: in run
False if self.not_use_test_runner_api else test_runner_api))
apache_beam/pipeline.py:573: in run
return self.runner.run_pipeline(self, self._options)
apache_beam/runners/portability/portable_runner.py:438: in run_pipeline
job_service_handle = self.create_job_service(options)
apache_beam/runners/portability/portable_runner.py:317: in create_job_service
return self.create_job_service_handle(server.start(), options)
apache_beam/runners/portability/job_server.py:54: in start
grpc.channel_ready_future(channel).result(timeout=self._timeout)
../../build/gradleenv/1922375555/lib/python3.6/site-packages/grpc/_utilities.py:139: in result
self._block(timeout)
_ _ _ _ _ _ _ _ _ _ _ _ _ _ _ _ _ _ _ _ _ _ _ _ _ _ _ _ _ _ _ _ _ _ _ _ _ _ _ _
self = <grpc._utilities._ChannelReadyFuture object at 0x7f3dec380710>
timeout = 60
def _block(self, timeout):
until = None if timeout is None else time.time() + timeout
with self._condition:
while True:
if self._cancelled:
raise grpc.FutureCancelledError()
elif self._matured:
return
else:
if until is None:
self._condition.wait()
else:
remaining = until - time.time()
if remaining < 0:
> raise grpc.FutureTimeoutError()
E grpc.FutureTimeoutError
../../build/gradleenv/1922375555/lib/python3.6/site-packages/grpc/_utilities.py:85: FutureTimeoutError
----------------------------- Captured stderr call -----------------------------
WARNING:root:Make sure that locally built Python SDK docker image has Python 3.6 interpreter.
WARNING:root:Make sure that locally built Python SDK docker image has Python 3.6 interpreter.
------------------------------ Captured log call -------------------------------
WARNING root:environments.py:374 Make sure that locally built Python SDK docker image has Python 3.6 interpreter.
WARNING root:environments.py:374 Make sure that locally built Python SDK docker image has Python 3.6 interpreter.
_________________ SqlTransformTest.test_zetasql_generate_data __________________
self = <apache_beam.transforms.sql_test.SqlTransformTest testMethod=test_zetasql_generate_data>
def test_zetasql_generate_data(self):
with TestPipeline() as p:
out = p | SqlTransform(
"""SELECT
CAST(1 AS INT64) AS `int`,
CAST('foo' AS STRING) AS `str`,
CAST(3.14 AS FLOAT64) AS `flt`""",
dialect="zetasql")
> assert_that(out, equal_to([(1, "foo", 3.14)]))
apache_beam/transforms/sql_test.py:160:
_ _ _ _ _ _ _ _ _ _ _ _ _ _ _ _ _ _ _ _ _ _ _ _ _ _ _ _ _ _ _ _ _ _ _ _ _ _ _ _
apache_beam/pipeline.py:596: in __exit__
self.result = self.run()
apache_beam/testing/test_pipeline.py:114: in run
False if self.not_use_test_runner_api else test_runner_api))
apache_beam/pipeline.py:573: in run
return self.runner.run_pipeline(self, self._options)
apache_beam/runners/portability/portable_runner.py:438: in run_pipeline
job_service_handle = self.create_job_service(options)
apache_beam/runners/portability/portable_runner.py:317: in create_job_service
return self.create_job_service_handle(server.start(), options)
apache_beam/runners/portability/job_server.py:54: in start
grpc.channel_ready_future(channel).result(timeout=self._timeout)
../../build/gradleenv/1922375555/lib/python3.6/site-packages/grpc/_utilities.py:139: in result
self._block(timeout)
_ _ _ _ _ _ _ _ _ _ _ _ _ _ _ _ _ _ _ _ _ _ _ _ _ _ _ _ _ _ _ _ _ _ _ _ _ _ _ _
self = <grpc._utilities._ChannelReadyFuture object at 0x7f3dec4a3208>
timeout = 60
def _block(self, timeout):
until = None if timeout is None else time.time() + timeout
with self._condition:
while True:
if self._cancelled:
raise grpc.FutureCancelledError()
elif self._matured:
return
else:
if until is None:
self._condition.wait()
else:
remaining = until - time.time()
if remaining < 0:
> raise grpc.FutureTimeoutError()
E grpc.FutureTimeoutError
../../build/gradleenv/1922375555/lib/python3.6/site-packages/grpc/_utilities.py:85: FutureTimeoutError
----------------------------- Captured stderr call -----------------------------
WARNING:root:Make sure that locally built Python SDK docker image has Python 3.6 interpreter.
WARNING:root:Make sure that locally built Python SDK docker image has Python 3.6 interpreter.
------------------------------ Captured log call -------------------------------
WARNING root:environments.py:374 Make sure that locally built Python SDK docker image has Python 3.6 interpreter.
WARNING root:environments.py:374 Make sure that locally built Python SDK docker image has Python 3.6 interpreter.
- generated xml file: <https://ci-beam.apache.org/job/beam_PostCommit_XVR_Spark/ws/src/sdks/python/pytest_xlangSqlValidateRunner.xml> -
================= 9 failed, 5198 deselected in 667.91 seconds ==================
> Task :runners:spark:2:job-server:validatesCrossLanguageRunnerPythonUsingSql FAILED
> Task :runners:spark:2:job-server:validatesCrossLanguageRunnerCleanup
> Task :runners:spark:2:job-server:sparkJobServerCleanup
FAILURE: Build completed with 5 failures.
1: Task failed with an exception.
-----------
* What went wrong:
Execution failed for task ':runners:spark:2:job-server:validatesCrossLanguageRunnerJavaUsingPython'.
> There were failing tests. See the report at: file://<https://ci-beam.apache.org/job/beam_PostCommit_XVR_Spark/ws/src/runners/spark/2/job-server/build/reports/tests/validatesCrossLanguageRunnerJavaUsingPython/index.html>
* Try:
> Run with --stacktrace option to get the stack trace.
> Run with --info or --debug option to get more log output.
> Run with --scan to get full insights.
==============================================================================
2: Task failed with an exception.
-----------
* What went wrong:
Execution failed for task ':runners:spark:2:job-server:validatesCrossLanguageRunnerJavaUsingPythonOnly'.
> There were failing tests. See the report at: file://<https://ci-beam.apache.org/job/beam_PostCommit_XVR_Spark/ws/src/runners/spark/2/job-server/build/reports/tests/validatesCrossLanguageRunnerJavaUsingPythonOnly/index.html>
* Try:
> Run with --stacktrace option to get the stack trace.
> Run with --info or --debug option to get more log output.
> Run with --scan to get full insights.
==============================================================================
3: Task failed with an exception.
-----------
* What went wrong:
Execution failed for task ':runners:spark:2:job-server:validatesCrossLanguageRunnerPythonUsingJava'.
> Process 'command 'sh'' finished with non-zero exit value 1
* Try:
> Run with --stacktrace option to get the stack trace.
> Run with --info or --debug option to get more log output.
> Run with --scan to get full insights.
==============================================================================
4: Task failed with an exception.
-----------
* What went wrong:
Execution failed for task ':runners:spark:2:job-server:validatesCrossLanguageRunnerPythonUsingPython'.
> Process 'command 'sh'' finished with non-zero exit value 1
* Try:
> Run with --stacktrace option to get the stack trace.
> Run with --info or --debug option to get more log output.
> Run with --scan to get full insights.
==============================================================================
5: Task failed with an exception.
-----------
* What went wrong:
Execution failed for task ':runners:spark:2:job-server:validatesCrossLanguageRunnerPythonUsingSql'.
> Process 'command 'sh'' finished with non-zero exit value 1
* Try:
> Run with --stacktrace option to get the stack trace.
> Run with --info or --debug option to get more log output.
> Run with --scan to get full insights.
==============================================================================
* Get more help at https://help.gradle.org
Deprecated Gradle features were used in this build, making it incompatible with Gradle 8.0.
You can use '--warning-mode all' to show the individual deprecation warnings and determine if they come from your own scripts or plugins.
See https://docs.gradle.org/7.3.2/userguide/command_line_interface.html#sec:command_line_warnings
Execution optimizations have been disabled for 1 invalid unit(s) of work during this build to ensure correctness.
Please consult deprecation warnings for more details.
BUILD FAILED in 1h 3m 27s
250 actionable tasks: 177 executed, 62 from cache, 11 up-to-date
Publishing build scan...
https://gradle.com/s/lhs47ctjwqoro
Build step 'Invoke Gradle script' changed build result to FAILURE
Build step 'Invoke Gradle script' marked build as failure
---------------------------------------------------------------------
To unsubscribe, e-mail: builds-unsubscribe@beam.apache.org
For additional commands, e-mail: builds-help@beam.apache.org
Build failed in Jenkins: beam_PostCommit_XVR_Spark #3352
Posted by Apache Jenkins Server <je...@builds.apache.org>.
See <https://ci-beam.apache.org/job/beam_PostCommit_XVR_Spark/3352/display/redirect?page=changes>
Changes:
[noreply] Minor: Add 2.38.0 section to CHANGES.md (#16804)
------------------------------------------
[...truncated 459.50 KB...]
[0m[91m adding 'apache_beam/runners/worker/opcounters.py'
[0m[91m adding 'apache_beam/runners/worker/opcounters_test.py'
[0m[91m adding 'apache_beam/runners/worker/operation_specs.py'
[0m[91m adding 'apache_beam/runners/worker/operations.cpython-36m-x86_64-linux-gnu.so'
[0m[91m adding 'apache_beam/runners/worker/operations.pxd'
[0m[91m adding 'apache_beam/runners/worker/operations.py'
[0m[91m adding 'apache_beam/runners/worker/sdk_worker.py'
[0m[91m adding 'apache_beam/runners/worker/sdk_worker_main.py'
[0m[91m adding 'apache_beam/runners/worker/sdk_worker_main_test.py'
adding 'apache_beam/runners/worker/sdk_worker_test.py'
adding 'apache_beam/runners/worker/sideinputs.py'
adding 'apache_beam/runners/worker/sideinputs_test.py'
[0m[91m adding 'apache_beam/runners/worker/statecache.py'
[0m[91m adding 'apache_beam/runners/worker/statecache_test.py'
adding 'apache_beam/runners/worker/statesampler.py'
[0m[91m adding 'apache_beam/runners/worker/statesampler_fast.cpython-36m-x86_64-linux-gnu.so'
[0m[91m adding 'apache_beam/runners/worker/statesampler_fast.pxd'
[0m[91m adding 'apache_beam/runners/worker/statesampler_fast.pyx'
[0m[91m adding 'apache_beam/runners/worker/statesampler_slow.py'
[0m[91m adding 'apache_beam/runners/worker/statesampler_test.py'
[0m[91m adding 'apache_beam/runners/worker/worker_id_interceptor.py'
[0m[91m adding 'apache_beam/runners/worker/worker_id_interceptor_test.py'
[0m[91m adding 'apache_beam/runners/worker/worker_pool_main.py'
[0m[91m adding 'apache_beam/runners/worker/worker_status.py'
[0m[91m adding 'apache_beam/runners/worker/worker_status_test.py'
[0m[91m adding 'apache_beam/testing/__init__.py'
[0m[91m adding 'apache_beam/testing/datatype_inference.py'
[0m[91m adding 'apache_beam/testing/datatype_inference_test.py'
[0m[91m adding 'apache_beam/testing/extra_assertions.py'
adding 'apache_beam/testing/extra_assertions_test.py'
[0m[91m adding 'apache_beam/testing/metric_result_matchers.py'
[0m[91m adding 'apache_beam/testing/metric_result_matchers_test.py'
[0m[91m adding 'apache_beam/testing/pipeline_verifiers.py'
[0m[91m adding 'apache_beam/testing/pipeline_verifiers_test.py'
[0m[91m adding 'apache_beam/testing/synthetic_pipeline.py'
[0m[91m adding 'apache_beam/testing/synthetic_pipeline_test.py'
[0m[91m adding 'apache_beam/testing/test_pipeline.py'
[0m[91m adding 'apache_beam/testing/test_pipeline_test.py'
[0m[91m adding 'apache_beam/testing/test_stream.py'
[0m[91m adding 'apache_beam/testing/test_stream_it_test.py'
[0m[91m adding 'apache_beam/testing/test_stream_service.py'
[0m[91m adding 'apache_beam/testing/test_stream_service_test.py'
[0m[91m adding 'apache_beam/testing/test_stream_test.py'
[0m[91m adding 'apache_beam/testing/test_utils.py'
[0m[91m adding 'apache_beam/testing/test_utils_test.py'
[0m[91m adding 'apache_beam/testing/util.py'
[0m[91m adding 'apache_beam/testing/util_test.py'
[0m[91m adding 'apache_beam/testing/benchmarks/__init__.py'
[0m[91m adding 'apache_beam/testing/benchmarks/chicago_taxi/__init__.py'
[0m[91m adding 'apache_beam/testing/benchmarks/chicago_taxi/preprocess.py'
[0m[91m adding 'apache_beam/testing/benchmarks/chicago_taxi/process_tfma.py'
[0m[91m adding 'apache_beam/testing/benchmarks/chicago_taxi/setup.py'
[0m[91m adding 'apache_beam/testing/benchmarks/chicago_taxi/tfdv_analyze_and_validate.py'
[0m[91m adding 'apache_beam/testing/benchmarks/chicago_taxi/trainer/__init__.py'
[0m[91m adding 'apache_beam/testing/benchmarks/chicago_taxi/trainer/model.py'
[0m[91m adding 'apache_beam/testing/benchmarks/chicago_taxi/trainer/task.py'
[0m[91m adding 'apache_beam/testing/benchmarks/chicago_taxi/trainer/taxi.py'
[0m[91m adding 'apache_beam/testing/benchmarks/nexmark/__init__.py'
[0m[91m adding 'apache_beam/testing/benchmarks/nexmark/monitor.py'
[0m[91m adding 'apache_beam/testing/benchmarks/nexmark/nexmark_launcher.py'
[0m[91m adding 'apache_beam/testing/benchmarks/nexmark/nexmark_perf.py'
[0m[91m adding 'apache_beam/testing/benchmarks/nexmark/nexmark_util.py'
[0m[91m adding 'apache_beam/testing/benchmarks/nexmark/models/__init__.py'
[0m[91m adding 'apache_beam/testing/benchmarks/nexmark/models/auction_bid.py'
[0m[91m adding 'apache_beam/testing/benchmarks/nexmark/models/field_name.py'
[0m[91m adding 'apache_beam/testing/benchmarks/nexmark/models/nexmark_model.py'
[0m[91m adding 'apache_beam/testing/benchmarks/nexmark/queries/__init__.py'
[0m[91m adding 'apache_beam/testing/benchmarks/nexmark/queries/nexmark_query_util.py'
[0m[91m adding 'apache_beam/testing/benchmarks/nexmark/queries/query0.py'
[0m[91m adding 'apache_beam/testing/benchmarks/nexmark/queries/query1.py'
[0m[91m adding 'apache_beam/testing/benchmarks/nexmark/queries/query10.py'
[0m[91m adding 'apache_beam/testing/benchmarks/nexmark/queries/query11.py'
[0m[91m adding 'apache_beam/testing/benchmarks/nexmark/queries/query12.py'
[0m[91m adding 'apache_beam/testing/benchmarks/nexmark/queries/query2.py'
[0m[91m adding 'apache_beam/testing/benchmarks/nexmark/queries/query3.py'
[0m[91m adding 'apache_beam/testing/benchmarks/nexmark/queries/query4.py'
[0m[91m adding 'apache_beam/testing/benchmarks/nexmark/queries/query5.py'
[0m[91m adding 'apache_beam/testing/benchmarks/nexmark/queries/query6.py'
[0m[91m adding 'apache_beam/testing/benchmarks/nexmark/queries/query7.py'
[0m[91m adding 'apache_beam/testing/benchmarks/nexmark/queries/query8.py'
[0m[91m adding 'apache_beam/testing/benchmarks/nexmark/queries/query9.py'
[0m[91m adding 'apache_beam/testing/benchmarks/nexmark/queries/winning_bids.py'
[0m[91m adding 'apache_beam/testing/data/trigger_transcripts.yaml'
[0m[91m adding 'apache_beam/testing/load_tests/__init__.py'
[0m[91m adding 'apache_beam/testing/load_tests/co_group_by_key_test.py'
[0m[91m adding 'apache_beam/testing/load_tests/combine_test.py'
[0m[91m adding 'apache_beam/testing/load_tests/group_by_key_test.py'
[0m[91m adding 'apache_beam/testing/load_tests/load_test.py'
[0m[91m adding 'apache_beam/testing/load_tests/load_test_metrics_utils.py'
[0m[91m adding 'apache_beam/testing/load_tests/microbenchmarks_test.py'
[0m[91m adding 'apache_beam/testing/load_tests/pardo_test.py'
[0m[91m adding 'apache_beam/testing/load_tests/sideinput_test.py'
[0m[91m adding 'apache_beam/tools/__init__.py'
[0m[91m adding 'apache_beam/tools/coders_microbenchmark.py'
[0m[91m adding 'apache_beam/tools/distribution_counter_microbenchmark.py'
[0m[91m adding 'apache_beam/tools/fn_api_runner_microbenchmark.py'
[0m[91m adding 'apache_beam/tools/map_fn_microbenchmark.py'
[0m[91m adding 'apache_beam/tools/microbenchmarks_test.py'
[0m[91m adding 'apache_beam/tools/runtime_type_check_microbenchmark.py'
[0m[91m adding 'apache_beam/tools/sideinput_microbenchmark.py'
[0m[91m adding 'apache_beam/tools/teststream_microbenchmark.py'
[0m[91m adding 'apache_beam/tools/utils.py'
[0m[91m adding 'apache_beam/transforms/__init__.py'
[0m[91m adding 'apache_beam/transforms/combinefn_lifecycle_pipeline.py'
[0m[91m adding 'apache_beam/transforms/combinefn_lifecycle_test.py'
[0m[91m adding 'apache_beam/transforms/combiners.py'
[0m[91m adding 'apache_beam/transforms/combiners_test.py'
[0m[91m adding 'apache_beam/transforms/core.py'
[0m[91m adding 'apache_beam/transforms/create_source.py'
[0m[91m adding 'apache_beam/transforms/create_test.py'
[0m[91m adding 'apache_beam/transforms/cy_combiners.cpython-36m-x86_64-linux-gnu.so'
[0m[91m adding 'apache_beam/transforms/cy_combiners.pxd'
[0m[91m adding 'apache_beam/transforms/cy_combiners.py'
[0m[91m adding 'apache_beam/transforms/cy_dataflow_distribution_counter.cpython-36m-x86_64-linux-gnu.so'
[0m[91m adding 'apache_beam/transforms/cy_dataflow_distribution_counter.pxd'
[0m[91m adding 'apache_beam/transforms/cy_dataflow_distribution_counter.pyx'
[0m[91m adding 'apache_beam/transforms/dataflow_distribution_counter_test.py'
[0m[91m adding 'apache_beam/transforms/deduplicate.py'
[0m[91m adding 'apache_beam/transforms/deduplicate_test.py'
[0m[91m adding 'apache_beam/transforms/display.py'
[0m[91m adding 'apache_beam/transforms/display_test.py'
[0m[91m adding 'apache_beam/transforms/dofn_lifecycle_test.py'
[0m[91m adding 'apache_beam/transforms/environments.py'
[0m[91m adding 'apache_beam/transforms/environments_test.py'
[0m[91m adding 'apache_beam/transforms/external.py'
[0m[91m adding 'apache_beam/transforms/external_it_test.py'
[0m[91m adding 'apache_beam/transforms/external_java.py'
[0m[91m adding 'apache_beam/transforms/external_test.py'
[0m[91m adding 'apache_beam/transforms/fully_qualified_named_transform.py'
[0m[91m adding 'apache_beam/transforms/fully_qualified_named_transform_test.py'
[0m[91m adding 'apache_beam/transforms/periodicsequence.py'
[0m[91m adding 'apache_beam/transforms/periodicsequence_test.py'
[0m[91m adding 'apache_beam/transforms/ptransform.py'
[0m[91m adding 'apache_beam/transforms/ptransform_test.py'
[0m[91m adding 'apache_beam/transforms/py_dataflow_distribution_counter.py'
[0m[91m adding 'apache_beam/transforms/resources.py'
[0m[91m adding 'apache_beam/transforms/resources_test.py'
[0m[91m adding 'apache_beam/transforms/sideinputs.py'
[0m[91m adding 'apache_beam/transforms/sideinputs_test.py'
[0m[91m adding 'apache_beam/transforms/sql.py'
[0m[91m adding 'apache_beam/transforms/sql_test.py'
[0m[91m adding 'apache_beam/transforms/stats.cpython-36m-x86_64-linux-gnu.so'
[0m[91m adding 'apache_beam/transforms/stats.pxd'
[0m[91m adding 'apache_beam/transforms/stats.py'
[0m[91m adding 'apache_beam/transforms/stats_test.py'
[0m[91m adding 'apache_beam/transforms/timeutil.py'
[0m[91m adding 'apache_beam/transforms/transforms_keyword_only_args_test.py'
[0m[91m adding 'apache_beam/transforms/trigger.py'
[0m[91m adding 'apache_beam/transforms/trigger_test.py'
[0m[91m adding 'apache_beam/transforms/userstate.py'
[0m[91m adding 'apache_beam/transforms/userstate_test.py'
[0m[91m adding 'apache_beam/transforms/util.py'
[0m[91m adding 'apache_beam/transforms/util_test.py'
[0m[91m adding 'apache_beam/transforms/validate_runner_xlang_test.py'
[0m[91m adding 'apache_beam/transforms/window.py'
[0m[91m adding 'apache_beam/transforms/window_test.py'
[0m[91m adding 'apache_beam/transforms/write_ptransform_test.py'
[0m[91m adding 'apache_beam/typehints/__init__.py'
[0m[91m adding 'apache_beam/typehints/decorators.py'
[0m[91m adding 'apache_beam/typehints/decorators_test.py'
[0m[91m adding 'apache_beam/typehints/native_type_compatibility.py'
[0m[91m adding 'apache_beam/typehints/native_type_compatibility_test.py'
[0m[91m adding 'apache_beam/typehints/opcodes.py'
[0m[91m adding 'apache_beam/typehints/row_type.py'
[0m[91m adding 'apache_beam/typehints/schemas.py'
[0m[91m adding 'apache_beam/typehints/schemas_test.py'
[0m[91m adding 'apache_beam/typehints/sharded_key_type.py'
[0m[91m adding 'apache_beam/typehints/sharded_key_type_test.py'
[0m[91m adding 'apache_beam/typehints/trivial_inference.py'
[0m[91m adding 'apache_beam/typehints/trivial_inference_test.py'
[0m[91m adding 'apache_beam/typehints/typecheck.py'
[0m[91m adding 'apache_beam/typehints/typecheck_test.py'
[0m[91m adding 'apache_beam/typehints/typed_pipeline_test.py'
[0m[91m adding 'apache_beam/typehints/typehints.py'
[0m[91m adding 'apache_beam/typehints/typehints_test.py'
[0m[91m adding 'apache_beam/utils/__init__.py'
[0m[91m adding 'apache_beam/utils/annotations.py'
[0m[91m adding 'apache_beam/utils/annotations_test.py'
[0m[91m adding 'apache_beam/utils/counters.cpython-36m-x86_64-linux-gnu.so'
[0m[91m adding 'apache_beam/utils/counters.pxd'
[0m[91m adding 'apache_beam/utils/counters.py'
[0m[91m adding 'apache_beam/utils/counters_test.py'
[0m[91m adding 'apache_beam/utils/histogram.py'
[0m[91m adding 'apache_beam/utils/histogram_test.py'
[0m[91m adding 'apache_beam/utils/interactive_utils.py'
[0m[91m adding 'apache_beam/utils/interactive_utils_test.py'
[0m[91m adding 'apache_beam/utils/plugin.py'
[0m[91m adding 'apache_beam/utils/processes.py'
[0m[91m adding 'apache_beam/utils/processes_test.py'
[0m[91m adding 'apache_beam/utils/profiler.py'
[0m[91m adding 'apache_beam/utils/profiler_test.py'
[0m[91m adding 'apache_beam/utils/proto_utils.py'
[0m[91m adding 'apache_beam/utils/retry.py'
[0m[91m adding 'apache_beam/utils/retry_test.py'
[0m[91m adding 'apache_beam/utils/sentinel.py'
[0m[91m adding 'apache_beam/utils/sharded_key.py'
[0m[91m adding 'apache_beam/utils/shared.py'
[0m[91m adding 'apache_beam/utils/shared_test.py'
[0m[91m adding 'apache_beam/utils/subprocess_server.py'
[0m[91m adding 'apache_beam/utils/subprocess_server_test.py'
[0m[91m adding 'apache_beam/utils/thread_pool_executor.py'
[0m[91m adding 'apache_beam/utils/thread_pool_executor_test.py'
[0m[91m adding 'apache_beam/utils/timestamp.py'
[0m[91m adding 'apache_beam/utils/timestamp_test.py'
[0m[91m adding 'apache_beam/utils/urns.py'
[0m[91m adding 'apache_beam/utils/windowed_value.cpython-36m-x86_64-linux-gnu.so'
[0m[91m adding 'apache_beam/utils/windowed_value.pxd'
[0m[91m adding 'apache_beam/utils/windowed_value.py'
[0m[91m adding 'apache_beam/utils/windowed_value_test.py'
[0m[91m adding 'apache_beam-2.38.0.dev0.dist-info/METADATA'
[0m[91m adding 'apache_beam-2.38.0.dev0.dist-info/WHEEL'
[0m[91m adding 'apache_beam-2.38.0.dev0.dist-info/top_level.txt'
[0m[91m adding 'apache_beam-2.38.0.dev0.dist-info/RECORD'
[0m[91m removing build/bdist.linux-x86_64/wheel
[0m Building wheel for apache-beam (setup.py): finished with status 'done'
Created wheel for apache-beam: filename=apache_beam-2.38.0.dev0-cp36-cp36m-linux_x86_64.whl size=11220056 sha256=17c90a2954a0cf315b7f4a4de44710f169545678bd8fb58af90512745599dd49
Stored in directory: /root/.cache/pip/wheels/71/0a/9d/8434df5e361fe8c44220318cb21455c5dcaa3d25589894f9c8
Successfully built apache-beam
Installing collected packages: apache-beam
FATAL: command execution failed
java.io.IOException: Backing channel 'apache-beam-jenkins-12' is disconnected.
at hudson.remoting.RemoteInvocationHandler.channelOrFail(RemoteInvocationHandler.java:216)
at hudson.remoting.RemoteInvocationHandler.invoke(RemoteInvocationHandler.java:286)
at com.sun.proxy.$Proxy133.isAlive(Unknown Source)
at hudson.Launcher$RemoteLauncher$ProcImpl.isAlive(Launcher.java:1211)
at hudson.Launcher$RemoteLauncher$ProcImpl.join(Launcher.java:1203)
at hudson.Launcher$ProcStarter.join(Launcher.java:523)
at hudson.plugins.gradle.Gradle.perform(Gradle.java:317)
at hudson.tasks.BuildStepMonitor$1.perform(BuildStepMonitor.java:20)
at hudson.model.AbstractBuild$AbstractBuildExecution.perform(AbstractBuild.java:803)
at hudson.model.Build$BuildExecution.build(Build.java:197)
at hudson.model.Build$BuildExecution.doRun(Build.java:163)
at hudson.model.AbstractBuild$AbstractBuildExecution.run(AbstractBuild.java:513)
at hudson.model.Run.execute(Run.java:1906)
at hudson.model.FreeStyleBuild.run(FreeStyleBuild.java:43)
at hudson.model.ResourceController.execute(ResourceController.java:97)
at hudson.model.Executor.run(Executor.java:429)
Caused by: java.io.IOException: Pipe closed after 0 cycles
at org.apache.sshd.common.channel.ChannelPipedInputStream.read(ChannelPipedInputStream.java:118)
at org.apache.sshd.common.channel.ChannelPipedInputStream.read(ChannelPipedInputStream.java:101)
at hudson.remoting.FlightRecorderInputStream.read(FlightRecorderInputStream.java:93)
at hudson.remoting.ChunkedInputStream.readHeader(ChunkedInputStream.java:74)
at hudson.remoting.ChunkedInputStream.readUntilBreak(ChunkedInputStream.java:104)
at hudson.remoting.ChunkedCommandTransport.readBlock(ChunkedCommandTransport.java:39)
at hudson.remoting.AbstractSynchronousByteArrayCommandTransport.read(AbstractSynchronousByteArrayCommandTransport.java:34)
at hudson.remoting.SynchronousCommandTransport$ReaderThread.run(SynchronousCommandTransport.java:61)
Build step 'Invoke Gradle script' changed build result to FAILURE
Build step 'Invoke Gradle script' marked build as failure
ERROR: apache-beam-jenkins-12 is offline; cannot locate jdk_1.8_latest
---------------------------------------------------------------------
To unsubscribe, e-mail: builds-unsubscribe@beam.apache.org
For additional commands, e-mail: builds-help@beam.apache.org
Build failed in Jenkins: beam_PostCommit_XVR_Spark #3351
Posted by Apache Jenkins Server <je...@builds.apache.org>.
See <https://ci-beam.apache.org/job/beam_PostCommit_XVR_Spark/3351/display/redirect>
Changes:
------------------------------------------
[...truncated 481.80 KB...]
urn: "beam:coders:javasdk:0.1"
payload: "\202SNAPPY\000\000\000\000\001\000\000\000\001\000\000\000\312\214\002\360^\254\355\000\005sr\000,org.apache.beam.sdk.coders.SerializableCoder\010\364 \216\305ynl\002\000\001L\000\004typet\000\021Ljava/lang/Class;xr\000&ofV\000\024Custom\005P8j\260\010\235\013;\035\013\002\000\000xr\000 j\213\000\005/\034C\335\325\211\256\274~\370\001/\020pvr\000;N1\000Pio.BoundedReadFromUnb\t\021`Source$Shardd\236\240U\205\000j\363\002\000\000xp"
>
>
>
coders: <
key: "MJhtRKUVhwTimestampedValueCoder"
value: <
spec: <
urn: "beam:coders:javasdk:0.1"
payload: "\202SNAPPY\000\000\000\000\001\000\000\000\001\000\000\001?\315\003\270\254\355\000\005sr\000Aorg.apache.beam.sdk.values.TimestampedV\001\022\000$>\021\000LCoder\364\376\202p\274iX-\002\000\001L\000\nv\001)\005\030\034t\000\"Lorg/\t]\000/\001],/sdk/coders/\005$\020;xr\000*N\202\000\t%(.Structured\005/8s\277\022\016\325\3246\021\002\000\000xr\000 j9\000\005/\034C\335\325\211\256\274~\370\001/\020psr\000,j1\000(Serializabl\t\277\034\010\364 \216\305ynl\005\327\\\004typet\000\021Ljava/lang/Class\001\300\000&jV\000\024Custom\005\215Pj\260\010\235\013;\035\013\002\000\000xq\000~\000\003vr\000;N;\000Pio.BoundedReadFromUnb\t\021`Source$Shardd\236\240U\205\000j\363\002\000\000xp"
>
>
>
coders: <
key: "MJhtRKUVhwValueWithRecordIdCoder"
value: <
spec: <
urn: "beam:coders:javasdk:0.1"
payload: "\202SNAPPY\000\000\000\000\001\000\000\000\001\000\000\001h\364\004\320\254\355\000\005sr\000Corg.apache.beam.sdk.values.ValueWithRecordId$B\022\000LCoder{\343\376bQ\014\204>\002\000\002L\000\007i\t\025\034t\000+Lorg/\t\\\000/\001\\\024/sdk/c\0012(s/ByteArray\005B\014;L\000\n\005u\005\016\010t\000\"n;\000\005$\020;xr\000*N\274\000\t`(.Structured\005/8s\277\022\016\325\3246\021\002\000\000xr\000 j9\000\005/\034C\335\325\211\256\274~\370\001/\020psr\000)j1\0006\312\000\034\351\277\005|\263\3746\333\001:\010r\000&j8\000\024Atomic\005o\034\307\354\265\314\205tPF\0015 q\000~\000\003sr\000-N;\000$io.kafka.K\001\006\000R%\227\005B<I\320\251Y\032\341{#\002\000\001L\000\007kv\005\025\010t\000$nH\001\000K\t&\000;\025s\000\"Ns\000-P\r- j\000\275\271\035\243\3126\002!\353\010\010ke)\277\001\264\000\0022\303\001\005\022\rY$q\000~\000\006q\000~\000\016"
>
>
>
coders: <
key: "MJhtRKUVhwVarIntCoder"
value: <
spec: <
urn: "beam:coders:javasdk:0.1"
payload: "\202SNAPPY\000\000\000\000\001\000\000\000\001\000\000\000\210\330\001\350\254\355\000\005sr\000&org.apache.beam.sdk.coders.VarIntCoder\300K2\332\251KVh\002\000\000xrr5\000\024Atomic\0055 \307\354\265\314\205tPF\002\0055\000*jj\000$Structured\0059\034s\277\022\016\325\3246\021\t9\000 j9\000\005/0C\335\325\211\256\274~\370\002\000\000xp"
>
>
>
coders: <
key: "MJhtRKUVhwVoidCoder"
value: <
spec: <
urn: "beam:coders:javasdk:0.1"
payload: "\202SNAPPY\000\000\000\000\001\000\000\000\001\000\000\000\210\326\001\350\254\355\000\005sr\000$org.apache.beam.sdk.coders.VoidCoder\271\277U\233\350\r\257U\002\000\000xr\000&j3\000\024Atomic\0055 \307\354\265\314\205tPF\002\0055\000*j5\000$Structured\0059\034s\277\022\016\325\3246\021\t9\000 j9\000\005/0C\335\325\211\256\274~\370\002\000\000xp"
>
>
>
coders: <
key: "c0"
value: <
spec: <
urn: "beam:coder:bytes:v1"
>
>
>
coders: <
key: "c1"
value: <
spec: <
urn: "beam:coder:global_window:v1"
>
>
>
coders: <
key: "c2"
value: <
spec: <
urn: "beam:go:coder:custom:v1"
payload: "Cgd2YXJpbnR6EgIIAhpdCklnaXRodWIuY29tL2FwYWNoZS9iZWFtL3Nka3MvdjIvZ28vcGtnL2JlYW0vY29yZS9ydW50aW1lL2NvZGVyeC5lbmNWYXJJbnRaEhAIFiIECBlADyoGCBQSAggIImkKSWdpdGh1Yi5jb20vYXBhY2hlL2JlYW0vc2Rrcy92Mi9nby9wa2cvYmVhbS9jb3JlL3J1bnRpbWUvY29kZXJ4LmRlY1ZhckludFoSHAgWIgQIGUADIgYIFBICCAgqBAgZQA8qBAgZQAE="
>
>
>
coders: <
key: "c3"
value: <
spec: <
urn: "beam:coder:length_prefix:v1"
>
component_coder_ids: "c2"
>
>
coders: <
key: "c4"
value: <
spec: <
urn: "beam:coder:kv:v1"
>
component_coder_ids: "c0"
component_coder_ids: "c0"
>
>
environments: <
key: "MJhtRKUVhwbeam:env:docker:v1"
value: <
urn: "beam:env:docker:v1"
payload: "\n apache/beam_java8_sdk:2.38.0.dev"
capabilities: "beam:coder:bytes:v1"
capabilities: "beam:coder:bool:v1"
capabilities: "beam:coder:varint:v1"
capabilities: "beam:coder:string_utf8:v1"
capabilities: "beam:coder:iterable:v1"
capabilities: "beam:coder:timer:v1"
capabilities: "beam:coder:kv:v1"
capabilities: "beam:coder:length_prefix:v1"
capabilities: "beam:coder:global_window:v1"
capabilities: "beam:coder:interval_window:v1"
capabilities: "beam:coder:custom_window:v1"
capabilities: "beam:coder:windowed_value:v1"
capabilities: "beam:coder:double:v1"
capabilities: "beam:coder:row:v1"
capabilities: "beam:coder:param_windowed_value:v1"
capabilities: "beam:coder:state_backed_iterable:v1"
capabilities: "beam:coder:sharded_key:v1"
capabilities: "beam:protocol:multi_core_bundle_processing:v1"
capabilities: "beam:protocol:progress_reporting:v1"
capabilities: "beam:protocol:harness_monitoring_infos:v1"
capabilities: "beam:protocol:control_request_elements_embedding:v1"
capabilities: "beam:protocol:state_caching:v1"
capabilities: "beam:version:sdk_base:apache/beam_java8_sdk:2.38.0.dev"
capabilities: "beam:transform:sdf_truncate_sized_restrictions:v1"
capabilities: "beam:transform:to_string:v1"
dependencies: <
type_urn: "beam:artifact:type:file:v1"
type_payload: "\nL/tmp/artifacts/icedtea-sound-ebvtNFkfFXg4aaYFuDnwKpwDSjzsaZqlqv5iKxPTr-U.jar\022@79bbed34591f15783869a605b839f02a9c034a3cec699aa5aafe622b13d3afe5"
role_urn: "beam:artifact:role:staging_to:v1"
role_payload: "\n=icedtea-sound-ebvtNFkfFXg4aaYFuDnwKpwDSjzsaZqlqv5iKxPTr-U.jar"
>
dependencies: <
type_urn: "beam:artifact:type:file:v1"
type_payload: "\nF/tmp/artifacts/jaccess-ULFTCPsb6cLYZ0f1BG1FQfczmHNaZCx8plXuRDKpBqE.jar\022@50b15308fb1be9c2d86747f5046d4541f73398735a642c7ca655ee4432a906a1"
role_urn: "beam:artifact:role:staging_to:v1"
role_payload: "\n7jaccess-ULFTCPsb6cLYZ0f1BG1FQfczmHNaZCx8plXuRDKpBqE.jar"
>
dependencies: <
type_urn: "beam:artifact:type:file:v1"
type_payload: "\nI/tmp/artifacts/localedata-dUHqyGxaTVCjfTI8MckPYarZ3_mwf62udkxaHi1aKns.jar\022@7541eac86c5a4d50a37d323c31c90f61aad9dff9b07fadae764c5a1e2d5a2a7b"
role_urn: "beam:artifact:role:staging_to:v1"
role_payload: "\n:localedata-dUHqyGxaTVCjfTI8MckPYarZ3_mwf62udkxaHi1aKns.jar"
>
dependencies: <
type_urn: "beam:artifact:type:file:v1"
type_payload: "\nF/tmp/artifacts/nashorn-XdUndQGroXOP9NCsfITpBERYcbbGXVHLjbvNWXCh-3A.jar\022@5dd5277501aba1738ff4d0ac7c84e904445871b6c65d51cb8dbbcd5970a1fb70"
role_urn: "beam:artifact:role:staging_to:v1"
role_payload: "\n7nashorn-XdUndQGroXOP9NCsfITpBERYcbbGXVHLjbvNWXCh-3A.jar"
>
dependencies: <
type_urn: "beam:artifact:type:file:v1"
type_payload: "\nG/tmp/artifacts/cldrdata-YqzuKX1QnLCOo0cwjKRdBhGrip_ltIJZg-APT60tUPA.jar\022@62acee297d509cb08ea347308ca45d0611ab8a9fe5b4825983e00f4fad2d50f0"
role_urn: "beam:artifact:role:staging_to:v1"
role_payload: "\n8cldrdata-YqzuKX1QnLCOo0cwjKRdBhGrip_ltIJZg-APT60tUPA.jar"
>
dependencies: <
type_urn: "beam:artifact:type:file:v1"
type_payload: "\nD/tmp/artifacts/dnsns-dhEp186udEF6X6chZus-RJzWRmzlccxx1_btlXWayVI.jar\022@761129d7ceae74417a5fa72166eb3e449cd6466ce571cc71d7f6ed95759ac952"
role_urn: "beam:artifact:role:staging_to:v1"
role_payload: "\n5dnsns-dhEp186udEF6X6chZus-RJzWRmzlccxx1_btlXWayVI.jar"
>
dependencies: <
type_urn: "beam:artifact:type:file:v1"
type_payload: "\nr/tmp/artifacts/beam-sdks-java-io-expansion-service-2.38.0-SNAPSHOT-_6Tx1PpVR2h5k2-Ebq-7KCkuK0OHMaQvrgZ6-7rb-tA.jar\022@ffa4f1d4fa55476879936f846eafbb28292e2b438731a42fae067afbbadbfad0"
role_urn: "beam:artifact:role:staging_to:v1"
role_payload: "\ncbeam-sdks-java-io-expansion-service-2.38.0-SNAPSHOT-_6Tx1PpVR2h5k2-Ebq-7KCkuK0OHMaQvrgZ6-7rb-tA.jar"
>
>
>
environments: <
key: "go"
value: <
urn: "beam:env:docker:v1"
payload: "\n\026apache/beam_go_sdk:dev"
capabilities: "beam:protocol:progress_reporting:v0"
capabilities: "beam:protocol:multi_core_bundle_processing:v1"
capabilities: "beam:version:sdk_base:go"
capabilities: "beam:coder:bytes:v1"
capabilities: "beam:coder:bool:v1"
capabilities: "beam:coder:varint:v1"
capabilities: "beam:coder:double:v1"
capabilities: "beam:coder:string_utf8:v1"
capabilities: "beam:coder:length_prefix:v1"
capabilities: "beam:coder:kv:v1"
capabilities: "beam:coder:iterable:v1"
capabilities: "beam:coder:state_backed_iterable:v1"
capabilities: "beam:coder:windowed_value:v1"
capabilities: "beam:coder:global_window:v1"
capabilities: "beam:coder:interval_window:v1"
capabilities: "beam:coder:row:v1"
dependencies: <
type_urn: "beam:artifact:type:file:v1"
role_urn: "beam:artifact:role:go_worker_binary:v1"
>
>
>
>
root_transform_ids: "e4"
root_transform_ids: "e5"
root_transform_ids: "s1"
root_transform_ids: "s3"
requirements: "beam:requirement:pardo:splittable_dofn:v1"
2022/02/10 12:21:17 Cross-compiling <https://ci-beam.apache.org/job/beam_PostCommit_XVR_Spark/ws/src/sdks/go/test/integration/io/xlang/kafka/kafka_test.go> as /tmp/worker-2-1644495677537710907
2022/02/10 12:21:19 Prepared job with id: go-testkafkaio_basicreadwrite_706b33e0-8901-4413-a1eb-a758e07c4632 and staging token: go-testkafkaio_basicreadwrite_706b33e0-8901-4413-a1eb-a758e07c4632
2022/02/10 12:21:19 Staged binary artifact with token:
2022/02/10 12:21:19 Submitted job: go0testkafkaio0basicreadwrite-jenkins-0210122119-a387f1b5_5db7b30d-7312-4f41-ab91-0f48ebf581de
2022/02/10 12:21:19 Job state: STOPPED
2022/02/10 12:21:19 Job state: STARTING
2022/02/10 12:21:19 Job state: RUNNING
2022/02/10 12:21:46 Job state: DONE
2022/02/10 12:21:46 Warning: 6 errors during metrics processing: [failed to deduce Step from MonitoringInfo: urn:"beam:metric:element_count:v1" type:"beam:metrics:sum_int64:v1" payload:"\x01" labels:{key:"PCOLLECTION" value:"MJhtRKUVhwExternal/KafkaIO.Read/KafkaIO.Read.ReadFromKafkaViaUnbounded/Read(KafkaUnboundedSource)/Create/Read(CreateSource)/ParDo(OutputSingleSource)/ParMultiDo(OutputSingleSource).output/SplitAndSize0"} failed to deduce Step from MonitoringInfo: urn:"beam:metric:element_count:v1" type:"beam:metrics:sum_int64:v1" payload:"\x01" labels:{key:"PCOLLECTION" value:"MJhtRKUVhwExternal/KafkaIO.Read/KafkaIO.Read.ReadFromKafkaViaUnbounded/Read(KafkaUnboundedSource)/Create/Read(CreateSource)/ParDo(OutputSingleSource)/ParMultiDo(OutputSingleSource).output/PairWithRestriction0"} failed to deduce Step from MonitoringInfo: urn:"beam:metric:sampled_byte_size:v1" type:"beam:metrics:distribution_int64:v1" payload:"\x01\xc9A\xc9A\xc9A" labels:{key:"PCOLLECTION" value:"MJhtRKUVhwExternal/KafkaIO.Read/KafkaIO.Read.ReadFromKafkaViaUnbounded/Read(KafkaUnboundedSource)/Create/Read(CreateSource)/ParDo(OutputSingleSource)/ParMultiDo(OutputSingleSource).output/SplitAndSize0"} failed to deduce Step from MonitoringInfo: urn:"beam:metric:sampled_byte_size:v1" type:"beam:metrics:distribution_int64:v1" payload:"\x01\xbcA\xbcA\xbcA" labels:{key:"PCOLLECTION" value:"MJhtRKUVhwExternal/KafkaIO.Read/KafkaIO.Read.ReadFromKafkaViaUnbounded/Read(KafkaUnboundedSource)/Create/Read(CreateSource)/ParDo(OutputSingleSource)/ParMultiDo(OutputSingleSource).output/PairWithRestriction0"} failed to deduce Step from MonitoringInfo: urn:"beam:metric:element_count:v1" type:"beam:metrics:sum_int64:v1" payload:"\x01" labels:{key:"PCOLLECTION" value:"MJhtRKUVhwExternal/KafkaIO.Read/KafkaIO.Read.ReadFromKafkaViaUnbounded/Read(KafkaUnboundedSource)/Create/Read(CreateSource)/ParDo(OutputSingleSource)/ParMultiDo(OutputSingleSource).output/SplitAndSize0"} failed to deduce Step from MonitoringInfo: urn:"beam:metric:sampled_byte_size:v1" type:"beam:metrics:distribution_int64:v1" payload:"\x01\xc9A\xc9A\xc9A" labels:{key:"PCOLLECTION" value:"MJhtRKUVhwExternal/KafkaIO.Read/KafkaIO.Read.ReadFromKafkaViaUnbounded/Read(KafkaUnboundedSource)/Create/Read(CreateSource)/ParDo(OutputSingleSource)/ParMultiDo(OutputSingleSource).output/SplitAndSize0"}]
--- PASS: TestKafkaIO_BasicReadWrite (46.12s)
PASS
ok github.com/apache/beam/sdks/v2/go/test/integration/io/xlang/kafka 49.146s
FAIL
> Task :runners:spark:2:job-server:validatesCrossLanguageRunnerGoUsingJava FAILED
> Task :runners:spark:2:job-server:validatesCrossLanguageRunnerJavaUsingJava
> Task :runners:spark:2:job-server:validatesCrossLanguageRunnerJavaUsingPython
> Task :runners:spark:2:job-server:validatesCrossLanguageRunnerJavaUsingPythonOnly
> Task :runners:spark:2:job-server:validatesCrossLanguageRunnerPythonUsingJava
> Task :runners:spark:2:job-server:validatesCrossLanguageRunnerPythonUsingPython
> Task :runners:spark:2:job-server:validatesCrossLanguageRunnerPythonUsingSql
> Task :runners:spark:2:job-server:validatesCrossLanguageRunnerCleanup
> Task :runners:spark:2:job-server:sparkJobServerCleanup
FAILURE: Build failed with an exception.
* Where:
Build file '<https://ci-beam.apache.org/job/beam_PostCommit_XVR_Spark/ws/src/sdks/go/test/build.gradle'> line: 176
* What went wrong:
Execution failed for task ':runners:spark:2:job-server:validatesCrossLanguageRunnerGoUsingJava'.
> Process 'command 'sh'' finished with non-zero exit value 1
* Try:
> Run with --stacktrace option to get the stack trace.
> Run with --info or --debug option to get more log output.
> Run with --scan to get full insights.
* Get more help at https://help.gradle.org
Deprecated Gradle features were used in this build, making it incompatible with Gradle 8.0.
You can use '--warning-mode all' to show the individual deprecation warnings and determine if they come from your own scripts or plugins.
See https://docs.gradle.org/7.3.2/userguide/command_line_interface.html#sec:command_line_warnings
Execution optimizations have been disabled for 1 invalid unit(s) of work during this build to ensure correctness.
Please consult deprecation warnings for more details.
BUILD FAILED in 38m 7s
250 actionable tasks: 172 executed, 67 from cache, 11 up-to-date
Publishing build scan...
https://gradle.com/s/esmvfk5wclbri
Build step 'Invoke Gradle script' changed build result to FAILURE
Build step 'Invoke Gradle script' marked build as failure
---------------------------------------------------------------------
To unsubscribe, e-mail: builds-unsubscribe@beam.apache.org
For additional commands, e-mail: builds-help@beam.apache.org
Build failed in Jenkins: beam_PostCommit_XVR_Spark #3350
Posted by Apache Jenkins Server <je...@builds.apache.org>.
See <https://ci-beam.apache.org/job/beam_PostCommit_XVR_Spark/3350/display/redirect?page=changes>
Changes:
[Valentyn Tymofieiev] Add a container for Python 3.9.
[Valentyn Tymofieiev] Allow job submission with Python 3.9 on Dataflow runner
[Valentyn Tymofieiev] Add Python 3.9 test suites. Keep Dataflow V1 suites unchanged for now.
[Valentyn Tymofieiev] Add py3.9 Github actions suites.
[Valentyn Tymofieiev] Py39 Doc updates.
[Valentyn Tymofieiev] [BEAM-9980] Simplify run_validates_container.sh to avoid branching.
[Valentyn Tymofieiev] Update Cython to a new version that has py39 wheels.
[Valentyn Tymofieiev] [BEAM-13845] Fix comparison with potentially incomparable default
[Valentyn Tymofieiev] [BEAM-12920] Assume that bare generators types define simple generators.
[Valentyn Tymofieiev] Mark Python 3.9 as supported version.
[Valentyn Tymofieiev] [BEAM-13868] Remove gsutil dep from hdfs IT test.
[noreply] [BEAM-13867] Drop NaNs returned by nlargest in flight_delays example
[noreply] Announce Python 3.9 in CHANGES.md (#16802)
[Brian Hulette] Moving to 2.38.0-SNAPSHOT on master branch.
[noreply] [BEAM-11095] Better error handling for iter/reiter/multimap (#16794)
------------------------------------------
[...truncated 855.17 KB...]
value: <
spec: <
urn: "beam:coders:javasdk:0.1"
payload: "\202SNAPPY\000\000\000\000\001\000\000\000\001\000\000\001h\364\004\320\254\355\000\005sr\000Corg.apache.beam.sdk.values.ValueWithRecordId$B\022\000LCoder{\343\376bQ\014\204>\002\000\002L\000\007i\t\025\034t\000+Lorg/\t\\\000/\001\\\024/sdk/c\0012(s/ByteArray\005B\014;L\000\n\005u\005\016\010t\000\"n;\000\005$\020;xr\000*N\274\000\t`(.Structured\005/8s\277\022\016\325\3246\021\002\000\000xr\000 j9\000\005/\034C\335\325\211\256\274~\370\001/\020psr\000)j1\0006\312\000\034\351\277\005|\263\3746\333\001:\010r\000&j8\000\024Atomic\005o\034\307\354\265\314\205tPF\0015 q\000~\000\003sr\000-N;\000$io.kafka.K\001\006\000R%\227\005B<I\320\251Y\032\341{#\002\000\001L\000\007kv\005\025\010t\000$nH\001\000K\t&\000;\025s\000\"Ns\000-P\r- j\000\275\271\035\243\3126\002!\353\010\010ke)\277\001\264\000\0022\303\001\005\022\rY$q\000~\000\006q\000~\000\016"
>
>
>
coders: <
key: "KlpaDRnnRMVarIntCoder"
value: <
spec: <
urn: "beam:coders:javasdk:0.1"
payload: "\202SNAPPY\000\000\000\000\001\000\000\000\001\000\000\000\210\330\001\350\254\355\000\005sr\000&org.apache.beam.sdk.coders.VarIntCoder\300K2\332\251KVh\002\000\000xrr5\000\024Atomic\0055 \307\354\265\314\205tPF\002\0055\000*jj\000$Structured\0059\034s\277\022\016\325\3246\021\t9\000 j9\000\005/0C\335\325\211\256\274~\370\002\000\000xp"
>
>
>
coders: <
key: "KlpaDRnnRMVoidCoder"
value: <
spec: <
urn: "beam:coders:javasdk:0.1"
payload: "\202SNAPPY\000\000\000\000\001\000\000\000\001\000\000\000\210\326\001\350\254\355\000\005sr\000$org.apache.beam.sdk.coders.VoidCoder\271\277U\233\350\r\257U\002\000\000xr\000&j3\000\024Atomic\0055 \307\354\265\314\205tPF\002\0055\000*j5\000$Structured\0059\034s\277\022\016\325\3246\021\t9\000 j9\000\005/0C\335\325\211\256\274~\370\002\000\000xp"
>
>
>
coders: <
key: "c0"
value: <
spec: <
urn: "beam:coder:bytes:v1"
>
>
>
coders: <
key: "c1"
value: <
spec: <
urn: "beam:coder:global_window:v1"
>
>
>
coders: <
key: "c2"
value: <
spec: <
urn: "beam:go:coder:custom:v1"
payload: "Cgd2YXJpbnR6EgIIAhpdCklnaXRodWIuY29tL2FwYWNoZS9iZWFtL3Nka3MvdjIvZ28vcGtnL2JlYW0vY29yZS9ydW50aW1lL2NvZGVyeC5lbmNWYXJJbnRaEhAIFiIECBlADyoGCBQSAggIImkKSWdpdGh1Yi5jb20vYXBhY2hlL2JlYW0vc2Rrcy92Mi9nby9wa2cvYmVhbS9jb3JlL3J1bnRpbWUvY29kZXJ4LmRlY1ZhckludFoSHAgWIgQIGUADIgYIFBICCAgqBAgZQA8qBAgZQAE="
>
>
>
coders: <
key: "c3"
value: <
spec: <
urn: "beam:coder:length_prefix:v1"
>
component_coder_ids: "c2"
>
>
coders: <
key: "c4"
value: <
spec: <
urn: "beam:coder:kv:v1"
>
component_coder_ids: "c0"
component_coder_ids: "c0"
>
>
environments: <
key: "KlpaDRnnRMbeam:env:docker:v1"
value: <
urn: "beam:env:docker:v1"
payload: "\n apache/beam_java8_sdk:2.38.0.dev"
capabilities: "beam:coder:bytes:v1"
capabilities: "beam:coder:bool:v1"
capabilities: "beam:coder:varint:v1"
capabilities: "beam:coder:string_utf8:v1"
capabilities: "beam:coder:iterable:v1"
capabilities: "beam:coder:timer:v1"
capabilities: "beam:coder:kv:v1"
capabilities: "beam:coder:length_prefix:v1"
capabilities: "beam:coder:global_window:v1"
capabilities: "beam:coder:interval_window:v1"
capabilities: "beam:coder:custom_window:v1"
capabilities: "beam:coder:windowed_value:v1"
capabilities: "beam:coder:double:v1"
capabilities: "beam:coder:row:v1"
capabilities: "beam:coder:param_windowed_value:v1"
capabilities: "beam:coder:state_backed_iterable:v1"
capabilities: "beam:coder:sharded_key:v1"
capabilities: "beam:protocol:multi_core_bundle_processing:v1"
capabilities: "beam:protocol:progress_reporting:v1"
capabilities: "beam:protocol:harness_monitoring_infos:v1"
capabilities: "beam:protocol:control_request_elements_embedding:v1"
capabilities: "beam:protocol:state_caching:v1"
capabilities: "beam:version:sdk_base:apache/beam_java8_sdk:2.38.0.dev"
capabilities: "beam:transform:sdf_truncate_sized_restrictions:v1"
capabilities: "beam:transform:to_string:v1"
dependencies: <
type_urn: "beam:artifact:type:file:v1"
type_payload: "\nL/tmp/artifacts/icedtea-sound-ebvtNFkfFXg4aaYFuDnwKpwDSjzsaZqlqv5iKxPTr-U.jar\022@79bbed34591f15783869a605b839f02a9c034a3cec699aa5aafe622b13d3afe5"
role_urn: "beam:artifact:role:staging_to:v1"
role_payload: "\n=icedtea-sound-ebvtNFkfFXg4aaYFuDnwKpwDSjzsaZqlqv5iKxPTr-U.jar"
>
dependencies: <
type_urn: "beam:artifact:type:file:v1"
type_payload: "\nF/tmp/artifacts/jaccess-ULFTCPsb6cLYZ0f1BG1FQfczmHNaZCx8plXuRDKpBqE.jar\022@50b15308fb1be9c2d86747f5046d4541f73398735a642c7ca655ee4432a906a1"
role_urn: "beam:artifact:role:staging_to:v1"
role_payload: "\n7jaccess-ULFTCPsb6cLYZ0f1BG1FQfczmHNaZCx8plXuRDKpBqE.jar"
>
dependencies: <
type_urn: "beam:artifact:type:file:v1"
type_payload: "\nI/tmp/artifacts/localedata-dUHqyGxaTVCjfTI8MckPYarZ3_mwf62udkxaHi1aKns.jar\022@7541eac86c5a4d50a37d323c31c90f61aad9dff9b07fadae764c5a1e2d5a2a7b"
role_urn: "beam:artifact:role:staging_to:v1"
role_payload: "\n:localedata-dUHqyGxaTVCjfTI8MckPYarZ3_mwf62udkxaHi1aKns.jar"
>
dependencies: <
type_urn: "beam:artifact:type:file:v1"
type_payload: "\nF/tmp/artifacts/nashorn-XdUndQGroXOP9NCsfITpBERYcbbGXVHLjbvNWXCh-3A.jar\022@5dd5277501aba1738ff4d0ac7c84e904445871b6c65d51cb8dbbcd5970a1fb70"
role_urn: "beam:artifact:role:staging_to:v1"
role_payload: "\n7nashorn-XdUndQGroXOP9NCsfITpBERYcbbGXVHLjbvNWXCh-3A.jar"
>
dependencies: <
type_urn: "beam:artifact:type:file:v1"
type_payload: "\nG/tmp/artifacts/cldrdata-YqzuKX1QnLCOo0cwjKRdBhGrip_ltIJZg-APT60tUPA.jar\022@62acee297d509cb08ea347308ca45d0611ab8a9fe5b4825983e00f4fad2d50f0"
role_urn: "beam:artifact:role:staging_to:v1"
role_payload: "\n8cldrdata-YqzuKX1QnLCOo0cwjKRdBhGrip_ltIJZg-APT60tUPA.jar"
>
dependencies: <
type_urn: "beam:artifact:type:file:v1"
type_payload: "\nD/tmp/artifacts/dnsns-dhEp186udEF6X6chZus-RJzWRmzlccxx1_btlXWayVI.jar\022@761129d7ceae74417a5fa72166eb3e449cd6466ce571cc71d7f6ed95759ac952"
role_urn: "beam:artifact:role:staging_to:v1"
role_payload: "\n5dnsns-dhEp186udEF6X6chZus-RJzWRmzlccxx1_btlXWayVI.jar"
>
dependencies: <
type_urn: "beam:artifact:type:file:v1"
type_payload: "\nr/tmp/artifacts/beam-sdks-java-io-expansion-service-2.38.0-SNAPSHOT-_6Tx1PpVR2h5k2-Ebq-7KCkuK0OHMaQvrgZ6-7rb-tA.jar\022@ffa4f1d4fa55476879936f846eafbb28292e2b438731a42fae067afbbadbfad0"
role_urn: "beam:artifact:role:staging_to:v1"
role_payload: "\ncbeam-sdks-java-io-expansion-service-2.38.0-SNAPSHOT-_6Tx1PpVR2h5k2-Ebq-7KCkuK0OHMaQvrgZ6-7rb-tA.jar"
>
>
>
environments: <
key: "go"
value: <
urn: "beam:env:docker:v1"
payload: "\n\026apache/beam_go_sdk:dev"
capabilities: "beam:protocol:progress_reporting:v0"
capabilities: "beam:protocol:multi_core_bundle_processing:v1"
capabilities: "beam:version:sdk_base:go"
capabilities: "beam:coder:bytes:v1"
capabilities: "beam:coder:bool:v1"
capabilities: "beam:coder:varint:v1"
capabilities: "beam:coder:double:v1"
capabilities: "beam:coder:string_utf8:v1"
capabilities: "beam:coder:length_prefix:v1"
capabilities: "beam:coder:kv:v1"
capabilities: "beam:coder:iterable:v1"
capabilities: "beam:coder:state_backed_iterable:v1"
capabilities: "beam:coder:windowed_value:v1"
capabilities: "beam:coder:global_window:v1"
capabilities: "beam:coder:interval_window:v1"
capabilities: "beam:coder:row:v1"
dependencies: <
type_urn: "beam:artifact:type:file:v1"
role_urn: "beam:artifact:role:go_worker_binary:v1"
>
>
>
>
root_transform_ids: "s1"
root_transform_ids: "e4"
root_transform_ids: "e5"
root_transform_ids: "s3"
requirements: "beam:requirement:pardo:splittable_dofn:v1"
2022/02/10 06:29:16 Cross-compiling <https://ci-beam.apache.org/job/beam_PostCommit_XVR_Spark/ws/src/sdks/go/test/integration/io/xlang/kafka/kafka_test.go> as /tmp/worker-2-1644474556307238083
2022/02/10 06:29:17 Prepared job with id: go-testkafkaio_basicreadwrite_c63aec63-81c0-4024-a9c6-a0e95b2ded5b and staging token: go-testkafkaio_basicreadwrite_c63aec63-81c0-4024-a9c6-a0e95b2ded5b
2022/02/10 06:29:17 Staged binary artifact with token:
2022/02/10 06:29:17 Submitted job: go0testkafkaio0basicreadwrite-jenkins-0210062917-dfa59679_0d04ed15-41f5-43a4-8594-d3c57905e04f
2022/02/10 06:29:17 Job state: STOPPED
2022/02/10 06:29:17 Job state: STARTING
2022/02/10 06:29:17 Job state: RUNNING
2022/02/10 06:29:49 Job state: DONE
2022/02/10 06:29:49 Warning: 6 errors during metrics processing: [failed to deduce Step from MonitoringInfo: urn:"beam:metric:element_count:v1" type:"beam:metrics:sum_int64:v1" payload:"\x01" labels:{key:"PCOLLECTION" value:"KlpaDRnnRMExternal/KafkaIO.Read/KafkaIO.Read.ReadFromKafkaViaUnbounded/Read(KafkaUnboundedSource)/Create/Read(CreateSource)/ParDo(OutputSingleSource)/ParMultiDo(OutputSingleSource).output/SplitAndSize0"} failed to deduce Step from MonitoringInfo: urn:"beam:metric:sampled_byte_size:v1" type:"beam:metrics:distribution_int64:v1" payload:"\x01\xc9A\xc9A\xc9A" labels:{key:"PCOLLECTION" value:"KlpaDRnnRMExternal/KafkaIO.Read/KafkaIO.Read.ReadFromKafkaViaUnbounded/Read(KafkaUnboundedSource)/Create/Read(CreateSource)/ParDo(OutputSingleSource)/ParMultiDo(OutputSingleSource).output/SplitAndSize0"} failed to deduce Step from MonitoringInfo: urn:"beam:metric:element_count:v1" type:"beam:metrics:sum_int64:v1" payload:"\x01" labels:{key:"PCOLLECTION" value:"KlpaDRnnRMExternal/KafkaIO.Read/KafkaIO.Read.ReadFromKafkaViaUnbounded/Read(KafkaUnboundedSource)/Create/Read(CreateSource)/ParDo(OutputSingleSource)/ParMultiDo(OutputSingleSource).output/SplitAndSize0"} failed to deduce Step from MonitoringInfo: urn:"beam:metric:element_count:v1" type:"beam:metrics:sum_int64:v1" payload:"\x01" labels:{key:"PCOLLECTION" value:"KlpaDRnnRMExternal/KafkaIO.Read/KafkaIO.Read.ReadFromKafkaViaUnbounded/Read(KafkaUnboundedSource)/Create/Read(CreateSource)/ParDo(OutputSingleSource)/ParMultiDo(OutputSingleSource).output/PairWithRestriction0"} failed to deduce Step from MonitoringInfo: urn:"beam:metric:sampled_byte_size:v1" type:"beam:metrics:distribution_int64:v1" payload:"\x01\xc9A\xc9A\xc9A" labels:{key:"PCOLLECTION" value:"KlpaDRnnRMExternal/KafkaIO.Read/KafkaIO.Read.ReadFromKafkaViaUnbounded/Read(KafkaUnboundedSource)/Create/Read(CreateSource)/ParDo(OutputSingleSource)/ParMultiDo(OutputSingleSource).output/SplitAndSize0"} failed to deduce Step from MonitoringInfo: urn:"beam:metric:sampled_byte_size:v1" type:"beam:metrics:distribution_int64:v1" payload:"\x01\xbcA\xbcA\xbcA" labels:{key:"PCOLLECTION" value:"KlpaDRnnRMExternal/KafkaIO.Read/KafkaIO.Read.ReadFromKafkaViaUnbounded/Read(KafkaUnboundedSource)/Create/Read(CreateSource)/ParDo(OutputSingleSource)/ParMultiDo(OutputSingleSource).output/PairWithRestriction0"}]
--- PASS: TestKafkaIO_BasicReadWrite (47.72s)
PASS
ok github.com/apache/beam/sdks/v2/go/test/integration/io/xlang/kafka 50.747s
FAIL
> Task :runners:spark:2:job-server:validatesCrossLanguageRunnerGoUsingJava FAILED
> Task :runners:spark:2:job-server:validatesCrossLanguageRunnerJavaUsingJava
> Task :runners:spark:2:job-server:validatesCrossLanguageRunnerJavaUsingPython
> Task :runners:spark:2:job-server:validatesCrossLanguageRunnerJavaUsingPythonOnly
> Task :runners:spark:2:job-server:validatesCrossLanguageRunnerPythonUsingJava
> Task :runners:spark:2:job-server:validatesCrossLanguageRunnerPythonUsingPython
> Task :runners:spark:2:job-server:validatesCrossLanguageRunnerPythonUsingSql
> Task :runners:spark:2:job-server:validatesCrossLanguageRunnerPythonUsingSql FAILED
> Task :runners:spark:2:job-server:validatesCrossLanguageRunnerCleanup
> Task :runners:spark:2:job-server:sparkJobServerCleanup
FAILURE: Build completed with 2 failures.
1: Task failed with an exception.
-----------
* Where:
Build file '<https://ci-beam.apache.org/job/beam_PostCommit_XVR_Spark/ws/src/sdks/go/test/build.gradle'> line: 176
* What went wrong:
Execution failed for task ':runners:spark:2:job-server:validatesCrossLanguageRunnerGoUsingJava'.
> Process 'command 'sh'' finished with non-zero exit value 1
* Try:
> Run with --stacktrace option to get the stack trace.
> Run with --info or --debug option to get more log output.
> Run with --scan to get full insights.
==============================================================================
2: Task failed with an exception.
-----------
* What went wrong:
Execution failed for task ':runners:spark:2:job-server:validatesCrossLanguageRunnerPythonUsingSql'.
> Process 'command 'sh'' finished with non-zero exit value 1
* Try:
> Run with --stacktrace option to get the stack trace.
> Run with --info or --debug option to get more log output.
> Run with --scan to get full insights.
==============================================================================
* Get more help at https://help.gradle.org
Deprecated Gradle features were used in this build, making it incompatible with Gradle 8.0.
You can use '--warning-mode all' to show the individual deprecation warnings and determine if they come from your own scripts or plugins.
See https://docs.gradle.org/7.3.2/userguide/command_line_interface.html#sec:command_line_warnings
Execution optimizations have been disabled for 1 invalid unit(s) of work during this build to ensure correctness.
Please consult deprecation warnings for more details.
BUILD FAILED in 36m 11s
250 actionable tasks: 171 executed, 68 from cache, 11 up-to-date
Publishing build scan...
https://gradle.com/s/fcoxml2gyhnfw
Build step 'Invoke Gradle script' changed build result to FAILURE
Build step 'Invoke Gradle script' marked build as failure
---------------------------------------------------------------------
To unsubscribe, e-mail: builds-unsubscribe@beam.apache.org
For additional commands, e-mail: builds-help@beam.apache.org
Build failed in Jenkins: beam_PostCommit_XVR_Spark #3349
Posted by Apache Jenkins Server <je...@builds.apache.org>.
See <https://ci-beam.apache.org/job/beam_PostCommit_XVR_Spark/3349/display/redirect?page=changes>
Changes:
[david.prieto.rivera] Missing contribution
[noreply] Merge pull request #15848 from [BEAM-13835] An any-type implementation
[Valentyn Tymofieiev] [BEAM-12920] Assume that bare generators types define simple generators.
[noreply] [release-2.36.0][website] Fix github release notes script, header for
[noreply] Use shell to run python for setupVirtualenv (#16796)
[Daniel Oliveira] [BEAM-13830] Properly shut down Debezium expansion service in IT script.
[noreply] Merge pull request #16659 from [BEAM-13774][Playground] Add user to
[noreply] [BEAM-13776][Playground] (#16731)
------------------------------------------
[...truncated 466.82 KB...]
urn: "beam:coders:javasdk:0.1"
payload: "\202SNAPPY\000\000\000\000\001\000\000\000\001\000\000\000\312\214\002\360^\254\355\000\005sr\000,org.apache.beam.sdk.coders.SerializableCoder\010\364 \216\305ynl\002\000\001L\000\004typet\000\021Ljava/lang/Class;xr\000&ofV\000\024Custom\005P8j\260\010\235\013;\035\013\002\000\000xr\000 j\213\000\005/\034C\335\325\211\256\274~\370\001/\020pvr\000;N1\000Pio.BoundedReadFromUnb\t\021`Source$Shardd\236\240U\205\000j\363\002\000\000xp"
>
>
>
coders: <
key: "aGStfsMlwjTimestampedValueCoder"
value: <
spec: <
urn: "beam:coders:javasdk:0.1"
payload: "\202SNAPPY\000\000\000\000\001\000\000\000\001\000\000\001?\315\003\270\254\355\000\005sr\000Aorg.apache.beam.sdk.values.TimestampedV\001\022\000$>\021\000LCoder\364\376\202p\274iX-\002\000\001L\000\nv\001)\005\030\034t\000\"Lorg/\t]\000/\001],/sdk/coders/\005$\020;xr\000*N\202\000\t%(.Structured\005/8s\277\022\016\325\3246\021\002\000\000xr\000 j9\000\005/\034C\335\325\211\256\274~\370\001/\020psr\000,j1\000(Serializabl\t\277\034\010\364 \216\305ynl\005\327\\\004typet\000\021Ljava/lang/Class\001\300\000&jV\000\024Custom\005\215Pj\260\010\235\013;\035\013\002\000\000xq\000~\000\003vr\000;N;\000Pio.BoundedReadFromUnb\t\021`Source$Shardd\236\240U\205\000j\363\002\000\000xp"
>
>
>
coders: <
key: "aGStfsMlwjValueWithRecordIdCoder"
value: <
spec: <
urn: "beam:coders:javasdk:0.1"
payload: "\202SNAPPY\000\000\000\000\001\000\000\000\001\000\000\001h\364\004\320\254\355\000\005sr\000Corg.apache.beam.sdk.values.ValueWithRecordId$B\022\000LCoder{\343\376bQ\014\204>\002\000\002L\000\007i\t\025\034t\000+Lorg/\t\\\000/\001\\\024/sdk/c\0012(s/ByteArray\005B\014;L\000\n\005u\005\016\010t\000\"n;\000\005$\020;xr\000*N\274\000\t`(.Structured\005/8s\277\022\016\325\3246\021\002\000\000xr\000 j9\000\005/\034C\335\325\211\256\274~\370\001/\020psr\000)j1\0006\312\000\034\351\277\005|\263\3746\333\001:\010r\000&j8\000\024Atomic\005o\034\307\354\265\314\205tPF\0015 q\000~\000\003sr\000-N;\000$io.kafka.K\001\006\000R%\227\005B<I\320\251Y\032\341{#\002\000\001L\000\007kv\005\025\010t\000$nH\001\000K\t&\000;\025s\000\"Ns\000-P\r- j\000\275\271\035\243\3126\002!\353\010\010ke)\277\001\264\000\0022\303\001\005\022\rY$q\000~\000\006q\000~\000\016"
>
>
>
coders: <
key: "aGStfsMlwjVarIntCoder"
value: <
spec: <
urn: "beam:coders:javasdk:0.1"
payload: "\202SNAPPY\000\000\000\000\001\000\000\000\001\000\000\000\210\330\001\350\254\355\000\005sr\000&org.apache.beam.sdk.coders.VarIntCoder\300K2\332\251KVh\002\000\000xrr5\000\024Atomic\0055 \307\354\265\314\205tPF\002\0055\000*jj\000$Structured\0059\034s\277\022\016\325\3246\021\t9\000 j9\000\005/0C\335\325\211\256\274~\370\002\000\000xp"
>
>
>
coders: <
key: "aGStfsMlwjVoidCoder"
value: <
spec: <
urn: "beam:coders:javasdk:0.1"
payload: "\202SNAPPY\000\000\000\000\001\000\000\000\001\000\000\000\210\326\001\350\254\355\000\005sr\000$org.apache.beam.sdk.coders.VoidCoder\271\277U\233\350\r\257U\002\000\000xr\000&j3\000\024Atomic\0055 \307\354\265\314\205tPF\002\0055\000*j5\000$Structured\0059\034s\277\022\016\325\3246\021\t9\000 j9\000\005/0C\335\325\211\256\274~\370\002\000\000xp"
>
>
>
coders: <
key: "c0"
value: <
spec: <
urn: "beam:coder:bytes:v1"
>
>
>
coders: <
key: "c1"
value: <
spec: <
urn: "beam:coder:global_window:v1"
>
>
>
coders: <
key: "c2"
value: <
spec: <
urn: "beam:go:coder:custom:v1"
payload: "Cgd2YXJpbnR6EgIIAhpdCklnaXRodWIuY29tL2FwYWNoZS9iZWFtL3Nka3MvdjIvZ28vcGtnL2JlYW0vY29yZS9ydW50aW1lL2NvZGVyeC5lbmNWYXJJbnRaEhAIFiIECBlADyoGCBQSAggIImkKSWdpdGh1Yi5jb20vYXBhY2hlL2JlYW0vc2Rrcy92Mi9nby9wa2cvYmVhbS9jb3JlL3J1bnRpbWUvY29kZXJ4LmRlY1ZhckludFoSHAgWIgQIGUADIgYIFBICCAgqBAgZQA8qBAgZQAE="
>
>
>
coders: <
key: "c3"
value: <
spec: <
urn: "beam:coder:length_prefix:v1"
>
component_coder_ids: "c2"
>
>
coders: <
key: "c4"
value: <
spec: <
urn: "beam:coder:kv:v1"
>
component_coder_ids: "c0"
component_coder_ids: "c0"
>
>
environments: <
key: "aGStfsMlwjbeam:env:docker:v1"
value: <
urn: "beam:env:docker:v1"
payload: "\n apache/beam_java8_sdk:2.37.0.dev"
capabilities: "beam:coder:bytes:v1"
capabilities: "beam:coder:bool:v1"
capabilities: "beam:coder:varint:v1"
capabilities: "beam:coder:string_utf8:v1"
capabilities: "beam:coder:iterable:v1"
capabilities: "beam:coder:timer:v1"
capabilities: "beam:coder:kv:v1"
capabilities: "beam:coder:length_prefix:v1"
capabilities: "beam:coder:global_window:v1"
capabilities: "beam:coder:interval_window:v1"
capabilities: "beam:coder:custom_window:v1"
capabilities: "beam:coder:windowed_value:v1"
capabilities: "beam:coder:double:v1"
capabilities: "beam:coder:row:v1"
capabilities: "beam:coder:param_windowed_value:v1"
capabilities: "beam:coder:state_backed_iterable:v1"
capabilities: "beam:coder:sharded_key:v1"
capabilities: "beam:protocol:multi_core_bundle_processing:v1"
capabilities: "beam:protocol:progress_reporting:v1"
capabilities: "beam:protocol:harness_monitoring_infos:v1"
capabilities: "beam:protocol:control_request_elements_embedding:v1"
capabilities: "beam:protocol:state_caching:v1"
capabilities: "beam:version:sdk_base:apache/beam_java8_sdk:2.37.0.dev"
capabilities: "beam:transform:sdf_truncate_sized_restrictions:v1"
capabilities: "beam:transform:to_string:v1"
dependencies: <
type_urn: "beam:artifact:type:file:v1"
type_payload: "\nL/tmp/artifacts/icedtea-sound-ebvtNFkfFXg4aaYFuDnwKpwDSjzsaZqlqv5iKxPTr-U.jar\022@79bbed34591f15783869a605b839f02a9c034a3cec699aa5aafe622b13d3afe5"
role_urn: "beam:artifact:role:staging_to:v1"
role_payload: "\n=icedtea-sound-ebvtNFkfFXg4aaYFuDnwKpwDSjzsaZqlqv5iKxPTr-U.jar"
>
dependencies: <
type_urn: "beam:artifact:type:file:v1"
type_payload: "\nF/tmp/artifacts/jaccess-ULFTCPsb6cLYZ0f1BG1FQfczmHNaZCx8plXuRDKpBqE.jar\022@50b15308fb1be9c2d86747f5046d4541f73398735a642c7ca655ee4432a906a1"
role_urn: "beam:artifact:role:staging_to:v1"
role_payload: "\n7jaccess-ULFTCPsb6cLYZ0f1BG1FQfczmHNaZCx8plXuRDKpBqE.jar"
>
dependencies: <
type_urn: "beam:artifact:type:file:v1"
type_payload: "\nI/tmp/artifacts/localedata-dUHqyGxaTVCjfTI8MckPYarZ3_mwf62udkxaHi1aKns.jar\022@7541eac86c5a4d50a37d323c31c90f61aad9dff9b07fadae764c5a1e2d5a2a7b"
role_urn: "beam:artifact:role:staging_to:v1"
role_payload: "\n:localedata-dUHqyGxaTVCjfTI8MckPYarZ3_mwf62udkxaHi1aKns.jar"
>
dependencies: <
type_urn: "beam:artifact:type:file:v1"
type_payload: "\nF/tmp/artifacts/nashorn-XdUndQGroXOP9NCsfITpBERYcbbGXVHLjbvNWXCh-3A.jar\022@5dd5277501aba1738ff4d0ac7c84e904445871b6c65d51cb8dbbcd5970a1fb70"
role_urn: "beam:artifact:role:staging_to:v1"
role_payload: "\n7nashorn-XdUndQGroXOP9NCsfITpBERYcbbGXVHLjbvNWXCh-3A.jar"
>
dependencies: <
type_urn: "beam:artifact:type:file:v1"
type_payload: "\nG/tmp/artifacts/cldrdata-YqzuKX1QnLCOo0cwjKRdBhGrip_ltIJZg-APT60tUPA.jar\022@62acee297d509cb08ea347308ca45d0611ab8a9fe5b4825983e00f4fad2d50f0"
role_urn: "beam:artifact:role:staging_to:v1"
role_payload: "\n8cldrdata-YqzuKX1QnLCOo0cwjKRdBhGrip_ltIJZg-APT60tUPA.jar"
>
dependencies: <
type_urn: "beam:artifact:type:file:v1"
type_payload: "\nD/tmp/artifacts/dnsns-dhEp186udEF6X6chZus-RJzWRmzlccxx1_btlXWayVI.jar\022@761129d7ceae74417a5fa72166eb3e449cd6466ce571cc71d7f6ed95759ac952"
role_urn: "beam:artifact:role:staging_to:v1"
role_payload: "\n5dnsns-dhEp186udEF6X6chZus-RJzWRmzlccxx1_btlXWayVI.jar"
>
dependencies: <
type_urn: "beam:artifact:type:file:v1"
type_payload: "\nr/tmp/artifacts/beam-sdks-java-io-expansion-service-2.37.0-SNAPSHOT-52l-U8moPJCxzLJn5NhsBAR757m1iYm8UsnOV74v-6Q.jar\022@e7697e53c9a83c90b1ccb267e4d86c04047be7b9b58989bc52c9ce57be2ffba4"
role_urn: "beam:artifact:role:staging_to:v1"
role_payload: "\ncbeam-sdks-java-io-expansion-service-2.37.0-SNAPSHOT-52l-U8moPJCxzLJn5NhsBAR757m1iYm8UsnOV74v-6Q.jar"
>
>
>
environments: <
key: "go"
value: <
urn: "beam:env:docker:v1"
payload: "\n\026apache/beam_go_sdk:dev"
capabilities: "beam:protocol:progress_reporting:v0"
capabilities: "beam:protocol:multi_core_bundle_processing:v1"
capabilities: "beam:version:sdk_base:go"
capabilities: "beam:coder:bytes:v1"
capabilities: "beam:coder:bool:v1"
capabilities: "beam:coder:varint:v1"
capabilities: "beam:coder:double:v1"
capabilities: "beam:coder:string_utf8:v1"
capabilities: "beam:coder:length_prefix:v1"
capabilities: "beam:coder:kv:v1"
capabilities: "beam:coder:iterable:v1"
capabilities: "beam:coder:state_backed_iterable:v1"
capabilities: "beam:coder:windowed_value:v1"
capabilities: "beam:coder:global_window:v1"
capabilities: "beam:coder:interval_window:v1"
capabilities: "beam:coder:row:v1"
dependencies: <
type_urn: "beam:artifact:type:file:v1"
role_urn: "beam:artifact:role:go_worker_binary:v1"
>
>
>
>
root_transform_ids: "s1"
root_transform_ids: "e4"
root_transform_ids: "e5"
root_transform_ids: "s3"
requirements: "beam:requirement:pardo:splittable_dofn:v1"
2022/02/10 00:46:03 Cross-compiling <https://ci-beam.apache.org/job/beam_PostCommit_XVR_Spark/ws/src/sdks/go/test/integration/io/xlang/kafka/kafka_test.go> as /tmp/worker-2-1644453963695209548
2022/02/10 00:46:12 Prepared job with id: go-testkafkaio_basicreadwrite_b257e307-12b9-49f8-9c02-c2d287c31c69 and staging token: go-testkafkaio_basicreadwrite_b257e307-12b9-49f8-9c02-c2d287c31c69
2022/02/10 00:46:13 Staged binary artifact with token:
2022/02/10 00:46:13 Submitted job: go0testkafkaio0basicreadwrite-jenkins-0210004613-940e61e0_f683c97d-77b7-44e4-a8ce-fb805ad2c915
2022/02/10 00:46:13 Job state: STOPPED
2022/02/10 00:46:13 Job state: STARTING
2022/02/10 00:46:13 Job state: RUNNING
2022/02/10 00:47:21 Job state: DONE
2022/02/10 00:47:21 Warning: 6 errors during metrics processing: [failed to deduce Step from MonitoringInfo: urn:"beam:metric:element_count:v1" type:"beam:metrics:sum_int64:v1" payload:"\x01" labels:{key:"PCOLLECTION" value:"aGStfsMlwjExternal/KafkaIO.Read/KafkaIO.Read.ReadFromKafkaViaUnbounded/Read(KafkaUnboundedSource)/Create/Read(CreateSource)/ParDo(OutputSingleSource)/ParMultiDo(OutputSingleSource).output/SplitAndSize0"} failed to deduce Step from MonitoringInfo: urn:"beam:metric:sampled_byte_size:v1" type:"beam:metrics:distribution_int64:v1" payload:"\x01\xc9A\xc9A\xc9A" labels:{key:"PCOLLECTION" value:"aGStfsMlwjExternal/KafkaIO.Read/KafkaIO.Read.ReadFromKafkaViaUnbounded/Read(KafkaUnboundedSource)/Create/Read(CreateSource)/ParDo(OutputSingleSource)/ParMultiDo(OutputSingleSource).output/SplitAndSize0"} failed to deduce Step from MonitoringInfo: urn:"beam:metric:element_count:v1" type:"beam:metrics:sum_int64:v1" payload:"\x01" labels:{key:"PCOLLECTION" value:"aGStfsMlwjExternal/KafkaIO.Read/KafkaIO.Read.ReadFromKafkaViaUnbounded/Read(KafkaUnboundedSource)/Create/Read(CreateSource)/ParDo(OutputSingleSource)/ParMultiDo(OutputSingleSource).output/PairWithRestriction0"} failed to deduce Step from MonitoringInfo: urn:"beam:metric:element_count:v1" type:"beam:metrics:sum_int64:v1" payload:"\x01" labels:{key:"PCOLLECTION" value:"aGStfsMlwjExternal/KafkaIO.Read/KafkaIO.Read.ReadFromKafkaViaUnbounded/Read(KafkaUnboundedSource)/Create/Read(CreateSource)/ParDo(OutputSingleSource)/ParMultiDo(OutputSingleSource).output/SplitAndSize0"} failed to deduce Step from MonitoringInfo: urn:"beam:metric:sampled_byte_size:v1" type:"beam:metrics:distribution_int64:v1" payload:"\x01\xc9A\xc9A\xc9A" labels:{key:"PCOLLECTION" value:"aGStfsMlwjExternal/KafkaIO.Read/KafkaIO.Read.ReadFromKafkaViaUnbounded/Read(KafkaUnboundedSource)/Create/Read(CreateSource)/ParDo(OutputSingleSource)/ParMultiDo(OutputSingleSource).output/SplitAndSize0"} failed to deduce Step from MonitoringInfo: urn:"beam:metric:sampled_byte_size:v1" type:"beam:metrics:distribution_int64:v1" payload:"\x01\xbcA\xbcA\xbcA" labels:{key:"PCOLLECTION" value:"aGStfsMlwjExternal/KafkaIO.Read/KafkaIO.Read.ReadFromKafkaViaUnbounded/Read(KafkaUnboundedSource)/Create/Read(CreateSource)/ParDo(OutputSingleSource)/ParMultiDo(OutputSingleSource).output/PairWithRestriction0"}]
--- PASS: TestKafkaIO_BasicReadWrite (134.67s)
PASS
ok github.com/apache/beam/sdks/v2/go/test/integration/io/xlang/kafka 137.788s
FAIL
> Task :runners:spark:2:job-server:validatesCrossLanguageRunnerGoUsingJava FAILED
> Task :runners:spark:2:job-server:validatesCrossLanguageRunnerJavaUsingJava
> Task :runners:spark:2:job-server:validatesCrossLanguageRunnerJavaUsingPython
> Task :runners:spark:2:job-server:validatesCrossLanguageRunnerJavaUsingPythonOnly
> Task :runners:spark:2:job-server:validatesCrossLanguageRunnerPythonUsingJava
> Task :runners:spark:2:job-server:validatesCrossLanguageRunnerPythonUsingPython
> Task :runners:spark:2:job-server:validatesCrossLanguageRunnerPythonUsingSql
> Task :runners:spark:2:job-server:validatesCrossLanguageRunnerCleanup
> Task :runners:spark:2:job-server:sparkJobServerCleanup
FAILURE: Build failed with an exception.
* Where:
Build file '<https://ci-beam.apache.org/job/beam_PostCommit_XVR_Spark/ws/src/sdks/go/test/build.gradle'> line: 176
* What went wrong:
Execution failed for task ':runners:spark:2:job-server:validatesCrossLanguageRunnerGoUsingJava'.
> Process 'command 'sh'' finished with non-zero exit value 1
* Try:
> Run with --stacktrace option to get the stack trace.
> Run with --info or --debug option to get more log output.
> Run with --scan to get full insights.
* Get more help at https://help.gradle.org
Deprecated Gradle features were used in this build, making it incompatible with Gradle 8.0.
You can use '--warning-mode all' to show the individual deprecation warnings and determine if they come from your own scripts or plugins.
See https://docs.gradle.org/7.3.2/userguide/command_line_interface.html#sec:command_line_warnings
Execution optimizations have been disabled for 1 invalid unit(s) of work during this build to ensure correctness.
Please consult deprecation warnings for more details.
BUILD FAILED in 1h 5m 51s
250 actionable tasks: 210 executed, 31 from cache, 9 up-to-date
Publishing build scan...
https://gradle.com/s/imnly2sgsfa5s
Build step 'Invoke Gradle script' changed build result to FAILURE
Build step 'Invoke Gradle script' marked build as failure
---------------------------------------------------------------------
To unsubscribe, e-mail: builds-unsubscribe@beam.apache.org
For additional commands, e-mail: builds-help@beam.apache.org
beam_PostCommit_XVR_Spark - Build # 3348 - Aborted!
Posted by Apache Jenkins Server <je...@builds.apache.org>.
beam_PostCommit_XVR_Spark - Build # 3348 - Aborted:
Check console output at https://ci-beam.apache.org/job/beam_PostCommit_XVR_Spark/3348/ to view the results.
beam_PostCommit_XVR_Spark - Build # 3347 - Aborted!
Posted by Apache Jenkins Server <je...@builds.apache.org>.
beam_PostCommit_XVR_Spark - Build # 3347 - Aborted:
Check console output at https://ci-beam.apache.org/job/beam_PostCommit_XVR_Spark/3347/ to view the results.
beam_PostCommit_XVR_Spark - Build # 3346 - Aborted!
Posted by Apache Jenkins Server <je...@builds.apache.org>.
beam_PostCommit_XVR_Spark - Build # 3346 - Aborted:
Check console output at https://ci-beam.apache.org/job/beam_PostCommit_XVR_Spark/3346/ to view the results.
beam_PostCommit_XVR_Spark - Build # 3345 - Aborted!
Posted by Apache Jenkins Server <je...@builds.apache.org>.
beam_PostCommit_XVR_Spark - Build # 3345 - Aborted:
Check console output at https://ci-beam.apache.org/job/beam_PostCommit_XVR_Spark/3345/ to view the results.
Build failed in Jenkins: beam_PostCommit_XVR_Spark #3344
Posted by Apache Jenkins Server <je...@builds.apache.org>.
See <https://ci-beam.apache.org/job/beam_PostCommit_XVR_Spark/3344/display/redirect?page=changes>
Changes:
[mmack] [BEAM-13246] Add support for S3 Bucket Key at the object level (AWS Sdk
[Pablo Estrada] Output successful rows from BQ Streaming Inserts
[schapman] BEAM-13439 Type annotation for ptransform_fn
[noreply] [BEAM-13606] Fail bundles with failed BigTable mutations (#16751)
------------------------------------------
[...truncated 873.54 KB...]
payload: "\202SNAPPY\000\000\000\000\001\000\000\000\001\000\000\000\210\330\001\350\254\355\000\005sr\000&org.apache.beam.sdk.coders.VarIntCoder\300K2\332\251KVh\002\000\000xrr5\000\024Atomic\0055 \307\354\265\314\205tPF\002\0055\000*jj\000$Structured\0059\034s\277\022\016\325\3246\021\t9\000 j9\000\005/0C\335\325\211\256\274~\370\002\000\000xp"
>
>
>
coders: <
key: "hFSZxJOYuQVoidCoder"
value: <
spec: <
urn: "beam:coders:javasdk:0.1"
payload: "\202SNAPPY\000\000\000\000\001\000\000\000\001\000\000\000\210\326\001\350\254\355\000\005sr\000$org.apache.beam.sdk.coders.VoidCoder\271\277U\233\350\r\257U\002\000\000xr\000&j3\000\024Atomic\0055 \307\354\265\314\205tPF\002\0055\000*j5\000$Structured\0059\034s\277\022\016\325\3246\021\t9\000 j9\000\005/0C\335\325\211\256\274~\370\002\000\000xp"
>
>
>
environments: <
key: "go"
value: <
urn: "beam:env:docker:v1"
payload: "\n\026apache/beam_go_sdk:dev"
capabilities: "beam:protocol:progress_reporting:v0"
capabilities: "beam:protocol:multi_core_bundle_processing:v1"
capabilities: "beam:version:sdk_base:go"
capabilities: "beam:coder:bytes:v1"
capabilities: "beam:coder:bool:v1"
capabilities: "beam:coder:varint:v1"
capabilities: "beam:coder:double:v1"
capabilities: "beam:coder:string_utf8:v1"
capabilities: "beam:coder:length_prefix:v1"
capabilities: "beam:coder:kv:v1"
capabilities: "beam:coder:iterable:v1"
capabilities: "beam:coder:state_backed_iterable:v1"
capabilities: "beam:coder:windowed_value:v1"
capabilities: "beam:coder:global_window:v1"
capabilities: "beam:coder:interval_window:v1"
capabilities: "beam:coder:row:v1"
dependencies: <
type_urn: "beam:artifact:type:file:v1"
role_urn: "beam:artifact:role:go_worker_binary:v1"
>
>
>
environments: <
key: "hFSZxJOYuQbeam:env:docker:v1"
value: <
urn: "beam:env:docker:v1"
payload: "\n apache/beam_java8_sdk:2.37.0.dev"
capabilities: "beam:coder:bytes:v1"
capabilities: "beam:coder:bool:v1"
capabilities: "beam:coder:varint:v1"
capabilities: "beam:coder:string_utf8:v1"
capabilities: "beam:coder:iterable:v1"
capabilities: "beam:coder:timer:v1"
capabilities: "beam:coder:kv:v1"
capabilities: "beam:coder:length_prefix:v1"
capabilities: "beam:coder:global_window:v1"
capabilities: "beam:coder:interval_window:v1"
capabilities: "beam:coder:custom_window:v1"
capabilities: "beam:coder:windowed_value:v1"
capabilities: "beam:coder:double:v1"
capabilities: "beam:coder:row:v1"
capabilities: "beam:coder:param_windowed_value:v1"
capabilities: "beam:coder:state_backed_iterable:v1"
capabilities: "beam:coder:sharded_key:v1"
capabilities: "beam:protocol:multi_core_bundle_processing:v1"
capabilities: "beam:protocol:progress_reporting:v1"
capabilities: "beam:protocol:harness_monitoring_infos:v1"
capabilities: "beam:protocol:control_request_elements_embedding:v1"
capabilities: "beam:protocol:state_caching:v1"
capabilities: "beam:version:sdk_base:apache/beam_java8_sdk:2.37.0.dev"
capabilities: "beam:transform:sdf_truncate_sized_restrictions:v1"
capabilities: "beam:transform:to_string:v1"
dependencies: <
type_urn: "beam:artifact:type:file:v1"
type_payload: "\nL/tmp/artifacts/icedtea-sound-ebvtNFkfFXg4aaYFuDnwKpwDSjzsaZqlqv5iKxPTr-U.jar\022@79bbed34591f15783869a605b839f02a9c034a3cec699aa5aafe622b13d3afe5"
role_urn: "beam:artifact:role:staging_to:v1"
role_payload: "\n=icedtea-sound-ebvtNFkfFXg4aaYFuDnwKpwDSjzsaZqlqv5iKxPTr-U.jar"
>
dependencies: <
type_urn: "beam:artifact:type:file:v1"
type_payload: "\nF/tmp/artifacts/jaccess-ULFTCPsb6cLYZ0f1BG1FQfczmHNaZCx8plXuRDKpBqE.jar\022@50b15308fb1be9c2d86747f5046d4541f73398735a642c7ca655ee4432a906a1"
role_urn: "beam:artifact:role:staging_to:v1"
role_payload: "\n7jaccess-ULFTCPsb6cLYZ0f1BG1FQfczmHNaZCx8plXuRDKpBqE.jar"
>
dependencies: <
type_urn: "beam:artifact:type:file:v1"
type_payload: "\nI/tmp/artifacts/localedata-dUHqyGxaTVCjfTI8MckPYarZ3_mwf62udkxaHi1aKns.jar\022@7541eac86c5a4d50a37d323c31c90f61aad9dff9b07fadae764c5a1e2d5a2a7b"
role_urn: "beam:artifact:role:staging_to:v1"
role_payload: "\n:localedata-dUHqyGxaTVCjfTI8MckPYarZ3_mwf62udkxaHi1aKns.jar"
>
dependencies: <
type_urn: "beam:artifact:type:file:v1"
type_payload: "\nF/tmp/artifacts/nashorn-XdUndQGroXOP9NCsfITpBERYcbbGXVHLjbvNWXCh-3A.jar\022@5dd5277501aba1738ff4d0ac7c84e904445871b6c65d51cb8dbbcd5970a1fb70"
role_urn: "beam:artifact:role:staging_to:v1"
role_payload: "\n7nashorn-XdUndQGroXOP9NCsfITpBERYcbbGXVHLjbvNWXCh-3A.jar"
>
dependencies: <
type_urn: "beam:artifact:type:file:v1"
type_payload: "\nG/tmp/artifacts/cldrdata-YqzuKX1QnLCOo0cwjKRdBhGrip_ltIJZg-APT60tUPA.jar\022@62acee297d509cb08ea347308ca45d0611ab8a9fe5b4825983e00f4fad2d50f0"
role_urn: "beam:artifact:role:staging_to:v1"
role_payload: "\n8cldrdata-YqzuKX1QnLCOo0cwjKRdBhGrip_ltIJZg-APT60tUPA.jar"
>
dependencies: <
type_urn: "beam:artifact:type:file:v1"
type_payload: "\nD/tmp/artifacts/dnsns-dhEp186udEF6X6chZus-RJzWRmzlccxx1_btlXWayVI.jar\022@761129d7ceae74417a5fa72166eb3e449cd6466ce571cc71d7f6ed95759ac952"
role_urn: "beam:artifact:role:staging_to:v1"
role_payload: "\n5dnsns-dhEp186udEF6X6chZus-RJzWRmzlccxx1_btlXWayVI.jar"
>
dependencies: <
type_urn: "beam:artifact:type:file:v1"
type_payload: "\nr/tmp/artifacts/beam-sdks-java-io-expansion-service-2.37.0-SNAPSHOT-rbUQyx0dCJd_sK7u8mp_Cv_rZhhdN_krB7BKCGYuxGA.jar\022@adb510cb1d1d08977fb0aeeef26a7f0affeb66185d37f92b07b04a08662ec460"
role_urn: "beam:artifact:role:staging_to:v1"
role_payload: "\ncbeam-sdks-java-io-expansion-service-2.37.0-SNAPSHOT-rbUQyx0dCJd_sK7u8mp_Cv_rZhhdN_krB7BKCGYuxGA.jar"
>
>
>
>
root_transform_ids: "s1"
root_transform_ids: "e4"
root_transform_ids: "e5"
root_transform_ids: "s3"
requirements: "beam:requirement:pardo:splittable_dofn:v1"
2022/02/08 18:36:48 Cross-compiling <https://ci-beam.apache.org/job/beam_PostCommit_XVR_Spark/ws/src/sdks/go/test/integration/io/xlang/kafka/kafka_test.go> as /tmp/worker-2-1644345408288312697
2022/02/08 18:36:53 Prepared job with id: go-testkafkaio_basicreadwrite_be0062f7-bf0a-4794-9fdc-4994f2b4f9b5 and staging token: go-testkafkaio_basicreadwrite_be0062f7-bf0a-4794-9fdc-4994f2b4f9b5
2022/02/08 18:36:54 Staged binary artifact with token:
2022/02/08 18:36:54 Submitted job: go0testkafkaio0basicreadwrite-jenkins-0208183654-e1f7afe5_e5abcbf3-6067-475e-a83e-e443b67ca2d4
2022/02/08 18:36:54 Job state: STOPPED
2022/02/08 18:36:54 Job state: STARTING
2022/02/08 18:36:54 Job state: RUNNING
2022/02/08 18:37:48 Job state: DONE
2022/02/08 18:37:48 Warning: 6 errors during metrics processing: [failed to deduce Step from MonitoringInfo: urn:"beam:metric:element_count:v1" type:"beam:metrics:sum_int64:v1" payload:"\x01" labels:{key:"PCOLLECTION" value:"hFSZxJOYuQExternal/KafkaIO.Read/KafkaIO.Read.ReadFromKafkaViaUnbounded/Read(KafkaUnboundedSource)/Create/Read(CreateSource)/ParDo(OutputSingleSource)/ParMultiDo(OutputSingleSource).output/PairWithRestriction0"} failed to deduce Step from MonitoringInfo: urn:"beam:metric:element_count:v1" type:"beam:metrics:sum_int64:v1" payload:"\x01" labels:{key:"PCOLLECTION" value:"hFSZxJOYuQExternal/KafkaIO.Read/KafkaIO.Read.ReadFromKafkaViaUnbounded/Read(KafkaUnboundedSource)/Create/Read(CreateSource)/ParDo(OutputSingleSource)/ParMultiDo(OutputSingleSource).output/SplitAndSize0"} failed to deduce Step from MonitoringInfo: urn:"beam:metric:sampled_byte_size:v1" type:"beam:metrics:distribution_int64:v1" payload:"\x01\xbcA\xbcA\xbcA" labels:{key:"PCOLLECTION" value:"hFSZxJOYuQExternal/KafkaIO.Read/KafkaIO.Read.ReadFromKafkaViaUnbounded/Read(KafkaUnboundedSource)/Create/Read(CreateSource)/ParDo(OutputSingleSource)/ParMultiDo(OutputSingleSource).output/PairWithRestriction0"} failed to deduce Step from MonitoringInfo: urn:"beam:metric:sampled_byte_size:v1" type:"beam:metrics:distribution_int64:v1" payload:"\x01\xc9A\xc9A\xc9A" labels:{key:"PCOLLECTION" value:"hFSZxJOYuQExternal/KafkaIO.Read/KafkaIO.Read.ReadFromKafkaViaUnbounded/Read(KafkaUnboundedSource)/Create/Read(CreateSource)/ParDo(OutputSingleSource)/ParMultiDo(OutputSingleSource).output/SplitAndSize0"} failed to deduce Step from MonitoringInfo: urn:"beam:metric:element_count:v1" type:"beam:metrics:sum_int64:v1" payload:"\x01" labels:{key:"PCOLLECTION" value:"hFSZxJOYuQExternal/KafkaIO.Read/KafkaIO.Read.ReadFromKafkaViaUnbounded/Read(KafkaUnboundedSource)/Create/Read(CreateSource)/ParDo(OutputSingleSource)/ParMultiDo(OutputSingleSource).output/SplitAndSize0"} failed to deduce Step from MonitoringInfo: urn:"beam:metric:sampled_byte_size:v1" type:"beam:metrics:distribution_int64:v1" payload:"\x01\xc9A\xc9A\xc9A" labels:{key:"PCOLLECTION" value:"hFSZxJOYuQExternal/KafkaIO.Read/KafkaIO.Read.ReadFromKafkaViaUnbounded/Read(KafkaUnboundedSource)/Create/Read(CreateSource)/ParDo(OutputSingleSource)/ParMultiDo(OutputSingleSource).output/SplitAndSize0"}]
--- PASS: TestKafkaIO_BasicReadWrite (103.49s)
PASS
ok github.com/apache/beam/sdks/v2/go/test/integration/io/xlang/kafka 106.615s
FAIL
$ TEST_EXIT_CODE=0
$ cd ../..
$ exit 1
$ exit 1
> Task :runners:spark:2:job-server:validatesCrossLanguageRunnerGoUsingJava FAILED
> Task :runners:spark:2:job-server:validatesCrossLanguageRunnerJavaUsingJava
> Task :runners:spark:2:job-server:validatesCrossLanguageRunnerJavaUsingPython
> Task :runners:spark:2:job-server:validatesCrossLanguageRunnerJavaUsingPythonOnly
> Task :runners:spark:2:job-server:validatesCrossLanguageRunnerPythonUsingJava
>>> RUNNING integration tests with pipeline options: --runner=PortableRunner --job_endpoint=localhost:35129 --environment_cache_millis=10000 --experiments=beam_fn_api
>>> pytest options:
>>> collect markers: -m=xlang_transforms
============================= test session starts ==============================
platform linux -- Python 3.6.15, pytest-4.6.11, py-1.11.0, pluggy-0.13.1
rootdir: <https://ci-beam.apache.org/job/beam_PostCommit_XVR_Spark/ws/src/sdks/python,> inifile: pytest.ini
plugins: xdist-1.34.0, timeout-1.4.2, forked-1.4.0, requests-mock-1.9.3
timeout: 600.0s
timeout method: signal
timeout func_only: False
collected 5201 items / 5191 deselected / 10 selected
apache_beam/io/external/generate_sequence_test.py ... [ 30%]
apache_beam/transforms/validate_runner_xlang_test.py ....... [100%]
=============================== warnings summary ===============================
apache_beam/io/filesystems_test.py:54
<https://ci-beam.apache.org/job/beam_PostCommit_XVR_Spark/ws/src/sdks/python/apache_beam/io/filesystems_test.py>:54: DeprecationWarning: invalid escape sequence \c
self.assertIsNone(FileSystems.get_scheme('c:\\abc\cdf')) # pylint: disable=anomalous-backslash-in-string
apache_beam/io/filesystems_test.py:62
<https://ci-beam.apache.org/job/beam_PostCommit_XVR_Spark/ws/src/sdks/python/apache_beam/io/filesystems_test.py>:62: DeprecationWarning: invalid escape sequence \d
self.assertTrue(isinstance(FileSystems.get_filesystem('c:\\abc\def'), # pylint: disable=anomalous-backslash-in-string
-- Docs: https://docs.pytest.org/en/latest/warnings.html
- generated xml file: <https://ci-beam.apache.org/job/beam_PostCommit_XVR_Spark/ws/src/sdks/python/pytest_xlangValidateRunner.xml> -
=========== 10 passed, 5191 deselected, 2 warnings in 107.39 seconds ===========
> Task :runners:spark:2:job-server:validatesCrossLanguageRunnerPythonUsingPython
>>> RUNNING integration tests with pipeline options: --runner=PortableRunner --job_endpoint=localhost:35129 --environment_cache_millis=10000 --experiments=beam_fn_api
>>> pytest options:
>>> collect markers: -m=xlang_transforms
============================= test session starts ==============================
platform linux -- Python 3.6.15, pytest-4.6.11, py-1.11.0, pluggy-0.13.1
rootdir: <https://ci-beam.apache.org/job/beam_PostCommit_XVR_Spark/ws/src/sdks/python,> inifile: pytest.ini
plugins: xdist-1.34.0, timeout-1.4.2, forked-1.4.0, requests-mock-1.9.3
timeout: 600.0s
timeout method: signal
timeout func_only: False
collected 5201 items / 5191 deselected / 10 selected
apache_beam/io/external/generate_sequence_test.py .ss [ 30%]
apache_beam/transforms/validate_runner_xlang_test.py ....... [100%]
- generated xml file: <https://ci-beam.apache.org/job/beam_PostCommit_XVR_Spark/ws/src/sdks/python/pytest_xlangValidateRunner.xml> -
============ 8 passed, 2 skipped, 5191 deselected in 57.11 seconds =============
> Task :runners:spark:2:job-server:validatesCrossLanguageRunnerPythonUsingSql
>>> RUNNING integration tests with pipeline options: --runner=PortableRunner --job_endpoint=localhost:35129 --environment_cache_millis=10000 --experiments=beam_fn_api
>>> pytest options:
>>> collect markers: -m=xlang_sql_expansion_service
============================= test session starts ==============================
platform linux -- Python 3.6.15, pytest-4.6.11, py-1.11.0, pluggy-0.13.1
rootdir: <https://ci-beam.apache.org/job/beam_PostCommit_XVR_Spark/ws/src/sdks/python,> inifile: pytest.ini
plugins: xdist-1.34.0, timeout-1.4.2, forked-1.4.0, requests-mock-1.9.3
timeout: 600.0s
timeout method: signal
timeout func_only: False
collected 5201 items / 5192 deselected / 9 selected
apache_beam/transforms/sql_test.py ......... [100%]
- generated xml file: <https://ci-beam.apache.org/job/beam_PostCommit_XVR_Spark/ws/src/sdks/python/pytest_xlangSqlValidateRunner.xml> -
================= 9 passed, 5192 deselected in 215.17 seconds ==================
> Task :runners:spark:2:job-server:validatesCrossLanguageRunnerCleanup
Stopping expansion service pid: 77941.
Stopping expansion service pid: 77942.
> Task :runners:spark:2:job-server:sparkJobServerCleanup
Stopping job server pid: 8740.
FAILURE: Build failed with an exception.
* Where:
Build file '<https://ci-beam.apache.org/job/beam_PostCommit_XVR_Spark/ws/src/sdks/go/test/build.gradle'> line: 173
* What went wrong:
Execution failed for task ':runners:spark:2:job-server:validatesCrossLanguageRunnerGoUsingJava'.
> Process 'command 'sh'' finished with non-zero exit value 1
* Try:
> Run with --stacktrace option to get the stack trace.
> Run with --info or --debug option to get more log output.
> Run with --scan to get full insights.
* Get more help at https://help.gradle.org
Deprecated Gradle features were used in this build, making it incompatible with Gradle 8.0.
You can use '--warning-mode all' to show the individual deprecation warnings and determine if they come from your own scripts or plugins.
See https://docs.gradle.org/7.3.2/userguide/command_line_interface.html#sec:command_line_warnings
Execution optimizations have been disabled for 1 invalid unit(s) of work during this build to ensure correctness.
Please consult deprecation warnings for more details.
BUILD FAILED in 54m 49s
240 actionable tasks: 166 executed, 64 from cache, 10 up-to-date
Publishing build scan...
https://gradle.com/s/umiruz5w6ggey
Build step 'Invoke Gradle script' changed build result to FAILURE
Build step 'Invoke Gradle script' marked build as failure
---------------------------------------------------------------------
To unsubscribe, e-mail: builds-unsubscribe@beam.apache.org
For additional commands, e-mail: builds-help@beam.apache.org
Build failed in Jenkins: beam_PostCommit_XVR_Spark #3343
Posted by Apache Jenkins Server <je...@builds.apache.org>.
See <https://ci-beam.apache.org/job/beam_PostCommit_XVR_Spark/3343/display/redirect?page=changes>
Changes:
[Ismaël Mejía] [BEAM-13839] Upgrade zstd-jni to version 1.5.2-1
[mmack] [BEAM-13840] Fix usage of legacy rawtypes in AWS modules
------------------------------------------
[...truncated 883.28 KB...]
payload: "\202SNAPPY\000\000\000\000\001\000\000\000\001\000\000\000\210\330\001\350\254\355\000\005sr\000&org.apache.beam.sdk.coders.VarIntCoder\300K2\332\251KVh\002\000\000xrr5\000\024Atomic\0055 \307\354\265\314\205tPF\002\0055\000*jj\000$Structured\0059\034s\277\022\016\325\3246\021\t9\000 j9\000\005/0C\335\325\211\256\274~\370\002\000\000xp"
>
>
>
coders: <
key: "jeiPAgcudSVoidCoder"
value: <
spec: <
urn: "beam:coders:javasdk:0.1"
payload: "\202SNAPPY\000\000\000\000\001\000\000\000\001\000\000\000\210\326\001\350\254\355\000\005sr\000$org.apache.beam.sdk.coders.VoidCoder\271\277U\233\350\r\257U\002\000\000xr\000&j3\000\024Atomic\0055 \307\354\265\314\205tPF\002\0055\000*j5\000$Structured\0059\034s\277\022\016\325\3246\021\t9\000 j9\000\005/0C\335\325\211\256\274~\370\002\000\000xp"
>
>
>
environments: <
key: "go"
value: <
urn: "beam:env:docker:v1"
payload: "\n\026apache/beam_go_sdk:dev"
capabilities: "beam:protocol:progress_reporting:v0"
capabilities: "beam:protocol:multi_core_bundle_processing:v1"
capabilities: "beam:version:sdk_base:go"
capabilities: "beam:coder:bytes:v1"
capabilities: "beam:coder:bool:v1"
capabilities: "beam:coder:varint:v1"
capabilities: "beam:coder:double:v1"
capabilities: "beam:coder:string_utf8:v1"
capabilities: "beam:coder:length_prefix:v1"
capabilities: "beam:coder:kv:v1"
capabilities: "beam:coder:iterable:v1"
capabilities: "beam:coder:state_backed_iterable:v1"
capabilities: "beam:coder:windowed_value:v1"
capabilities: "beam:coder:global_window:v1"
capabilities: "beam:coder:interval_window:v1"
capabilities: "beam:coder:row:v1"
dependencies: <
type_urn: "beam:artifact:type:file:v1"
role_urn: "beam:artifact:role:go_worker_binary:v1"
>
>
>
environments: <
key: "jeiPAgcudSbeam:env:docker:v1"
value: <
urn: "beam:env:docker:v1"
payload: "\n apache/beam_java8_sdk:2.37.0.dev"
capabilities: "beam:coder:bytes:v1"
capabilities: "beam:coder:bool:v1"
capabilities: "beam:coder:varint:v1"
capabilities: "beam:coder:string_utf8:v1"
capabilities: "beam:coder:iterable:v1"
capabilities: "beam:coder:timer:v1"
capabilities: "beam:coder:kv:v1"
capabilities: "beam:coder:length_prefix:v1"
capabilities: "beam:coder:global_window:v1"
capabilities: "beam:coder:interval_window:v1"
capabilities: "beam:coder:custom_window:v1"
capabilities: "beam:coder:windowed_value:v1"
capabilities: "beam:coder:double:v1"
capabilities: "beam:coder:row:v1"
capabilities: "beam:coder:param_windowed_value:v1"
capabilities: "beam:coder:state_backed_iterable:v1"
capabilities: "beam:coder:sharded_key:v1"
capabilities: "beam:protocol:multi_core_bundle_processing:v1"
capabilities: "beam:protocol:progress_reporting:v1"
capabilities: "beam:protocol:harness_monitoring_infos:v1"
capabilities: "beam:protocol:control_request_elements_embedding:v1"
capabilities: "beam:protocol:state_caching:v1"
capabilities: "beam:version:sdk_base:apache/beam_java8_sdk:2.37.0.dev"
capabilities: "beam:transform:sdf_truncate_sized_restrictions:v1"
capabilities: "beam:transform:to_string:v1"
dependencies: <
type_urn: "beam:artifact:type:file:v1"
type_payload: "\nL/tmp/artifacts/icedtea-sound-ebvtNFkfFXg4aaYFuDnwKpwDSjzsaZqlqv5iKxPTr-U.jar\022@79bbed34591f15783869a605b839f02a9c034a3cec699aa5aafe622b13d3afe5"
role_urn: "beam:artifact:role:staging_to:v1"
role_payload: "\n=icedtea-sound-ebvtNFkfFXg4aaYFuDnwKpwDSjzsaZqlqv5iKxPTr-U.jar"
>
dependencies: <
type_urn: "beam:artifact:type:file:v1"
type_payload: "\nF/tmp/artifacts/jaccess-ULFTCPsb6cLYZ0f1BG1FQfczmHNaZCx8plXuRDKpBqE.jar\022@50b15308fb1be9c2d86747f5046d4541f73398735a642c7ca655ee4432a906a1"
role_urn: "beam:artifact:role:staging_to:v1"
role_payload: "\n7jaccess-ULFTCPsb6cLYZ0f1BG1FQfczmHNaZCx8plXuRDKpBqE.jar"
>
dependencies: <
type_urn: "beam:artifact:type:file:v1"
type_payload: "\nI/tmp/artifacts/localedata-dUHqyGxaTVCjfTI8MckPYarZ3_mwf62udkxaHi1aKns.jar\022@7541eac86c5a4d50a37d323c31c90f61aad9dff9b07fadae764c5a1e2d5a2a7b"
role_urn: "beam:artifact:role:staging_to:v1"
role_payload: "\n:localedata-dUHqyGxaTVCjfTI8MckPYarZ3_mwf62udkxaHi1aKns.jar"
>
dependencies: <
type_urn: "beam:artifact:type:file:v1"
type_payload: "\nF/tmp/artifacts/nashorn-XdUndQGroXOP9NCsfITpBERYcbbGXVHLjbvNWXCh-3A.jar\022@5dd5277501aba1738ff4d0ac7c84e904445871b6c65d51cb8dbbcd5970a1fb70"
role_urn: "beam:artifact:role:staging_to:v1"
role_payload: "\n7nashorn-XdUndQGroXOP9NCsfITpBERYcbbGXVHLjbvNWXCh-3A.jar"
>
dependencies: <
type_urn: "beam:artifact:type:file:v1"
type_payload: "\nG/tmp/artifacts/cldrdata-YqzuKX1QnLCOo0cwjKRdBhGrip_ltIJZg-APT60tUPA.jar\022@62acee297d509cb08ea347308ca45d0611ab8a9fe5b4825983e00f4fad2d50f0"
role_urn: "beam:artifact:role:staging_to:v1"
role_payload: "\n8cldrdata-YqzuKX1QnLCOo0cwjKRdBhGrip_ltIJZg-APT60tUPA.jar"
>
dependencies: <
type_urn: "beam:artifact:type:file:v1"
type_payload: "\nD/tmp/artifacts/dnsns-dhEp186udEF6X6chZus-RJzWRmzlccxx1_btlXWayVI.jar\022@761129d7ceae74417a5fa72166eb3e449cd6466ce571cc71d7f6ed95759ac952"
role_urn: "beam:artifact:role:staging_to:v1"
role_payload: "\n5dnsns-dhEp186udEF6X6chZus-RJzWRmzlccxx1_btlXWayVI.jar"
>
dependencies: <
type_urn: "beam:artifact:type:file:v1"
type_payload: "\nr/tmp/artifacts/beam-sdks-java-io-expansion-service-2.37.0-SNAPSHOT-rbUQyx0dCJd_sK7u8mp_Cv_rZhhdN_krB7BKCGYuxGA.jar\022@adb510cb1d1d08977fb0aeeef26a7f0affeb66185d37f92b07b04a08662ec460"
role_urn: "beam:artifact:role:staging_to:v1"
role_payload: "\ncbeam-sdks-java-io-expansion-service-2.37.0-SNAPSHOT-rbUQyx0dCJd_sK7u8mp_Cv_rZhhdN_krB7BKCGYuxGA.jar"
>
>
>
>
root_transform_ids: "s1"
root_transform_ids: "e4"
root_transform_ids: "e5"
root_transform_ids: "s3"
requirements: "beam:requirement:pardo:splittable_dofn:v1"
2022/02/08 12:40:57 Cross-compiling <https://ci-beam.apache.org/job/beam_PostCommit_XVR_Spark/ws/src/sdks/go/test/integration/io/xlang/kafka/kafka_test.go> as /tmp/worker-2-1644324057241527656
2022/02/08 12:41:02 Prepared job with id: go-testkafkaio_basicreadwrite_043ea465-d148-4ac4-a4d6-b51761f5a9e8 and staging token: go-testkafkaio_basicreadwrite_043ea465-d148-4ac4-a4d6-b51761f5a9e8
2022/02/08 12:41:03 Staged binary artifact with token:
2022/02/08 12:41:03 Submitted job: go0testkafkaio0basicreadwrite-jenkins-0208124103-8283b88f_1bbce403-2b52-4c53-877b-6bc8ca98b58a
2022/02/08 12:41:03 Job state: STOPPED
2022/02/08 12:41:03 Job state: STARTING
2022/02/08 12:41:03 Job state: RUNNING
2022/02/08 12:42:24 Job state: DONE
2022/02/08 12:42:24 Warning: 6 errors during metrics processing: [failed to deduce Step from MonitoringInfo: urn:"beam:metric:element_count:v1" type:"beam:metrics:sum_int64:v1" payload:"\x01" labels:{key:"PCOLLECTION" value:"jeiPAgcudSExternal/KafkaIO.Read/KafkaIO.Read.ReadFromKafkaViaUnbounded/Read(KafkaUnboundedSource)/Create/Read(CreateSource)/ParDo(OutputSingleSource)/ParMultiDo(OutputSingleSource).output/SplitAndSize0"} failed to deduce Step from MonitoringInfo: urn:"beam:metric:element_count:v1" type:"beam:metrics:sum_int64:v1" payload:"\x01" labels:{key:"PCOLLECTION" value:"jeiPAgcudSExternal/KafkaIO.Read/KafkaIO.Read.ReadFromKafkaViaUnbounded/Read(KafkaUnboundedSource)/Create/Read(CreateSource)/ParDo(OutputSingleSource)/ParMultiDo(OutputSingleSource).output/PairWithRestriction0"} failed to deduce Step from MonitoringInfo: urn:"beam:metric:sampled_byte_size:v1" type:"beam:metrics:distribution_int64:v1" payload:"\x01\xbcA\xbcA\xbcA" labels:{key:"PCOLLECTION" value:"jeiPAgcudSExternal/KafkaIO.Read/KafkaIO.Read.ReadFromKafkaViaUnbounded/Read(KafkaUnboundedSource)/Create/Read(CreateSource)/ParDo(OutputSingleSource)/ParMultiDo(OutputSingleSource).output/PairWithRestriction0"} failed to deduce Step from MonitoringInfo: urn:"beam:metric:sampled_byte_size:v1" type:"beam:metrics:distribution_int64:v1" payload:"\x01\xc9A\xc9A\xc9A" labels:{key:"PCOLLECTION" value:"jeiPAgcudSExternal/KafkaIO.Read/KafkaIO.Read.ReadFromKafkaViaUnbounded/Read(KafkaUnboundedSource)/Create/Read(CreateSource)/ParDo(OutputSingleSource)/ParMultiDo(OutputSingleSource).output/SplitAndSize0"} failed to deduce Step from MonitoringInfo: urn:"beam:metric:element_count:v1" type:"beam:metrics:sum_int64:v1" payload:"\x01" labels:{key:"PCOLLECTION" value:"jeiPAgcudSExternal/KafkaIO.Read/KafkaIO.Read.ReadFromKafkaViaUnbounded/Read(KafkaUnboundedSource)/Create/Read(CreateSource)/ParDo(OutputSingleSource)/ParMultiDo(OutputSingleSource).output/SplitAndSize0"} failed to deduce Step from MonitoringInfo: urn:"beam:metric:sampled_byte_size:v1" type:"beam:metrics:distribution_int64:v1" payload:"\x01\xc9A\xc9A\xc9A" labels:{key:"PCOLLECTION" value:"jeiPAgcudSExternal/KafkaIO.Read/KafkaIO.Read.ReadFromKafkaViaUnbounded/Read(KafkaUnboundedSource)/Create/Read(CreateSource)/ParDo(OutputSingleSource)/ParMultiDo(OutputSingleSource).output/SplitAndSize0"}]
--- PASS: TestKafkaIO_BasicReadWrite (126.09s)
PASS
ok github.com/apache/beam/sdks/v2/go/test/integration/io/xlang/kafka 129.163s
FAIL
$ TEST_EXIT_CODE=0
$ cd ../..
$ exit 1
$ exit 1
> Task :runners:spark:2:job-server:validatesCrossLanguageRunnerGoUsingJava FAILED
> Task :runners:spark:2:job-server:validatesCrossLanguageRunnerJavaUsingJava
> Task :runners:spark:2:job-server:validatesCrossLanguageRunnerJavaUsingPython
> Task :runners:spark:2:job-server:validatesCrossLanguageRunnerJavaUsingPythonOnly
> Task :runners:spark:2:job-server:validatesCrossLanguageRunnerPythonUsingJava
>>> RUNNING integration tests with pipeline options: --runner=PortableRunner --job_endpoint=localhost:44407 --environment_cache_millis=10000 --experiments=beam_fn_api
>>> pytest options:
>>> collect markers: -m=xlang_transforms
============================= test session starts ==============================
platform linux -- Python 3.6.15, pytest-4.6.11, py-1.11.0, pluggy-0.13.1
rootdir: <https://ci-beam.apache.org/job/beam_PostCommit_XVR_Spark/ws/src/sdks/python,> inifile: pytest.ini
plugins: xdist-1.34.0, timeout-1.4.2, forked-1.4.0, requests-mock-1.9.3
timeout: 600.0s
timeout method: signal
timeout func_only: False
collected 5201 items / 5191 deselected / 10 selected
apache_beam/io/external/generate_sequence_test.py ... [ 30%]
apache_beam/transforms/validate_runner_xlang_test.py ....... [100%]
=============================== warnings summary ===============================
apache_beam/io/filesystems_test.py:54
<https://ci-beam.apache.org/job/beam_PostCommit_XVR_Spark/ws/src/sdks/python/apache_beam/io/filesystems_test.py>:54: DeprecationWarning: invalid escape sequence \c
self.assertIsNone(FileSystems.get_scheme('c:\\abc\cdf')) # pylint: disable=anomalous-backslash-in-string
apache_beam/io/filesystems_test.py:62
<https://ci-beam.apache.org/job/beam_PostCommit_XVR_Spark/ws/src/sdks/python/apache_beam/io/filesystems_test.py>:62: DeprecationWarning: invalid escape sequence \d
self.assertTrue(isinstance(FileSystems.get_filesystem('c:\\abc\def'), # pylint: disable=anomalous-backslash-in-string
-- Docs: https://docs.pytest.org/en/latest/warnings.html
- generated xml file: <https://ci-beam.apache.org/job/beam_PostCommit_XVR_Spark/ws/src/sdks/python/pytest_xlangValidateRunner.xml> -
=========== 10 passed, 5191 deselected, 2 warnings in 115.14 seconds ===========
> Task :runners:spark:2:job-server:validatesCrossLanguageRunnerPythonUsingPython
>>> RUNNING integration tests with pipeline options: --runner=PortableRunner --job_endpoint=localhost:44407 --environment_cache_millis=10000 --experiments=beam_fn_api
>>> pytest options:
>>> collect markers: -m=xlang_transforms
============================= test session starts ==============================
platform linux -- Python 3.6.15, pytest-4.6.11, py-1.11.0, pluggy-0.13.1
rootdir: <https://ci-beam.apache.org/job/beam_PostCommit_XVR_Spark/ws/src/sdks/python,> inifile: pytest.ini
plugins: xdist-1.34.0, timeout-1.4.2, forked-1.4.0, requests-mock-1.9.3
timeout: 600.0s
timeout method: signal
timeout func_only: False
collected 5201 items / 5191 deselected / 10 selected
apache_beam/io/external/generate_sequence_test.py .ss [ 30%]
apache_beam/transforms/validate_runner_xlang_test.py ....... [100%]
- generated xml file: <https://ci-beam.apache.org/job/beam_PostCommit_XVR_Spark/ws/src/sdks/python/pytest_xlangValidateRunner.xml> -
============ 8 passed, 2 skipped, 5191 deselected in 59.16 seconds =============
> Task :runners:spark:2:job-server:validatesCrossLanguageRunnerPythonUsingSql
>>> RUNNING integration tests with pipeline options: --runner=PortableRunner --job_endpoint=localhost:44407 --environment_cache_millis=10000 --experiments=beam_fn_api
>>> pytest options:
>>> collect markers: -m=xlang_sql_expansion_service
============================= test session starts ==============================
platform linux -- Python 3.6.15, pytest-4.6.11, py-1.11.0, pluggy-0.13.1
rootdir: <https://ci-beam.apache.org/job/beam_PostCommit_XVR_Spark/ws/src/sdks/python,> inifile: pytest.ini
plugins: xdist-1.34.0, timeout-1.4.2, forked-1.4.0, requests-mock-1.9.3
timeout: 600.0s
timeout method: signal
timeout func_only: False
collected 5201 items / 5192 deselected / 9 selected
apache_beam/transforms/sql_test.py ......... [100%]
- generated xml file: <https://ci-beam.apache.org/job/beam_PostCommit_XVR_Spark/ws/src/sdks/python/pytest_xlangSqlValidateRunner.xml> -
================= 9 passed, 5192 deselected in 233.23 seconds ==================
> Task :runners:spark:2:job-server:validatesCrossLanguageRunnerCleanup
Stopping expansion service pid: 3519591.
Stopping expansion service pid: 3519592.
> Task :runners:spark:2:job-server:sparkJobServerCleanup
Stopping job server pid: 3478074.
FAILURE: Build failed with an exception.
* Where:
Build file '<https://ci-beam.apache.org/job/beam_PostCommit_XVR_Spark/ws/src/sdks/go/test/build.gradle'> line: 173
* What went wrong:
Execution failed for task ':runners:spark:2:job-server:validatesCrossLanguageRunnerGoUsingJava'.
> Process 'command 'sh'' finished with non-zero exit value 1
* Try:
> Run with --stacktrace option to get the stack trace.
> Run with --info or --debug option to get more log output.
> Run with --scan to get full insights.
* Get more help at https://help.gradle.org
Deprecated Gradle features were used in this build, making it incompatible with Gradle 8.0.
You can use '--warning-mode all' to show the individual deprecation warnings and determine if they come from your own scripts or plugins.
See https://docs.gradle.org/7.3.2/userguide/command_line_interface.html#sec:command_line_warnings
Execution optimizations have been disabled for 1 invalid unit(s) of work during this build to ensure correctness.
Please consult deprecation warnings for more details.
BUILD FAILED in 1h 24s
240 actionable tasks: 196 executed, 36 from cache, 8 up-to-date
Publishing build scan...
https://gradle.com/s/izsh25yejfnds
Build step 'Invoke Gradle script' changed build result to FAILURE
Build step 'Invoke Gradle script' marked build as failure
---------------------------------------------------------------------
To unsubscribe, e-mail: builds-unsubscribe@beam.apache.org
For additional commands, e-mail: builds-help@beam.apache.org
Build failed in Jenkins: beam_PostCommit_XVR_Spark #3342
Posted by Apache Jenkins Server <je...@builds.apache.org>.
See <https://ci-beam.apache.org/job/beam_PostCommit_XVR_Spark/3342/display/redirect?page=changes>
Changes:
[noreply] [BEAM-13848] Update numpy intersphinx link (#16767)
[noreply] [release-23.6.0] Fix JIRA link for 2.36 blog (#16771)
[noreply] [BEAM-13647] Use role for Go worker binary. (#16729)
------------------------------------------
[...truncated 831.65 KB...]
payload: "\202SNAPPY\000\000\000\000\001\000\000\000\001\000\000\001?\315\003\270\254\355\000\005sr\000Aorg.apache.beam.sdk.values.TimestampedV\001\022\000$>\021\000LCoder\364\376\202p\274iX-\002\000\001L\000\nv\001)\005\030\034t\000\"Lorg/\t]\000/\001],/sdk/coders/\005$\020;xr\000*N\202\000\t%(.Structured\005/8s\277\022\016\325\3246\021\002\000\000xr\000 j9\000\005/\034C\335\325\211\256\274~\370\001/\020psr\000,j1\000(Serializabl\t\277\034\010\364 \216\305ynl\005\327\\\004typet\000\021Ljava/lang/Class\001\300\000&jV\000\024Custom\005\215Pj\260\010\235\013;\035\013\002\000\000xq\000~\000\003vr\000;N;\000Pio.BoundedReadFromUnb\t\021`Source$Shardd\236\240U\205\000j\363\002\000\000xp"
>
>
>
coders: <
key: "MDLsqFKYACValueWithRecordIdCoder"
value: <
spec: <
urn: "beam:coders:javasdk:0.1"
payload: "\202SNAPPY\000\000\000\000\001\000\000\000\001\000\000\001h\364\004\320\254\355\000\005sr\000Corg.apache.beam.sdk.values.ValueWithRecordId$B\022\000LCoder{\343\376bQ\014\204>\002\000\002L\000\007i\t\025\034t\000+Lorg/\t\\\000/\001\\\024/sdk/c\0012(s/ByteArray\005B\014;L\000\n\005u\005\016\010t\000\"n;\000\005$\020;xr\000*N\274\000\t`(.Structured\005/8s\277\022\016\325\3246\021\002\000\000xr\000 j9\000\005/\034C\335\325\211\256\274~\370\001/\020psr\000)j1\0006\312\000\034\351\277\005|\263\3746\333\001:\010r\000&j8\000\024Atomic\005o\034\307\354\265\314\205tPF\0015 q\000~\000\003sr\000-N;\000$io.kafka.K\001\006\000R%\227\005B<I\320\251Y\032\341{#\002\000\001L\000\007kv\005\025\010t\000$nH\001\000K\t&\000;\025s\000\"Ns\000-P\r- j\000\275\271\035\243\3126\002!\353\010\010ke)\277\001\264\000\0022\303\001\005\022\rY$q\000~\000\006q\000~\000\016"
>
>
>
coders: <
key: "MDLsqFKYACVarIntCoder"
value: <
spec: <
urn: "beam:coders:javasdk:0.1"
payload: "\202SNAPPY\000\000\000\000\001\000\000\000\001\000\000\000\210\330\001\350\254\355\000\005sr\000&org.apache.beam.sdk.coders.VarIntCoder\300K2\332\251KVh\002\000\000xrr5\000\024Atomic\0055 \307\354\265\314\205tPF\002\0055\000*jj\000$Structured\0059\034s\277\022\016\325\3246\021\t9\000 j9\000\005/0C\335\325\211\256\274~\370\002\000\000xp"
>
>
>
coders: <
key: "MDLsqFKYACVoidCoder"
value: <
spec: <
urn: "beam:coders:javasdk:0.1"
payload: "\202SNAPPY\000\000\000\000\001\000\000\000\001\000\000\000\210\326\001\350\254\355\000\005sr\000$org.apache.beam.sdk.coders.VoidCoder\271\277U\233\350\r\257U\002\000\000xr\000&j3\000\024Atomic\0055 \307\354\265\314\205tPF\002\0055\000*j5\000$Structured\0059\034s\277\022\016\325\3246\021\t9\000 j9\000\005/0C\335\325\211\256\274~\370\002\000\000xp"
>
>
>
coders: <
key: "c0"
value: <
spec: <
urn: "beam:coder:bytes:v1"
>
>
>
coders: <
key: "c1"
value: <
spec: <
urn: "beam:coder:global_window:v1"
>
>
>
coders: <
key: "c2"
value: <
spec: <
urn: "beam:go:coder:custom:v1"
payload: "Cgd2YXJpbnR6EgIIAhpdCklnaXRodWIuY29tL2FwYWNoZS9iZWFtL3Nka3MvdjIvZ28vcGtnL2JlYW0vY29yZS9ydW50aW1lL2NvZGVyeC5lbmNWYXJJbnRaEhAIFiIECBlADyoGCBQSAggIImkKSWdpdGh1Yi5jb20vYXBhY2hlL2JlYW0vc2Rrcy92Mi9nby9wa2cvYmVhbS9jb3JlL3J1bnRpbWUvY29kZXJ4LmRlY1ZhckludFoSHAgWIgQIGUADIgYIFBICCAgqBAgZQA8qBAgZQAE="
>
>
>
coders: <
key: "c3"
value: <
spec: <
urn: "beam:coder:length_prefix:v1"
>
component_coder_ids: "c2"
>
>
coders: <
key: "c4"
value: <
spec: <
urn: "beam:coder:kv:v1"
>
component_coder_ids: "c0"
component_coder_ids: "c0"
>
>
coders: <
key: "c5"
value: <
spec: <
urn: "beam:coder:kv:v1"
>
component_coder_ids: "c0"
component_coder_ids: "c3"
>
>
environments: <
key: "MDLsqFKYACbeam:env:docker:v1"
value: <
urn: "beam:env:docker:v1"
payload: "\n apache/beam_java8_sdk:2.37.0.dev"
capabilities: "beam:coder:bytes:v1"
capabilities: "beam:coder:bool:v1"
capabilities: "beam:coder:varint:v1"
capabilities: "beam:coder:string_utf8:v1"
capabilities: "beam:coder:iterable:v1"
capabilities: "beam:coder:timer:v1"
capabilities: "beam:coder:kv:v1"
capabilities: "beam:coder:length_prefix:v1"
capabilities: "beam:coder:global_window:v1"
capabilities: "beam:coder:interval_window:v1"
capabilities: "beam:coder:custom_window:v1"
capabilities: "beam:coder:windowed_value:v1"
capabilities: "beam:coder:double:v1"
capabilities: "beam:coder:row:v1"
capabilities: "beam:coder:param_windowed_value:v1"
capabilities: "beam:coder:state_backed_iterable:v1"
capabilities: "beam:coder:sharded_key:v1"
capabilities: "beam:protocol:multi_core_bundle_processing:v1"
capabilities: "beam:protocol:progress_reporting:v1"
capabilities: "beam:protocol:harness_monitoring_infos:v1"
capabilities: "beam:protocol:control_request_elements_embedding:v1"
capabilities: "beam:protocol:state_caching:v1"
capabilities: "beam:version:sdk_base:apache/beam_java8_sdk:2.37.0.dev"
capabilities: "beam:transform:sdf_truncate_sized_restrictions:v1"
capabilities: "beam:transform:to_string:v1"
dependencies: <
type_urn: "beam:artifact:type:file:v1"
type_payload: "\nL/tmp/artifacts/icedtea-sound-ebvtNFkfFXg4aaYFuDnwKpwDSjzsaZqlqv5iKxPTr-U.jar\022@79bbed34591f15783869a605b839f02a9c034a3cec699aa5aafe622b13d3afe5"
role_urn: "beam:artifact:role:staging_to:v1"
role_payload: "\n=icedtea-sound-ebvtNFkfFXg4aaYFuDnwKpwDSjzsaZqlqv5iKxPTr-U.jar"
>
dependencies: <
type_urn: "beam:artifact:type:file:v1"
type_payload: "\nF/tmp/artifacts/jaccess-ULFTCPsb6cLYZ0f1BG1FQfczmHNaZCx8plXuRDKpBqE.jar\022@50b15308fb1be9c2d86747f5046d4541f73398735a642c7ca655ee4432a906a1"
role_urn: "beam:artifact:role:staging_to:v1"
role_payload: "\n7jaccess-ULFTCPsb6cLYZ0f1BG1FQfczmHNaZCx8plXuRDKpBqE.jar"
>
dependencies: <
type_urn: "beam:artifact:type:file:v1"
type_payload: "\nI/tmp/artifacts/localedata-dUHqyGxaTVCjfTI8MckPYarZ3_mwf62udkxaHi1aKns.jar\022@7541eac86c5a4d50a37d323c31c90f61aad9dff9b07fadae764c5a1e2d5a2a7b"
role_urn: "beam:artifact:role:staging_to:v1"
role_payload: "\n:localedata-dUHqyGxaTVCjfTI8MckPYarZ3_mwf62udkxaHi1aKns.jar"
>
dependencies: <
type_urn: "beam:artifact:type:file:v1"
type_payload: "\nF/tmp/artifacts/nashorn-XdUndQGroXOP9NCsfITpBERYcbbGXVHLjbvNWXCh-3A.jar\022@5dd5277501aba1738ff4d0ac7c84e904445871b6c65d51cb8dbbcd5970a1fb70"
role_urn: "beam:artifact:role:staging_to:v1"
role_payload: "\n7nashorn-XdUndQGroXOP9NCsfITpBERYcbbGXVHLjbvNWXCh-3A.jar"
>
dependencies: <
type_urn: "beam:artifact:type:file:v1"
type_payload: "\nG/tmp/artifacts/cldrdata-YqzuKX1QnLCOo0cwjKRdBhGrip_ltIJZg-APT60tUPA.jar\022@62acee297d509cb08ea347308ca45d0611ab8a9fe5b4825983e00f4fad2d50f0"
role_urn: "beam:artifact:role:staging_to:v1"
role_payload: "\n8cldrdata-YqzuKX1QnLCOo0cwjKRdBhGrip_ltIJZg-APT60tUPA.jar"
>
dependencies: <
type_urn: "beam:artifact:type:file:v1"
type_payload: "\nD/tmp/artifacts/dnsns-dhEp186udEF6X6chZus-RJzWRmzlccxx1_btlXWayVI.jar\022@761129d7ceae74417a5fa72166eb3e449cd6466ce571cc71d7f6ed95759ac952"
role_urn: "beam:artifact:role:staging_to:v1"
role_payload: "\n5dnsns-dhEp186udEF6X6chZus-RJzWRmzlccxx1_btlXWayVI.jar"
>
dependencies: <
type_urn: "beam:artifact:type:file:v1"
type_payload: "\nr/tmp/artifacts/beam-sdks-java-io-expansion-service-2.37.0-SNAPSHOT-zNPBl9PKuo2TIgmqEtTejNv3ULcxcblJCCfePOaMDCw.jar\022@ccd3c197d3caba8d932209aa12d4de8cdbf750b73171b9490827de3ce68c0c2c"
role_urn: "beam:artifact:role:staging_to:v1"
role_payload: "\ncbeam-sdks-java-io-expansion-service-2.37.0-SNAPSHOT-zNPBl9PKuo2TIgmqEtTejNv3ULcxcblJCCfePOaMDCw.jar"
>
>
>
environments: <
key: "go"
value: <
urn: "beam:env:docker:v1"
payload: "\n\026apache/beam_go_sdk:dev"
capabilities: "beam:protocol:progress_reporting:v0"
capabilities: "beam:protocol:multi_core_bundle_processing:v1"
capabilities: "beam:version:sdk_base:go"
capabilities: "beam:coder:bytes:v1"
capabilities: "beam:coder:bool:v1"
capabilities: "beam:coder:varint:v1"
capabilities: "beam:coder:double:v1"
capabilities: "beam:coder:string_utf8:v1"
capabilities: "beam:coder:length_prefix:v1"
capabilities: "beam:coder:kv:v1"
capabilities: "beam:coder:iterable:v1"
capabilities: "beam:coder:state_backed_iterable:v1"
capabilities: "beam:coder:windowed_value:v1"
capabilities: "beam:coder:global_window:v1"
capabilities: "beam:coder:interval_window:v1"
capabilities: "beam:coder:row:v1"
dependencies: <
type_urn: "beam:artifact:type:file:v1"
role_urn: "beam:artifact:role:go_worker_binary:v1"
>
>
>
>
root_transform_ids: "s1"
root_transform_ids: "e4"
root_transform_ids: "e5"
root_transform_ids: "s3"
requirements: "beam:requirement:pardo:splittable_dofn:v1"
2022/02/08 06:25:27 Cross-compiling <https://ci-beam.apache.org/job/beam_PostCommit_XVR_Spark/ws/src/sdks/go/test/integration/io/xlang/kafka/kafka_test.go> as /tmp/worker-2-1644301527452819668
2022/02/08 06:25:29 Prepared job with id: go-testkafkaio_basicreadwrite_8e15cf5b-7991-4781-959d-cbd0aed668f9 and staging token: go-testkafkaio_basicreadwrite_8e15cf5b-7991-4781-959d-cbd0aed668f9
2022/02/08 06:25:29 Staged binary artifact with token:
2022/02/08 06:25:29 Submitted job: go0testkafkaio0basicreadwrite-jenkins-0208062529-3bfda343_10d1b9c2-d9ea-4416-aa05-1399cf31ce48
2022/02/08 06:25:29 Job state: STOPPED
2022/02/08 06:25:29 Job state: STARTING
2022/02/08 06:25:29 Job state: RUNNING
2022/02/08 06:25:53 Job state: DONE
2022/02/08 06:25:53 Warning: 6 errors during metrics processing: [failed to deduce Step from MonitoringInfo: urn:"beam:metric:element_count:v1" type:"beam:metrics:sum_int64:v1" payload:"\x01" labels:{key:"PCOLLECTION" value:"MDLsqFKYACExternal/KafkaIO.Read/KafkaIO.Read.ReadFromKafkaViaUnbounded/Read(KafkaUnboundedSource)/Create/Read(CreateSource)/ParDo(OutputSingleSource)/ParMultiDo(OutputSingleSource).output/SplitAndSize0"} failed to deduce Step from MonitoringInfo: urn:"beam:metric:element_count:v1" type:"beam:metrics:sum_int64:v1" payload:"\x01" labels:{key:"PCOLLECTION" value:"MDLsqFKYACExternal/KafkaIO.Read/KafkaIO.Read.ReadFromKafkaViaUnbounded/Read(KafkaUnboundedSource)/Create/Read(CreateSource)/ParDo(OutputSingleSource)/ParMultiDo(OutputSingleSource).output/PairWithRestriction0"} failed to deduce Step from MonitoringInfo: urn:"beam:metric:sampled_byte_size:v1" type:"beam:metrics:distribution_int64:v1" payload:"\x01\xc9A\xc9A\xc9A" labels:{key:"PCOLLECTION" value:"MDLsqFKYACExternal/KafkaIO.Read/KafkaIO.Read.ReadFromKafkaViaUnbounded/Read(KafkaUnboundedSource)/Create/Read(CreateSource)/ParDo(OutputSingleSource)/ParMultiDo(OutputSingleSource).output/SplitAndSize0"} failed to deduce Step from MonitoringInfo: urn:"beam:metric:sampled_byte_size:v1" type:"beam:metrics:distribution_int64:v1" payload:"\x01\xbcA\xbcA\xbcA" labels:{key:"PCOLLECTION" value:"MDLsqFKYACExternal/KafkaIO.Read/KafkaIO.Read.ReadFromKafkaViaUnbounded/Read(KafkaUnboundedSource)/Create/Read(CreateSource)/ParDo(OutputSingleSource)/ParMultiDo(OutputSingleSource).output/PairWithRestriction0"} failed to deduce Step from MonitoringInfo: urn:"beam:metric:element_count:v1" type:"beam:metrics:sum_int64:v1" payload:"\x01" labels:{key:"PCOLLECTION" value:"MDLsqFKYACExternal/KafkaIO.Read/KafkaIO.Read.ReadFromKafkaViaUnbounded/Read(KafkaUnboundedSource)/Create/Read(CreateSource)/ParDo(OutputSingleSource)/ParMultiDo(OutputSingleSource).output/SplitAndSize0"} failed to deduce Step from MonitoringInfo: urn:"beam:metric:sampled_byte_size:v1" type:"beam:metrics:distribution_int64:v1" payload:"\x01\xc9A\xc9A\xc9A" labels:{key:"PCOLLECTION" value:"MDLsqFKYACExternal/KafkaIO.Read/KafkaIO.Read.ReadFromKafkaViaUnbounded/Read(KafkaUnboundedSource)/Create/Read(CreateSource)/ParDo(OutputSingleSource)/ParMultiDo(OutputSingleSource).output/SplitAndSize0"}]
--- PASS: TestKafkaIO_BasicReadWrite (39.95s)
PASS
ok github.com/apache/beam/sdks/v2/go/test/integration/io/xlang/kafka 42.993s
FAIL
> Task :runners:spark:2:job-server:validatesCrossLanguageRunnerGoUsingJava FAILED
> Task :runners:spark:2:job-server:validatesCrossLanguageRunnerJavaUsingJava
> Task :runners:spark:2:job-server:validatesCrossLanguageRunnerJavaUsingPython
> Task :runners:spark:2:job-server:validatesCrossLanguageRunnerJavaUsingPythonOnly
> Task :runners:spark:2:job-server:validatesCrossLanguageRunnerPythonUsingJava
> Task :runners:spark:2:job-server:validatesCrossLanguageRunnerPythonUsingPython
> Task :runners:spark:2:job-server:validatesCrossLanguageRunnerPythonUsingSql
> Task :runners:spark:2:job-server:validatesCrossLanguageRunnerCleanup
> Task :runners:spark:2:job-server:sparkJobServerCleanup
FAILURE: Build failed with an exception.
* Where:
Build file '<https://ci-beam.apache.org/job/beam_PostCommit_XVR_Spark/ws/src/sdks/go/test/build.gradle'> line: 173
* What went wrong:
Execution failed for task ':runners:spark:2:job-server:validatesCrossLanguageRunnerGoUsingJava'.
> Process 'command 'sh'' finished with non-zero exit value 1
* Try:
> Run with --stacktrace option to get the stack trace.
> Run with --info or --debug option to get more log output.
> Run with --scan to get full insights.
* Get more help at https://help.gradle.org
Deprecated Gradle features were used in this build, making it incompatible with Gradle 8.0.
You can use '--warning-mode all' to show the individual deprecation warnings and determine if they come from your own scripts or plugins.
See https://docs.gradle.org/7.3.2/userguide/command_line_interface.html#sec:command_line_warnings
Execution optimizations have been disabled for 1 invalid unit(s) of work during this build to ensure correctness.
Please consult deprecation warnings for more details.
BUILD FAILED in 33m 13s
240 actionable tasks: 176 executed, 56 from cache, 8 up-to-date
Publishing build scan...
https://gradle.com/s/qsvex4r7nblpy
Build step 'Invoke Gradle script' changed build result to FAILURE
Build step 'Invoke Gradle script' marked build as failure
---------------------------------------------------------------------
To unsubscribe, e-mail: builds-unsubscribe@beam.apache.org
For additional commands, e-mail: builds-help@beam.apache.org