You are viewing a plain text version of this content. The canonical link for it is here.
Posted to builds@beam.apache.org by Apache Jenkins Server <je...@builds.apache.org> on 2022/08/08 14:41:10 UTC
Build failed in Jenkins: beam_PostCommit_Python39 #703
See <https://ci-beam.apache.org/job/beam_PostCommit_Python39/703/display/redirect>
Changes:
------------------------------------------
[...truncated 43.64 MB...]
[32mINFO [0m apache_beam.runners.dataflow.dataflow_runner:dataflow_runner.py:242 2022-08-08T13:38:49.286Z: JOB_MESSAGE_BASIC: Executing operation Create/Impulse+Create/FlatMap(<lambda at core.py:3481>)+Create/MaybeReshuffle/Reshuffle/AddRandomKeys+Create/MaybeReshuffle/Reshuffle/ReshufflePerKey/Map(reify_timestamps)+Create/MaybeReshuffle/Reshuffle/ReshufflePerKey/GroupByKey/Reify+Create/MaybeReshuffle/Reshuffle/ReshufflePerKey/GroupByKey/Write
[32mINFO [0m apache_beam.runners.dataflow.dataflow_runner:dataflow_runner.py:242 2022-08-08T13:39:09.539Z: JOB_MESSAGE_BASIC: Your project already contains 100 Dataflow-created metric descriptors, so new user metrics of the form custom.googleapis.com/* will not be created. However, all user metrics are also available in the metric dataflow.googleapis.com/job/user_counter. If you rely on the custom metrics, you can delete old / unused metric descriptors. See https://developers.google.com/apis-explorer/#p/monitoring/v3/monitoring.projects.metricDescriptors.list and https://developers.google.com/apis-explorer/#p/monitoring/v3/monitoring.projects.metricDescriptors.delete
[32mINFO [0m apache_beam.runners.dataflow.dataflow_runner:dataflow_runner.py:242 2022-08-08T13:39:24.211Z: JOB_MESSAGE_DETAILED: Autoscaling: Raised the number of workers to 1 based on the rate of progress in the currently running stage(s).
[32mINFO [0m apache_beam.runners.dataflow.dataflow_runner:dataflow_runner.py:242 2022-08-08T13:39:53.576Z: JOB_MESSAGE_DETAILED: Workers have started successfully.
[32mINFO [0m apache_beam.runners.dataflow.dataflow_runner:dataflow_runner.py:242 2022-08-08T13:45:13.603Z: JOB_MESSAGE_BASIC: Finished operation Create/Impulse+Create/FlatMap(<lambda at core.py:3481>)+Create/MaybeReshuffle/Reshuffle/AddRandomKeys+Create/MaybeReshuffle/Reshuffle/ReshufflePerKey/Map(reify_timestamps)+Create/MaybeReshuffle/Reshuffle/ReshufflePerKey/GroupByKey/Reify+Create/MaybeReshuffle/Reshuffle/ReshufflePerKey/GroupByKey/Write
[32mINFO [0m apache_beam.runners.dataflow.dataflow_runner:dataflow_runner.py:242 2022-08-08T13:45:13.717Z: JOB_MESSAGE_BASIC: Executing operation Create/MaybeReshuffle/Reshuffle/ReshufflePerKey/GroupByKey/Close
[32mINFO [0m apache_beam.runners.dataflow.dataflow_runner:dataflow_runner.py:242 2022-08-08T13:45:13.788Z: JOB_MESSAGE_BASIC: Finished operation Create/MaybeReshuffle/Reshuffle/ReshufflePerKey/GroupByKey/Close
[32mINFO [0m apache_beam.runners.dataflow.dataflow_runner:dataflow_runner.py:242 2022-08-08T13:45:13.864Z: JOB_MESSAGE_BASIC: Executing operation GroupByKey/Create
[32mINFO [0m apache_beam.runners.dataflow.dataflow_runner:dataflow_runner.py:242 2022-08-08T13:45:14.086Z: JOB_MESSAGE_BASIC: Finished operation GroupByKey/Create
[32mINFO [0m apache_beam.runners.dataflow.dataflow_runner:dataflow_runner.py:242 2022-08-08T13:45:14.153Z: JOB_MESSAGE_DEBUG: Value "GroupByKey/Session" materialized.
[32mINFO [0m apache_beam.runners.dataflow.dataflow_runner:dataflow_runner.py:242 2022-08-08T13:45:14.259Z: JOB_MESSAGE_BASIC: Executing operation Create/MaybeReshuffle/Reshuffle/ReshufflePerKey/GroupByKey/Read+Create/MaybeReshuffle/Reshuffle/ReshufflePerKey/GroupByKey/GroupByWindow+Create/MaybeReshuffle/Reshuffle/ReshufflePerKey/FlatMap(restore_timestamps)+Create/MaybeReshuffle/Reshuffle/RemoveRandomKeys+Create/Map(decode)+metrics+map_to_common_key+GroupByKey/Write
[32mINFO [0m apache_beam.runners.dataflow.dataflow_runner:dataflow_runner.py:242 2022-08-08T13:45:21.872Z: JOB_MESSAGE_BASIC: Finished operation Create/MaybeReshuffle/Reshuffle/ReshufflePerKey/GroupByKey/Read+Create/MaybeReshuffle/Reshuffle/ReshufflePerKey/GroupByKey/GroupByWindow+Create/MaybeReshuffle/Reshuffle/ReshufflePerKey/FlatMap(restore_timestamps)+Create/MaybeReshuffle/Reshuffle/RemoveRandomKeys+Create/Map(decode)+metrics+map_to_common_key+GroupByKey/Write
[32mINFO [0m apache_beam.runners.dataflow.dataflow_runner:dataflow_runner.py:242 2022-08-08T13:45:21.936Z: JOB_MESSAGE_BASIC: Executing operation GroupByKey/Close
[32mINFO [0m apache_beam.runners.dataflow.dataflow_runner:dataflow_runner.py:242 2022-08-08T13:45:21.990Z: JOB_MESSAGE_BASIC: Finished operation GroupByKey/Close
[32mINFO [0m apache_beam.runners.dataflow.dataflow_runner:dataflow_runner.py:242 2022-08-08T13:45:22.121Z: JOB_MESSAGE_BASIC: Executing operation GroupByKey/Read+m_out
[32mINFO [0m apache_beam.runners.dataflow.dataflow_runner:dataflow_runner.py:242 2022-08-08T13:45:23.328Z: JOB_MESSAGE_BASIC: Finished operation GroupByKey/Read+m_out
[32mINFO [0m apache_beam.runners.dataflow.dataflow_runner:dataflow_runner.py:242 2022-08-08T13:45:23.402Z: JOB_MESSAGE_DEBUG: Executing success step success17
[32mINFO [0m apache_beam.runners.dataflow.dataflow_runner:dataflow_runner.py:242 2022-08-08T13:45:23.495Z: JOB_MESSAGE_DETAILED: Cleaning up.
[32mINFO [0m apache_beam.runners.dataflow.dataflow_runner:dataflow_runner.py:242 2022-08-08T13:45:23.548Z: JOB_MESSAGE_DEBUG: Starting worker pool teardown.
[32mINFO [0m apache_beam.runners.dataflow.dataflow_runner:dataflow_runner.py:242 2022-08-08T13:45:23.580Z: JOB_MESSAGE_BASIC: Stopping worker pool...
[32mINFO [0m apache_beam.runners.dataflow.dataflow_runner:dataflow_runner.py:242 2022-08-08T13:45:57.198Z: JOB_MESSAGE_DETAILED: Autoscaling: Resized worker pool from 1 to 0.
[32mINFO [0m apache_beam.runners.dataflow.dataflow_runner:dataflow_runner.py:242 2022-08-08T13:45:57.252Z: JOB_MESSAGE_BASIC: Worker pool stopped.
[32mINFO [0m apache_beam.runners.dataflow.dataflow_runner:dataflow_runner.py:242 2022-08-08T13:45:57.289Z: JOB_MESSAGE_DEBUG: Tearing down pending resources...
[32mINFO [0m apache_beam.runners.dataflow.dataflow_runner:dataflow_runner.py:197 Job 2022-08-08_06_38_38-3911306125120860962 is in state JOB_STATE_DONE
[33m=============================== warnings summary ===============================[0m
../../build/gradleenv/-1734967050/lib/python3.9/site-packages/hdfs/config.py:15
../../build/gradleenv/-1734967050/lib/python3.9/site-packages/hdfs/config.py:15
../../build/gradleenv/-1734967050/lib/python3.9/site-packages/hdfs/config.py:15
../../build/gradleenv/-1734967050/lib/python3.9/site-packages/hdfs/config.py:15
../../build/gradleenv/-1734967050/lib/python3.9/site-packages/hdfs/config.py:15
../../build/gradleenv/-1734967050/lib/python3.9/site-packages/hdfs/config.py:15
../../build/gradleenv/-1734967050/lib/python3.9/site-packages/hdfs/config.py:15
../../build/gradleenv/-1734967050/lib/python3.9/site-packages/hdfs/config.py:15
../../build/gradleenv/-1734967050/lib/python3.9/site-packages/hdfs/config.py:15
<https://ci-beam.apache.org/job/beam_PostCommit_Python39/ws/src/build/gradleenv/-1734967050/lib/python3.9/site-packages/hdfs/config.py>:15: DeprecationWarning: the imp module is deprecated in favour of importlib; see the module's documentation for alternative uses
from imp import load_source
../../build/gradleenv/-1734967050/lib/python3.9/site-packages/tenacity/_asyncio.py:42
../../build/gradleenv/-1734967050/lib/python3.9/site-packages/tenacity/_asyncio.py:42
../../build/gradleenv/-1734967050/lib/python3.9/site-packages/tenacity/_asyncio.py:42
../../build/gradleenv/-1734967050/lib/python3.9/site-packages/tenacity/_asyncio.py:42
../../build/gradleenv/-1734967050/lib/python3.9/site-packages/tenacity/_asyncio.py:42
../../build/gradleenv/-1734967050/lib/python3.9/site-packages/tenacity/_asyncio.py:42
../../build/gradleenv/-1734967050/lib/python3.9/site-packages/tenacity/_asyncio.py:42
../../build/gradleenv/-1734967050/lib/python3.9/site-packages/tenacity/_asyncio.py:42
<https://ci-beam.apache.org/job/beam_PostCommit_Python39/ws/src/build/gradleenv/-1734967050/lib/python3.9/site-packages/tenacity/_asyncio.py>:42: DeprecationWarning: "@coroutine" decorator is deprecated since Python 3.8, use "async def" instead
def call(self, fn, *args, **kwargs):
apache_beam/examples/complete/game/leader_board_it_test.py::LeaderBoardIT::test_leader_board_it
apache_beam/examples/complete/game/game_stats_it_test.py::GameStatsIT::test_game_stats_it
apache_beam/examples/complete/game/hourly_team_score_it_test.py::HourlyTeamScoreIT::test_hourly_team_score_it
apache_beam/io/gcp/bigquery_test.py::PubSubBigQueryIT::test_file_loads
apache_beam/io/gcp/bigquery_test.py::PubSubBigQueryIT::test_streaming_inserts
<https://ci-beam.apache.org/job/beam_PostCommit_Python39/ws/src/sdks/python/apache_beam/io/gcp/tests/utils.py>:63: PendingDeprecationWarning: Client.dataset is deprecated and will be removed in a future version. Use a string like 'my_project.my_dataset' or a cloud.google.bigquery.DatasetReference object, instead.
dataset_ref = client.dataset(unique_dataset_name, project=project)
apache_beam/examples/complete/game/leader_board_it_test.py: 2 warnings
apache_beam/examples/complete/game/game_stats_it_test.py: 2 warnings
apache_beam/examples/cookbook/bigquery_tornadoes_it_test.py: 1 warning
apache_beam/examples/complete/game/hourly_team_score_it_test.py: 1 warning
apache_beam/io/gcp/bigquery_file_loads_test.py: 3 warnings
apache_beam/io/gcp/bigquery_test.py: 6 warnings
apache_beam/io/gcp/bigquery_json_it_test.py: 2 warnings
apache_beam/io/gcp/big_query_query_to_table_it_test.py: 6 warnings
apache_beam/io/gcp/bigquery_write_it_test.py: 4 warnings
<https://ci-beam.apache.org/job/beam_PostCommit_Python39/ws/src/sdks/python/apache_beam/io/gcp/bigquery.py>:2288: BeamDeprecationWarning: options is deprecated since First stable release. References to <pipeline>.options will not be supported
is_streaming_pipeline = p.options.view_as(StandardOptions).streaming
apache_beam/examples/complete/game/leader_board_it_test.py: 2 warnings
apache_beam/examples/complete/game/game_stats_it_test.py: 2 warnings
apache_beam/examples/cookbook/bigquery_tornadoes_it_test.py: 1 warning
apache_beam/examples/complete/game/hourly_team_score_it_test.py: 1 warning
apache_beam/io/gcp/bigquery_file_loads_test.py: 3 warnings
apache_beam/io/gcp/bigquery_test.py: 6 warnings
apache_beam/io/gcp/bigquery_json_it_test.py: 2 warnings
apache_beam/io/gcp/big_query_query_to_table_it_test.py: 6 warnings
apache_beam/io/gcp/bigquery_write_it_test.py: 4 warnings
<https://ci-beam.apache.org/job/beam_PostCommit_Python39/ws/src/sdks/python/apache_beam/io/gcp/bigquery.py>:2294: BeamDeprecationWarning: options is deprecated since First stable release. References to <pipeline>.options will not be supported
experiments = p.options.view_as(DebugOptions).experiments or []
apache_beam/examples/cookbook/bigquery_tornadoes_it_test.py: 1 warning
apache_beam/examples/dataframe/flight_delays_it_test.py: 1 warning
apache_beam/io/gcp/bigquery_read_it_test.py: 7 warnings
apache_beam/io/gcp/bigquery_json_it_test.py: 3 warnings
apache_beam/io/gcp/big_query_query_to_table_it_test.py: 6 warnings
apache_beam/io/gcp/bigquery_io_read_it_test.py: 2 warnings
<https://ci-beam.apache.org/job/beam_PostCommit_Python39/ws/src/sdks/python/apache_beam/io/gcp/bigquery.py>:2778: BeamDeprecationWarning: options is deprecated since First stable release. References to <pipeline>.options will not be supported
temp_location = pcoll.pipeline.options.view_as(
apache_beam/examples/cookbook/bigquery_tornadoes_it_test.py: 1 warning
apache_beam/examples/dataframe/flight_delays_it_test.py: 1 warning
apache_beam/io/gcp/bigquery_read_it_test.py: 7 warnings
apache_beam/io/gcp/bigquery_json_it_test.py: 3 warnings
apache_beam/io/gcp/big_query_query_to_table_it_test.py: 6 warnings
apache_beam/io/gcp/bigquery_io_read_it_test.py: 2 warnings
<https://ci-beam.apache.org/job/beam_PostCommit_Python39/ws/src/sdks/python/apache_beam/io/gcp/bigquery.py>:2780: BeamDeprecationWarning: options is deprecated since First stable release. References to <pipeline>.options will not be supported
job_name = pcoll.pipeline.options.view_as(GoogleCloudOptions).job_name
apache_beam/examples/cookbook/bigquery_tornadoes_it_test.py: 1 warning
apache_beam/examples/dataframe/flight_delays_it_test.py: 1 warning
apache_beam/io/gcp/bigquery_read_it_test.py: 7 warnings
apache_beam/io/gcp/bigquery_json_it_test.py: 3 warnings
apache_beam/io/gcp/big_query_query_to_table_it_test.py: 6 warnings
apache_beam/io/gcp/bigquery_io_read_it_test.py: 2 warnings
<https://ci-beam.apache.org/job/beam_PostCommit_Python39/ws/src/sdks/python/apache_beam/io/gcp/bigquery.py>:2804: BeamDeprecationWarning: options is deprecated since First stable release. References to <pipeline>.options will not be supported
pipeline_options=pcoll.pipeline.options,
apache_beam/examples/cookbook/bigquery_tornadoes_it_test.py: 1 warning
apache_beam/io/gcp/big_query_query_to_table_it_test.py: 6 warnings
apache_beam/io/gcp/bigquery_write_it_test.py: 4 warnings
apache_beam/io/gcp/bigquery_test.py: 2 warnings
<https://ci-beam.apache.org/job/beam_PostCommit_Python39/ws/src/sdks/python/apache_beam/io/gcp/bigquery.py>:2284: BeamDeprecationWarning: options is deprecated since First stable release. References to <pipeline>.options will not be supported
self.table_reference.projectId = pcoll.pipeline.options.view_as(
apache_beam/examples/cookbook/bigquery_tornadoes_it_test.py: 1 warning
apache_beam/examples/complete/game/hourly_team_score_it_test.py: 1 warning
apache_beam/io/gcp/bigquery_file_loads_test.py: 3 warnings
apache_beam/io/gcp/big_query_query_to_table_it_test.py: 6 warnings
apache_beam/io/gcp/bigquery_test.py: 3 warnings
apache_beam/io/gcp/bigquery_write_it_test.py: 3 warnings
<https://ci-beam.apache.org/job/beam_PostCommit_Python39/ws/src/sdks/python/apache_beam/io/gcp/bigquery_file_loads.py>:1129: BeamDeprecationWarning: options is deprecated since First stable release. References to <pipeline>.options will not be supported
temp_location = p.options.view_as(GoogleCloudOptions).temp_location
apache_beam/examples/cookbook/bigquery_tornadoes_it_test.py: 1 warning
apache_beam/examples/complete/game/hourly_team_score_it_test.py: 1 warning
apache_beam/io/gcp/bigquery_file_loads_test.py: 3 warnings
apache_beam/io/gcp/big_query_query_to_table_it_test.py: 6 warnings
apache_beam/io/gcp/bigquery_test.py: 3 warnings
apache_beam/io/gcp/bigquery_write_it_test.py: 3 warnings
<https://ci-beam.apache.org/job/beam_PostCommit_Python39/ws/src/sdks/python/apache_beam/io/gcp/bigquery_file_loads.py>:1131: BeamDeprecationWarning: options is deprecated since First stable release. References to <pipeline>.options will not be supported
p.options.view_as(GoogleCloudOptions).job_name or 'AUTOMATIC_JOB_NAME')
apache_beam/examples/cookbook/bigquery_tornadoes_it_test.py::BigqueryTornadoesIT::test_bigquery_tornadoes_it
<https://ci-beam.apache.org/job/beam_PostCommit_Python39/ws/src/sdks/python/apache_beam/io/gcp/tests/utils.py>:100: PendingDeprecationWarning: Client.dataset is deprecated and will be removed in a future version. Use a string like 'my_project.my_dataset' or a cloud.google.bigquery.DatasetReference object, instead.
table_ref = client.dataset(dataset_id).table(table_id)
apache_beam/examples/dataframe/taxiride_it_test.py::TaxirideIT::test_aggregation
apache_beam/examples/dataframe/flight_delays_it_test.py::FlightDelaysTest::test_flight_delays
apache_beam/examples/dataframe/taxiride_it_test.py::TaxirideIT::test_enrich
<https://ci-beam.apache.org/job/beam_PostCommit_Python39/ws/src/sdks/python/apache_beam/dataframe/io.py>:629: FutureWarning: WriteToFiles is experimental.
return pcoll | fileio.WriteToFiles(
apache_beam/examples/dataframe/taxiride_it_test.py::TaxirideIT::test_aggregation
apache_beam/examples/dataframe/flight_delays_it_test.py::FlightDelaysTest::test_flight_delays
apache_beam/examples/dataframe/taxiride_it_test.py::TaxirideIT::test_enrich
<https://ci-beam.apache.org/job/beam_PostCommit_Python39/ws/src/sdks/python/apache_beam/io/fileio.py>:581: BeamDeprecationWarning: options is deprecated since First stable release. References to <pipeline>.options will not be supported
p.options.view_as(GoogleCloudOptions).temp_location or
apache_beam/io/gcp/bigquery_json_it_test.py: 1 warning
apache_beam/io/gcp/bigquery_read_it_test.py: 9 warnings
<https://ci-beam.apache.org/job/beam_PostCommit_Python39/ws/src/sdks/python/apache_beam/io/gcp/bigquery.py>:2822: BeamDeprecationWarning: options is deprecated since First stable release. References to <pipeline>.options will not be supported
project_id = pcoll.pipeline.options.view_as(GoogleCloudOptions).project
apache_beam/io/gcp/bigquery_json_it_test.py: 1 warning
apache_beam/io/gcp/bigquery_read_it_test.py: 9 warnings
<https://ci-beam.apache.org/job/beam_PostCommit_Python39/ws/src/sdks/python/apache_beam/io/gcp/bigquery.py>:2843: BeamDeprecationWarning: options is deprecated since First stable release. References to <pipeline>.options will not be supported
pipeline_options=pcoll.pipeline.options,
apache_beam/examples/dataframe/flight_delays_it_test.py::FlightDelaysTest::test_flight_delays
<https://ci-beam.apache.org/job/beam_PostCommit_Python39/ws/src/sdks/python/apache_beam/examples/dataframe/flight_delays.py>:47: FutureWarning: Dropping of nuisance columns in DataFrame reductions (with 'numeric_only=None') is deprecated; in a future version this will raise TypeError. Select only valid columns before calling the reduction.
return airline_df[at_top_airports].mean()
apache_beam/io/gcp/bigquery_test.py::BigQueryStreamingInsertTransformIntegrationTests::test_multiple_destinations_transform
<https://ci-beam.apache.org/job/beam_PostCommit_Python39/ws/src/sdks/python/apache_beam/io/gcp/bigquery_test.py>:1846: BeamDeprecationWarning: options is deprecated since First stable release. References to <pipeline>.options will not be supported
streaming = self.test_pipeline.options.view_as(StandardOptions).streaming
apache_beam/io/gcp/bigquery_read_it_test.py::ReadTests::test_native_source
<https://ci-beam.apache.org/job/beam_PostCommit_Python39/ws/src/sdks/python/apache_beam/io/gcp/bigquery_read_it_test.py>:171: BeamDeprecationWarning: BigQuerySource is deprecated since 2.25.0. Use ReadFromBigQuery instead.
beam.io.BigQuerySource(query=self.query, use_standard_sql=True)))
apache_beam/io/gcp/big_query_query_to_table_it_test.py::BigQueryQueryToTableIT::test_big_query_new_types_native
apache_beam/io/gcp/big_query_query_to_table_it_test.py::BigQueryQueryToTableIT::test_big_query_standard_sql_kms_key_native
<https://ci-beam.apache.org/job/beam_PostCommit_Python39/ws/src/sdks/python/apache_beam/io/gcp/big_query_query_to_table_pipeline.py>:81: BeamDeprecationWarning: BigQuerySource is deprecated since 2.25.0. Use ReadFromBigQuery instead.
beam.io.BigQuerySource(
apache_beam/io/gcp/big_query_query_to_table_it_test.py::BigQueryQueryToTableIT::test_big_query_new_types_native
apache_beam/io/gcp/big_query_query_to_table_it_test.py::BigQueryQueryToTableIT::test_big_query_standard_sql_kms_key_native
<https://ci-beam.apache.org/job/beam_PostCommit_Python39/ws/src/sdks/python/apache_beam/runners/dataflow/ptransform_overrides.py>:316: BeamDeprecationWarning: BigQuerySink is deprecated since 2.11.0. Use WriteToBigQuery instead.
io.BigQuerySink(
apache_beam/ml/gcp/cloud_dlp_it_test.py::CloudDLPIT::test_deidentification
<https://ci-beam.apache.org/job/beam_PostCommit_Python39/ws/src/sdks/python/apache_beam/ml/gcp/cloud_dlp_it_test.py>:74: FutureWarning: MaskDetectedDetails is experimental.
| MaskDetectedDetails(
apache_beam/ml/gcp/cloud_dlp_it_test.py::CloudDLPIT::test_inspection
<https://ci-beam.apache.org/job/beam_PostCommit_Python39/ws/src/sdks/python/apache_beam/ml/gcp/cloud_dlp_it_test.py>:85: FutureWarning: InspectForDetails is experimental.
| InspectForDetails(
apache_beam/io/gcp/bigquery_read_it_test.py::ReadNewTypesTests::test_native_source
<https://ci-beam.apache.org/job/beam_PostCommit_Python39/ws/src/sdks/python/apache_beam/io/gcp/bigquery_read_it_test.py>:646: BeamDeprecationWarning: BigQuerySource is deprecated since 2.25.0. Use ReadFromBigQuery instead.
beam.io.BigQuerySource(query=self.query, use_standard_sql=True)))
apache_beam/io/gcp/bigquery_read_it_test.py::ReadAllBQTests::test_read_queries
<https://ci-beam.apache.org/job/beam_PostCommit_Python39/ws/src/sdks/python/apache_beam/io/gcp/bigquery_read_it_test.py>:761: FutureWarning: ReadAllFromBigQuery is experimental.
| beam.io.ReadAllFromBigQuery())
apache_beam/io/gcp/bigquery_read_it_test.py::ReadAllBQTests::test_read_queries
<https://ci-beam.apache.org/job/beam_PostCommit_Python39/ws/src/sdks/python/apache_beam/io/gcp/bigquery.py>:2953: BeamDeprecationWarning: options is deprecated since First stable release. References to <pipeline>.options will not be supported
job_name = pcoll.pipeline.options.view_as(GoogleCloudOptions).job_name
apache_beam/io/gcp/bigquery_read_it_test.py::ReadAllBQTests::test_read_queries
<https://ci-beam.apache.org/job/beam_PostCommit_Python39/ws/src/sdks/python/apache_beam/io/gcp/bigquery.py>:2954: BeamDeprecationWarning: options is deprecated since First stable release. References to <pipeline>.options will not be supported
project = pcoll.pipeline.options.view_as(GoogleCloudOptions).project
apache_beam/io/gcp/bigquery_read_it_test.py::ReadAllBQTests::test_read_queries
<https://ci-beam.apache.org/job/beam_PostCommit_Python39/ws/src/sdks/python/apache_beam/io/gcp/bigquery.py>:2967: BeamDeprecationWarning: options is deprecated since First stable release. References to <pipeline>.options will not be supported
options=pcoll.pipeline.options,
-- Docs: https://docs.pytest.org/en/stable/how-to/capture-warnings.html
- generated xml file: <https://ci-beam.apache.org/job/beam_PostCommit_Python39/ws/src/sdks/python/pytest_postCommitIT-df-py39.xml> -
=========================== short test summary info ============================
FAILED apache_beam/runners/dataflow/dataflow_exercise_metrics_pipeline_test.py::ExerciseMetricsPipelineTest::test_metrics_it
[31m===== [31m[1m1 failed[0m, [32m82 passed[0m, [33m11 skipped[0m, [33m224 warnings[0m[31m in 8852.88s (2:27:32)[0m[31m ======[0m
> Task :sdks:python:test-suites:dataflow:py39:postCommitIT FAILED
FAILURE: Build failed with an exception.
* Where:
Script '<https://ci-beam.apache.org/job/beam_PostCommit_Python39/ws/src/sdks/python/test-suites/dataflow/common.gradle'> line: 121
* What went wrong:
Execution failed for task ':sdks:python:test-suites:dataflow:py39:postCommitIT'.
> Process 'command 'sh'' finished with non-zero exit value 1
* Try:
> Run with --stacktrace option to get the stack trace.
> Run with --info or --debug option to get more log output.
> Run with --scan to get full insights.
* Get more help at https://help.gradle.org
Deprecated Gradle features were used in this build, making it incompatible with Gradle 8.0.
You can use '--warning-mode all' to show the individual deprecation warnings and determine if they come from your own scripts or plugins.
See https://docs.gradle.org/7.4/userguide/command_line_interface.html#sec:command_line_warnings
Execution optimizations have been disabled for 1 invalid unit(s) of work during this build to ensure correctness.
Please consult deprecation warnings for more details.
BUILD FAILED in 2h 29m 44s
222 actionable tasks: 152 executed, 64 from cache, 6 up-to-date
Publishing build scan...
https://gradle.com/s/vpxlwluayyluo
Build step 'Invoke Gradle script' changed build result to FAILURE
Build step 'Invoke Gradle script' marked build as failure
---------------------------------------------------------------------
To unsubscribe, e-mail: builds-unsubscribe@beam.apache.org
For additional commands, e-mail: builds-help@beam.apache.org
Jenkins build is back to normal : beam_PostCommit_Python39 #708
Posted by Apache Jenkins Server <je...@builds.apache.org>.
See <https://ci-beam.apache.org/job/beam_PostCommit_Python39/708/display/redirect?page=changes>
---------------------------------------------------------------------
To unsubscribe, e-mail: builds-unsubscribe@beam.apache.org
For additional commands, e-mail: builds-help@beam.apache.org
beam_PostCommit_Python39 - Build # 707 - Aborted!
Posted by Apache Jenkins Server <je...@builds.apache.org>.
beam_PostCommit_Python39 - Build # 707 - Aborted:
Check console output at https://ci-beam.apache.org/job/beam_PostCommit_Python39/707/ to view the results.
beam_PostCommit_Python39 - Build # 706 - Aborted!
Posted by Apache Jenkins Server <je...@builds.apache.org>.
beam_PostCommit_Python39 - Build # 706 - Aborted:
Check console output at https://ci-beam.apache.org/job/beam_PostCommit_Python39/706/ to view the results.
beam_PostCommit_Python39 - Build # 705 - Aborted!
Posted by Apache Jenkins Server <je...@builds.apache.org>.
beam_PostCommit_Python39 - Build # 705 - Aborted:
Check console output at https://ci-beam.apache.org/job/beam_PostCommit_Python39/705/ to view the results.
Build failed in Jenkins: beam_PostCommit_Python39 #704
Posted by Apache Jenkins Server <je...@builds.apache.org>.
See <https://ci-beam.apache.org/job/beam_PostCommit_Python39/704/display/redirect?page=changes>
Changes:
[vlad.matyunin] modifed WithKeys Playground Example
[alexander.zhuravlev] [Playground] Removed banner from Playground header, deleted unused
[noreply] Add PyDoc buttons to the top and bottom of the Machine Learning page
[noreply] [Playground][Backend][Bug]: Moving the initialization of properties file
[noreply] Bump cloud.google.com/go/bigquery from 1.36.0 to 1.37.0 in /sdks
------------------------------------------
[...truncated 29.26 MB...]
timestamp {
seconds: 1659983276
nanos: 345886230
}
message: "No more requests from control plane"
log_location: "/usr/local/lib/python3.9/site-packages/apache_beam/runners/worker/sdk_worker.py:261"
thread: "MainThread"
INFO:root:severity: INFO
timestamp {
seconds: 1659983276
nanos: 346106052
}
message: "SDK Harness waiting for in-flight requests to complete"
log_location: "/usr/local/lib/python3.9/site-packages/apache_beam/runners/worker/sdk_worker.py:262"
thread: "MainThread"
INFO:root:severity: INFO
timestamp {
seconds: 1659983276
nanos: 346192598
}
message: "Closing all cached grpc data channels."
log_location: "/usr/local/lib/python3.9/site-packages/apache_beam/runners/worker/data_plane.py:805"
thread: "MainThread"
INFO:root:severity: INFO
timestamp {
seconds: 1659983276
nanos: 346322059
}
message: "Closing all cached gRPC state handlers."
log_location: "/usr/local/lib/python3.9/site-packages/apache_beam/runners/worker/sdk_worker.py:877"
thread: "MainThread"
INFO:root:severity: INFO
timestamp {
seconds: 1659983276
nanos: 346762895
}
message: "Done consuming work."
log_location: "/usr/local/lib/python3.9/site-packages/apache_beam/runners/worker/sdk_worker.py:274"
thread: "MainThread"
INFO:root:severity: INFO
timestamp {
seconds: 1659983276
nanos: 346916675
}
message: "Python sdk harness exiting."
log_location: "/usr/local/lib/python3.9/site-packages/apache_beam/runners/worker/sdk_worker_main.py:184"
thread: "MainThread"
INFO:apache_beam.runners.portability.local_job_service:Completed job in 14.49142050743103 seconds with state DONE.
INFO:root:Completed job in 14.49142050743103 seconds with state DONE.
INFO:apache_beam.runners.portability.portable_runner:Job state changed to DONE
> Task :sdks:python:test-suites:portable:py39:portableWordCountSparkRunnerBatch
INFO:apache_beam.runners.worker.worker_pool_main:Listening for workers at localhost:44343
INFO:root:Default Python SDK image for environment is apache/beam_python3.9_sdk:2.42.0.dev
INFO:apache_beam.runners.portability.fn_api_runner.translations:==================== <function pack_combiners at 0x7f638c8dbdc0> ====================
INFO:apache_beam.runners.portability.fn_api_runner.translations:==================== <function lift_combiners at 0x7f638c8dbe50> ====================
INFO:apache_beam.runners.portability.fn_api_runner.translations:==================== <function sort_stages at 0x7f638c8dd5e0> ====================
INFO:apache_beam.utils.subprocess_server:Starting service with ['java' '-jar' '<https://ci-beam.apache.org/job/beam_PostCommit_Python39/ws/src/runners/spark/2/job-server/build/libs/beam-runners-spark-job-server-2.42.0-SNAPSHOT.jar'> '--spark-master-url' 'local[4]' '--artifacts-dir' '/tmp/beam-tempkqgd1m1u/artifactsfy4ib2lp' '--job-port' '41647' '--artifact-port' '0' '--expansion-port' '0']
E0808 18:28:01.956910859 4173570 fork_posix.cc:76] Other threads are currently calling into gRPC, skipping fork() handlers
INFO:apache_beam.utils.subprocess_server:22/08/08 18:28:05 WARN software.amazon.awssdk.regions.internal.util.EC2MetadataUtils: Unable to retrieve the requested metadata.
INFO:apache_beam.utils.subprocess_server:22/08/08 18:28:06 INFO org.apache.beam.runners.jobsubmission.JobServerDriver: ArtifactStagingService started on localhost:40223
INFO:apache_beam.utils.subprocess_server:22/08/08 18:28:06 INFO org.apache.beam.runners.jobsubmission.JobServerDriver: Java ExpansionService started on localhost:38073
WARNING:root:Waiting for grpc channel to be ready at localhost:41647.
INFO:apache_beam.utils.subprocess_server:22/08/08 18:28:06 INFO org.apache.beam.runners.jobsubmission.JobServerDriver: JobService started on localhost:41647
INFO:apache_beam.utils.subprocess_server:22/08/08 18:28:06 INFO org.apache.beam.runners.jobsubmission.JobServerDriver: Job server now running, terminate with Ctrl+C
WARNING:apache_beam.options.pipeline_options:Discarding unparseable args: ['--parallelism=2']
INFO:apache_beam.utils.subprocess_server:22/08/08 18:28:07 INFO org.apache.beam.runners.fnexecution.artifact.ArtifactStagingService: Staging artifacts for job_c1c0bf5e-2d08-413c-ad00-a1752f591795.
INFO:apache_beam.utils.subprocess_server:22/08/08 18:28:07 INFO org.apache.beam.runners.fnexecution.artifact.ArtifactStagingService: Resolving artifacts for job_c1c0bf5e-2d08-413c-ad00-a1752f591795.ref_Environment_default_environment_1.
INFO:apache_beam.utils.subprocess_server:22/08/08 18:28:07 INFO org.apache.beam.runners.fnexecution.artifact.ArtifactStagingService: Getting 1 artifacts for job_c1c0bf5e-2d08-413c-ad00-a1752f591795.null.
INFO:apache_beam.utils.subprocess_server:22/08/08 18:28:07 INFO org.apache.beam.runners.fnexecution.artifact.ArtifactStagingService: Artifacts fully staged for job_c1c0bf5e-2d08-413c-ad00-a1752f591795.
INFO:apache_beam.utils.subprocess_server:22/08/08 18:28:08 INFO org.apache.beam.runners.spark.SparkJobInvoker: Invoking job BeamApp-jenkins-0808182808-e7431c23_60596e51-993c-4c53-8f55-c12907761196
INFO:apache_beam.utils.subprocess_server:22/08/08 18:28:08 INFO org.apache.beam.runners.jobsubmission.JobInvocation: Starting job invocation BeamApp-jenkins-0808182808-e7431c23_60596e51-993c-4c53-8f55-c12907761196
INFO:apache_beam.runners.portability.portable_runner:Environment "LOOPBACK" has started a component necessary for the execution. Be sure to run the pipeline using
with Pipeline() as p:
p.apply(..)
This ensures that the pipeline finishes before this program exits.
INFO:apache_beam.runners.portability.portable_runner:Job state changed to STOPPED
INFO:apache_beam.runners.portability.portable_runner:Job state changed to STARTING
INFO:apache_beam.runners.portability.portable_runner:Job state changed to RUNNING
INFO:apache_beam.utils.subprocess_server:22/08/08 18:28:09 INFO org.apache.beam.runners.spark.translation.SparkContextFactory: Creating a brand new Spark Context.
INFO:apache_beam.utils.subprocess_server:22/08/08 18:28:09 WARN org.apache.hadoop.util.NativeCodeLoader: Unable to load native-hadoop library for your platform... using builtin-java classes where applicable
INFO:apache_beam.utils.subprocess_server:22/08/08 18:28:11 WARN org.apache.beam.runners.spark.translation.SparkContextFactory: Support for Spark 2 is deprecated, this runner will be removed in a few releases.
INFO:apache_beam.utils.subprocess_server:Spark 2 is reaching its EOL, consider migrating to Spark 3.
INFO:apache_beam.utils.subprocess_server:22/08/08 18:28:11 INFO org.apache.beam.runners.spark.aggregators.AggregatorsAccumulator: Instantiated aggregators accumulator:
INFO:apache_beam.utils.subprocess_server:22/08/08 18:28:12 INFO org.apache.beam.runners.spark.metrics.MetricsAccumulator: Instantiated metrics accumulator: MetricQueryResults()
INFO:apache_beam.utils.subprocess_server:22/08/08 18:28:12 WARN software.amazon.awssdk.regions.internal.util.EC2MetadataUtils: Unable to retrieve the requested metadata.
INFO:apache_beam.utils.subprocess_server:22/08/08 18:28:12 INFO org.apache.beam.runners.spark.SparkPipelineRunner: Running job BeamApp-jenkins-0808182808-e7431c23_60596e51-993c-4c53-8f55-c12907761196 on Spark master local[4]
INFO:apache_beam.utils.subprocess_server:22/08/08 18:28:13 WARN software.amazon.awssdk.regions.internal.util.EC2MetadataUtils: Unable to retrieve the requested metadata.
INFO:apache_beam.utils.subprocess_server:22/08/08 18:28:13 WARN software.amazon.awssdk.regions.internal.util.EC2MetadataUtils: Unable to retrieve the requested metadata.
INFO:apache_beam.utils.subprocess_server:22/08/08 18:28:13 WARN software.amazon.awssdk.regions.internal.util.EC2MetadataUtils: Unable to retrieve the requested metadata.
INFO:apache_beam.utils.subprocess_server:22/08/08 18:28:13 WARN software.amazon.awssdk.regions.internal.util.EC2MetadataUtils: Unable to retrieve the requested metadata.
INFO:apache_beam.runners.worker.statecache:Creating state cache with size 0
INFO:apache_beam.runners.worker.sdk_worker:Creating insecure control channel for localhost:39799.
INFO:apache_beam.runners.worker.sdk_worker:Control channel established.
INFO:apache_beam.runners.worker.sdk_worker:Initializing SDKHarness with unbounded number of workers.
INFO:apache_beam.utils.subprocess_server:22/08/08 18:28:14 INFO org.apache.beam.runners.fnexecution.control.FnApiControlClientPoolService: Beam Fn Control client connected with id 1-1
INFO:apache_beam.utils.subprocess_server:22/08/08 18:28:14 INFO org.apache.beam.runners.fnexecution.control.FnApiControlClientPoolService: getProcessBundleDescriptor request with id 1-2
INFO:apache_beam.runners.worker.sdk_worker:Creating insecure state channel for localhost:44875.
INFO:apache_beam.runners.worker.sdk_worker:State channel established.
INFO:apache_beam.runners.worker.data_plane:Creating client data channel for localhost:36921
INFO:apache_beam.utils.subprocess_server:22/08/08 18:28:14 INFO org.apache.beam.runners.fnexecution.data.GrpcDataService: Beam Fn Data client connected.
INFO:apache_beam.utils.subprocess_server:22/08/08 18:28:14 INFO org.apache.beam.runners.fnexecution.control.FnApiControlClientPoolService: getProcessBundleDescriptor request with id 1-3
INFO:apache_beam.utils.subprocess_server:22/08/08 18:28:14 WARN software.amazon.awssdk.regions.internal.util.EC2MetadataUtils: Unable to retrieve the requested metadata.
INFO:apache_beam.utils.subprocess_server:22/08/08 18:28:14 WARN software.amazon.awssdk.regions.internal.util.EC2MetadataUtils: Unable to retrieve the requested metadata.
INFO:apache_beam.utils.subprocess_server:22/08/08 18:28:14 WARN software.amazon.awssdk.regions.internal.util.EC2MetadataUtils: Unable to retrieve the requested metadata.
INFO:apache_beam.utils.subprocess_server:22/08/08 18:28:14 WARN software.amazon.awssdk.regions.internal.util.EC2MetadataUtils: Unable to retrieve the requested metadata.
INFO:apache_beam.utils.subprocess_server:22/08/08 18:28:14 INFO org.apache.beam.runners.fnexecution.control.FnApiControlClientPoolService: getProcessBundleDescriptor request with id 1-4
INFO:apache_beam.utils.subprocess_server:22/08/08 18:28:14 INFO org.apache.beam.runners.fnexecution.control.FnApiControlClientPoolService: getProcessBundleDescriptor request with id 1-5
INFO:apache_beam.utils.subprocess_server:22/08/08 18:28:14 WARN software.amazon.awssdk.regions.internal.util.EC2MetadataUtils: Unable to retrieve the requested metadata.
INFO:apache_beam.utils.subprocess_server:22/08/08 18:28:14 WARN software.amazon.awssdk.regions.internal.util.EC2MetadataUtils: Unable to retrieve the requested metadata.
INFO:apache_beam.utils.subprocess_server:22/08/08 18:28:14 WARN software.amazon.awssdk.regions.internal.util.EC2MetadataUtils: Unable to retrieve the requested metadata.
INFO:apache_beam.utils.subprocess_server:22/08/08 18:28:14 WARN software.amazon.awssdk.regions.internal.util.EC2MetadataUtils: Unable to retrieve the requested metadata.
INFO:apache_beam.utils.subprocess_server:22/08/08 18:28:14 INFO org.apache.beam.runners.fnexecution.control.FnApiControlClientPoolService: getProcessBundleDescriptor request with id 1-8
INFO:apache_beam.utils.subprocess_server:22/08/08 18:28:14 INFO org.apache.beam.runners.fnexecution.control.FnApiControlClientPoolService: getProcessBundleDescriptor request with id 1-6
INFO:apache_beam.utils.subprocess_server:22/08/08 18:28:14 INFO org.apache.beam.runners.fnexecution.control.FnApiControlClientPoolService: getProcessBundleDescriptor request with id 1-9
INFO:apache_beam.utils.subprocess_server:22/08/08 18:28:14 INFO org.apache.beam.runners.fnexecution.control.FnApiControlClientPoolService: getProcessBundleDescriptor request with id 1-7
INFO:apache_beam.utils.subprocess_server:22/08/08 18:28:14 INFO org.apache.beam.runners.fnexecution.control.FnApiControlClientPoolService: getProcessBundleDescriptor request with id 1-11
INFO:apache_beam.utils.subprocess_server:22/08/08 18:28:14 INFO org.apache.beam.runners.fnexecution.control.FnApiControlClientPoolService: getProcessBundleDescriptor request with id 1-10
INFO:apache_beam.utils.subprocess_server:22/08/08 18:28:14 INFO org.apache.beam.runners.fnexecution.control.FnApiControlClientPoolService: getProcessBundleDescriptor request with id 1-12
INFO:apache_beam.utils.subprocess_server:22/08/08 18:28:14 INFO org.apache.beam.runners.fnexecution.control.FnApiControlClientPoolService: getProcessBundleDescriptor request with id 1-13
INFO:apache_beam.utils.subprocess_server:22/08/08 18:28:15 WARN software.amazon.awssdk.regions.internal.util.EC2MetadataUtils: Unable to retrieve the requested metadata.
INFO:apache_beam.utils.subprocess_server:22/08/08 18:28:15 WARN software.amazon.awssdk.regions.internal.util.EC2MetadataUtils: Unable to retrieve the requested metadata.
INFO:apache_beam.utils.subprocess_server:22/08/08 18:28:15 WARN software.amazon.awssdk.regions.internal.util.EC2MetadataUtils: Unable to retrieve the requested metadata.
INFO:apache_beam.utils.subprocess_server:22/08/08 18:28:15 WARN software.amazon.awssdk.regions.internal.util.EC2MetadataUtils: Unable to retrieve the requested metadata.
INFO:apache_beam.utils.subprocess_server:22/08/08 18:28:15 INFO org.apache.beam.runners.fnexecution.control.FnApiControlClientPoolService: getProcessBundleDescriptor request with id 1-14
INFO:apache_beam.utils.subprocess_server:22/08/08 18:28:15 WARN software.amazon.awssdk.regions.internal.util.EC2MetadataUtils: Unable to retrieve the requested metadata.
INFO:apache_beam.utils.subprocess_server:22/08/08 18:28:15 WARN software.amazon.awssdk.regions.internal.util.EC2MetadataUtils: Unable to retrieve the requested metadata.
INFO:apache_beam.utils.subprocess_server:22/08/08 18:28:15 WARN software.amazon.awssdk.regions.internal.util.EC2MetadataUtils: Unable to retrieve the requested metadata.
INFO:apache_beam.utils.subprocess_server:22/08/08 18:28:15 WARN software.amazon.awssdk.regions.internal.util.EC2MetadataUtils: Unable to retrieve the requested metadata.
INFO:apache_beam.utils.subprocess_server:22/08/08 18:28:15 INFO org.apache.beam.runners.fnexecution.control.FnApiControlClientPoolService: getProcessBundleDescriptor request with id 1-15
INFO:apache_beam.utils.subprocess_server:22/08/08 18:28:15 INFO org.apache.beam.runners.spark.SparkPipelineRunner: Job BeamApp-jenkins-0808182808-e7431c23_60596e51-993c-4c53-8f55-c12907761196: Pipeline translated successfully. Computing outputs
INFO:apache_beam.utils.subprocess_server:22/08/08 18:28:15 WARN software.amazon.awssdk.regions.internal.util.EC2MetadataUtils: Unable to retrieve the requested metadata.
INFO:apache_beam.utils.subprocess_server:22/08/08 18:28:15 WARN software.amazon.awssdk.regions.internal.util.EC2MetadataUtils: Unable to retrieve the requested metadata.
INFO:apache_beam.utils.subprocess_server:22/08/08 18:28:15 WARN software.amazon.awssdk.regions.internal.util.EC2MetadataUtils: Unable to retrieve the requested metadata.
INFO:apache_beam.utils.subprocess_server:22/08/08 18:28:15 WARN software.amazon.awssdk.regions.internal.util.EC2MetadataUtils: Unable to retrieve the requested metadata.
INFO:apache_beam.utils.subprocess_server:22/08/08 18:28:15 INFO org.apache.beam.runners.fnexecution.control.FnApiControlClientPoolService: getProcessBundleDescriptor request with id 1-16
INFO:apache_beam.io.filebasedsink:Starting finalize_write threads with num_shards: 4 (skipped: 0), batches: 4, num_threads: 4
INFO:apache_beam.io.filebasedsink:Renamed 4 shards in 0.01 seconds.
INFO:apache_beam.utils.subprocess_server:22/08/08 18:28:15 INFO org.apache.beam.runners.spark.SparkPipelineRunner: Job BeamApp-jenkins-0808182808-e7431c23_60596e51-993c-4c53-8f55-c12907761196 finished.
INFO:apache_beam.runners.portability.portable_runner:Job state changed to DONE
Exception in thread run_worker_1-1:
Traceback (most recent call last):
File "/usr/lib/python3.9/threading.py", line 973, in _bootstrap_inner
Exception in thread read_state:
Traceback (most recent call last):
File "/usr/lib/python3.9/threading.py", line 973, in _bootstrap_inner
self.run()
File "/usr/lib/python3.9/threading.py", line 910, in run
self._target(*self._args, **self._kwargs)
self.run()
File "/usr/lib/python3.9/threading.py", line 910, in run
File "<https://ci-beam.apache.org/job/beam_PostCommit_Python39/ws/src/sdks/python/apache_beam/runners/worker/sdk_worker.py",> line 1008, in pull_responses
ERROR:apache_beam.runners.worker.data_plane:Failed to read inputs in the data plane.
Traceback (most recent call last):
File "<https://ci-beam.apache.org/job/beam_PostCommit_Python39/ws/src/sdks/python/apache_beam/runners/worker/data_plane.py",> line 654, in _read_inputs
for elements in elements_iterator:
File "<https://ci-beam.apache.org/job/beam_PostCommit_Python39/ws/src/build/gradleenv/2022703443/lib/python3.9/site-packages/grpc/_channel.py",> line 426, in __next__
return self._next()
File "<https://ci-beam.apache.org/job/beam_PostCommit_Python39/ws/src/build/gradleenv/2022703443/lib/python3.9/site-packages/grpc/_channel.py",> line 826, in _next
raise self
grpc._channel._MultiThreadedRendezvous: <_MultiThreadedRendezvous of RPC that terminated with:
status = StatusCode.UNAVAILABLE
details = "Socket closed"
debug_error_string = "{"created":"@1659983295.833016832","description":"Error received from peer ipv6:[::1]:36921","file":"src/core/lib/surface/call.cc","file_line":966,"grpc_message":"Socket closed","grpc_status":14}"
>
Exception in thread read_grpc_client_inputs:
Traceback (most recent call last):
File "/usr/lib/python3.9/threading.py", line 973, in _bootstrap_inner
for response in responses:
self._target(*self._args, **self._kwargs)
File "<https://ci-beam.apache.org/job/beam_PostCommit_Python39/ws/src/build/gradleenv/2022703443/lib/python3.9/site-packages/grpc/_channel.py",> line 426, in __next__
File "<https://ci-beam.apache.org/job/beam_PostCommit_Python39/ws/src/sdks/python/apache_beam/runners/worker/sdk_worker.py",> line 251, in run
self.run()
return self._next()
File "<https://ci-beam.apache.org/job/beam_PostCommit_Python39/ws/src/build/gradleenv/2022703443/lib/python3.9/site-packages/grpc/_channel.py",> line 826, in _next
File "/usr/lib/python3.9/threading.py", line 910, in run
for work_request in self._control_stub.Control(get_responses()):
File "<https://ci-beam.apache.org/job/beam_PostCommit_Python39/ws/src/build/gradleenv/2022703443/lib/python3.9/site-packages/grpc/_channel.py",> line 426, in __next__
raise self
self._target(*self._args, **self._kwargs)
File "<https://ci-beam.apache.org/job/beam_PostCommit_Python39/ws/src/sdks/python/apache_beam/runners/worker/data_plane.py",> line 671, in <lambda>
grpc._channel._MultiThreadedRendezvous: <_MultiThreadedRendezvous of RPC that terminated with:
status = StatusCode.UNAVAILABLE
details = "Connection reset by peer"
debug_error_string = "{"created":"@1659983295.833052048","description":"Error received from peer ipv6:[::1]:44875","file":"src/core/lib/surface/call.cc","file_line":966,"grpc_message":"Connection reset by peer","grpc_status":14}"
> return self._next()
target=lambda: self._read_inputs(elements_iterator),
File "<https://ci-beam.apache.org/job/beam_PostCommit_Python39/ws/src/sdks/python/apache_beam/runners/worker/data_plane.py",> line 654, in _read_inputs
File "<https://ci-beam.apache.org/job/beam_PostCommit_Python39/ws/src/build/gradleenv/2022703443/lib/python3.9/site-packages/grpc/_channel.py",> line 826, in _next
for elements in elements_iterator:
File "<https://ci-beam.apache.org/job/beam_PostCommit_Python39/ws/src/build/gradleenv/2022703443/lib/python3.9/site-packages/grpc/_channel.py",> line 426, in __next__
raise self
grpc._channel._MultiThreadedRendezvous: <_MultiThreadedRendezvous of RPC that terminated with:
status = StatusCode.UNAVAILABLE
details = "Connection reset by peer"
debug_error_string = "{"created":"@1659983295.833069422","description":"Error received from peer ipv6:[::1]:39799","file":"src/core/lib/surface/call.cc","file_line":966,"grpc_message":"Connection reset by peer","grpc_status":14}"
> return self._next()
File "<https://ci-beam.apache.org/job/beam_PostCommit_Python39/ws/src/build/gradleenv/2022703443/lib/python3.9/site-packages/grpc/_channel.py",> line 826, in _next
raise self
grpc._channel._MultiThreadedRendezvous: <_MultiThreadedRendezvous of RPC that terminated with:
status = StatusCode.UNAVAILABLE
details = "Socket closed"
debug_error_string = "{"created":"@1659983295.833016832","description":"Error received from peer ipv6:[::1]:36921","file":"src/core/lib/surface/call.cc","file_line":966,"grpc_message":"Socket closed","grpc_status":14}"
>
> Task :sdks:python:test-suites:portable:py39:postCommitPy39
> Task :sdks:python:test-suites:dataflow:py39:postCommitIT FAILED
FAILURE: Build failed with an exception.
* Where:
Script '<https://ci-beam.apache.org/job/beam_PostCommit_Python39/ws/src/sdks/python/test-suites/dataflow/common.gradle'> line: 121
* What went wrong:
Execution failed for task ':sdks:python:test-suites:dataflow:py39:postCommitIT'.
> Process 'command 'sh'' finished with non-zero exit value 1
* Try:
> Run with --stacktrace option to get the stack trace.
> Run with --info or --debug option to get more log output.
> Run with --scan to get full insights.
* Get more help at https://help.gradle.org
Deprecated Gradle features were used in this build, making it incompatible with Gradle 8.0.
You can use '--warning-mode all' to show the individual deprecation warnings and determine if they come from your own scripts or plugins.
See https://docs.gradle.org/7.4/userguide/command_line_interface.html#sec:command_line_warnings
Execution optimizations have been disabled for 1 invalid unit(s) of work during this build to ensure correctness.
Please consult deprecation warnings for more details.
BUILD FAILED in 2h 31m 26s
222 actionable tasks: 159 executed, 57 from cache, 6 up-to-date
Publishing build scan...
https://gradle.com/s/po765knpaz7pg
Build step 'Invoke Gradle script' changed build result to FAILURE
Build step 'Invoke Gradle script' marked build as failure
---------------------------------------------------------------------
To unsubscribe, e-mail: builds-unsubscribe@beam.apache.org
For additional commands, e-mail: builds-help@beam.apache.org