You are viewing a plain text version of this content. The canonical link for it is here.
Posted to commits@beam.apache.org by Apache Jenkins Server <je...@builds.apache.org> on 2018/09/24 20:27:39 UTC
Build failed in Jenkins: beam_PostCommit_Go_GradleBuild #1042
See <https://builds.apache.org/job/beam_PostCommit_Go_GradleBuild/1042/display/redirect?page=changes>
Changes:
[aaltay] Remove standard_library.import_aliases() calls (#6471)
------------------------------------------
[...truncated 521.80 KB...]
2: ParDo [In(Main): []uint8 <- {1: []uint8/bytes GLO}] -> [Out: T -> {2: int/int[varintz] GLO}]
3: ParDo [In(Main): int <- {2: int/int[varintz] GLO}] -> [Out: int -> {3: int/int[varintz] GLO} Out: int -> {4: int/int[varintz] GLO} Out: int -> {5: int/int[varintz] GLO} Out: int -> {6: int/int[varintz] GLO} Out: int -> {7: int/int[varintz] GLO} Out: int -> {8: int/int[varintz] GLO} Out: int -> {9: int/int[varintz] GLO}]
4: Flatten [In(Main): int <- {3: int/int[varintz] GLO} In(Main): int <- {4: int/int[varintz] GLO} In(Main): int <- {5: int/int[varintz] GLO} In(Main): int <- {6: int/int[varintz] GLO} In(Main): int <- {7: int/int[varintz] GLO} In(Main): int <- {8: int/int[varintz] GLO} In(Main): int <- {9: int/int[varintz] GLO}] -> [Out: int -> {10: int/int[varintz] GLO}]
5: Impulse [] -> [Out: []uint8 -> {11: []uint8/bytes GLO}]
6: ParDo [In(Main): []uint8 <- {11: []uint8/bytes GLO} In(Iter): T <- {10: int/int[varintz] GLO} In(Iter): T <- {2: int/int[varintz] GLO}] -> [Out: T -> {12: int/int[varintz] GLO} Out: T -> {13: int/int[varintz] GLO} Out: T -> {14: int/int[varintz] GLO}]
7: ParDo [In(Main): X <- {12: int/int[varintz] GLO}] -> []
8: ParDo [In(Main): X <- {14: int/int[varintz] GLO}] -> []
2018/09/24 20:26:43 Plan[plan]:
12: Impulse[0]
13: Impulse[0]
1: ParDo[passert.failFn] Out:[]
2: Discard
3: ParDo[passert.failFn] Out:[]
4: ParDo[passert.diffFn] Out:[1 2 3]
5: wait[2] Out:4
6: buffer[6]. wait:5 Out:4
7: buffer[7]. wait:5 Out:4
8: Flatten[7]. Out:buffer[6]. wait:5 Out:4
9: ParDo[beam.partitionFn] Out:[8 8 8 8 8 8 8]
10: Multiplex. Out:[9 7]
11: ParDo[beam.createFn] Out:[10]
2018/09/24 20:26:43 wait[5] unblocked w/ 1 [false]
2018/09/24 20:26:43 wait[5] done
--- PASS: TestPartitionFlattenIdentity (0.00s)
=== RUN Example_metricsDeclaredAnywhere
--- PASS: Example_metricsDeclaredAnywhere (0.00s)
=== RUN Example_metricsReusable
--- PASS: Example_metricsReusable (0.00s)
PASS
coverage: 44.8% of statements
ok github.com/apache/beam/sdks/go/pkg/beam 0.015s coverage: 44.8% of statements
> Task :beam-sdks-go:test
Test for github.com/apache/beam/sdks/go/pkg/beam/core/runtime/harness finished, 1 completed, 0 failed
Result of package github.com/apache/beam/sdks/go/pkg/beam:
Test for github.com/apache/beam/sdks/go/pkg/beam finished, 7 completed, 0 failed
Result of package github.com/apache/beam/sdks/go/pkg/beam/core/runtime:
=== RUN TestOptions
--- PASS: TestOptions (0.00s)
=== RUN TestKey
--- PASS: TestKey (0.00s)
=== RUN TestRegister
--- PASS: TestRegister (0.00s)
PASS
coverage: 47.1% of statements
ok github.com/apache/beam/sdks/go/pkg/beam/core/runtime 0.003s coverage: 47.1% of statements
=== RUN TestMergeMaps
--- PASS: TestMergeMaps (0.00s)
=== RUN TestShallowClone
--- PASS: TestShallowClone (0.00s)
=== RUN TestShallowCloneNil
--- PASS: TestShallowCloneNil (0.00s)
PASS
coverage: 6.4% of statements
ok github.com/apache/beam/sdks/go/pkg/beam/core/util/reflectx 0.004s coverage: 6.4% of statements
> Task :beam-sdks-go:test
Test for github.com/apache/beam/sdks/go/pkg/beam/core/runtime finished, 3 completed, 0 failed
Result of package github.com/apache/beam/sdks/go/pkg/beam/core/util/reflectx:
Test for github.com/apache/beam/sdks/go/pkg/beam/core/util/reflectx finished, 3 completed, 0 failed
Generating HTML test report...
Finished generating test html results (0.096 secs) into: <https://builds.apache.org/job/beam_PostCommit_Go_GradleBuild/ws/src/sdks/go/.gogradle/reports/test>
:beam-sdks-go:test (Thread[Task worker for ':',5,main]) completed. Took 25.63 secs.
:beam-sdks-go-container:prepare (Thread[Task worker for ':',5,main]) started.
> Task :beam-sdks-go-container:prepare
Caching disabled for task ':beam-sdks-go-container:prepare': Caching has not been enabled for the task
Task ':beam-sdks-go-container:prepare' is not up-to-date because:
Task has not declared any outputs despite executing actions.
Use project GOPATH: <https://builds.apache.org/job/beam_PostCommit_Go_GradleBuild/ws/src/sdks/go/container/.gogradle/project_gopath>
:beam-sdks-go-container:prepare (Thread[Task worker for ':',5,main]) completed. Took 0.002 secs.
:beam-sdks-go-container:resolveBuildDependencies (Thread[Task worker for ':',5,main]) started.
> Task :beam-sdks-go-container:resolveBuildDependencies UP-TO-DATE
Build cache key for task ':beam-sdks-go-container:resolveBuildDependencies' is 4fc8b685b1598168b8f050f7a4a8cf86
Caching disabled for task ':beam-sdks-go-container:resolveBuildDependencies': Caching has not been enabled for the task
Skipping task ':beam-sdks-go-container:resolveBuildDependencies' as it is up-to-date.
:beam-sdks-go-container:resolveBuildDependencies (Thread[Task worker for ':',5,main]) completed. Took 0.049 secs.
:beam-sdks-go-container:installDependencies (Thread[Task worker for ':',5,main]) started.
> Task :beam-sdks-go-container:installDependencies
Caching disabled for task ':beam-sdks-go-container:installDependencies': Caching has not been enabled for the task
Task ':beam-sdks-go-container:installDependencies' is not up-to-date because:
Task has not declared any outputs despite executing actions.
:beam-sdks-go-container:installDependencies (Thread[Task worker for ':',5,main]) completed. Took 0.704 secs.
:beam-sdks-go-container:buildLinuxAmd64 (Thread[Task worker for ':',5,main]) started.
> Task :beam-sdks-go-container:buildLinuxAmd64 UP-TO-DATE
Build cache key for task ':beam-sdks-go-container:buildLinuxAmd64' is 37182af17906c00a0f36d7f526bf4a29
Caching disabled for task ':beam-sdks-go-container:buildLinuxAmd64': Caching has not been enabled for the task
Skipping task ':beam-sdks-go-container:buildLinuxAmd64' as it is up-to-date.
:beam-sdks-go-container:buildLinuxAmd64 (Thread[Task worker for ':',5,main]) completed. Took 0.272 secs.
:beam-sdks-go-container:build (Thread[Task worker for ':',5,main]) started.
> Task :beam-sdks-go-container:build
Caching disabled for task ':beam-sdks-go-container:build': Caching has not been enabled for the task
Task ':beam-sdks-go-container:build' is not up-to-date because:
Task has not declared any outputs despite executing actions.
:beam-sdks-go-container:build (Thread[Task worker for ':',5,main]) completed. Took 0.002 secs.
:beam-sdks-go-examples:prepare (Thread[Task worker for ':',5,main]) started.
> Task :beam-sdks-go-examples:prepare
Caching disabled for task ':beam-sdks-go-examples:prepare': Caching has not been enabled for the task
Task ':beam-sdks-go-examples:prepare' is not up-to-date because:
Task has not declared any outputs despite executing actions.
Use project GOPATH: <https://builds.apache.org/job/beam_PostCommit_Go_GradleBuild/ws/src/sdks/go/examples/.gogradle/project_gopath>
:beam-sdks-go-examples:prepare (Thread[Task worker for ':',5,main]) completed. Took 0.001 secs.
:beam-sdks-go-examples:resolveBuildDependencies (Thread[Task worker for ':',5,main]) started.
> Task :beam-sdks-go-examples:resolveBuildDependencies
Build cache key for task ':beam-sdks-go-examples:resolveBuildDependencies' is 54a0527e758c11dbaca091e7b0765226
Caching disabled for task ':beam-sdks-go-examples:resolveBuildDependencies': Caching has not been enabled for the task
Task ':beam-sdks-go-examples:resolveBuildDependencies' is not up-to-date because:
No history is available.
Cache <https://builds.apache.org/job/beam_PostCommit_Go_GradleBuild/ws/src/sdks/go/examples/.gogradle/cache/PersistenceNotationToResolvedCache-0.10.bin> not found, skip.
Cache <https://builds.apache.org/job/beam_PostCommit_Go_GradleBuild/ws/src/sdks/go/examples/.gogradle/cache/PersistenceResolvedToDependenciesCache-0.10.bin> not found, skip.
Resolving ./github.com/apache/beam/sdks/go@<https://builds.apache.org/job/beam_PostCommit_Go_GradleBuild/ws/src/sdks/go>
:beam-sdks-go-examples:resolveBuildDependencies (Thread[Task worker for ':',5,main]) completed. Took 0.445 secs.
:beam-sdks-go-examples:installDependencies (Thread[Task worker for ':',5,main]) started.
> Task :beam-sdks-go-examples:installDependencies
Caching disabled for task ':beam-sdks-go-examples:installDependencies': Caching has not been enabled for the task
Task ':beam-sdks-go-examples:installDependencies' is not up-to-date because:
Task has not declared any outputs despite executing actions.
Cache <https://builds.apache.org/job/beam_PostCommit_Go_GradleBuild/ws/src/sdks/go/examples/.gogradle/cache/VendorSnapshot-0.10.bin> not found, skip.
:beam-sdks-go-examples:installDependencies (Thread[Task worker for ':',5,main]) completed. Took 0.497 secs.
:beam-sdks-go-examples:buildLinuxAmd64 (Thread[Task worker for ':',5,main]) started.
> Task :beam-sdks-go-examples:buildLinuxAmd64
Caching disabled for task ':beam-sdks-go-examples:buildLinuxAmd64': Caching has not been enabled for the task
Task ':beam-sdks-go-examples:buildLinuxAmd64' is not up-to-date because:
Task has not declared any outputs despite executing actions.
:beam-sdks-go-examples:buildLinuxAmd64 (Thread[Task worker for ':',5,main]) completed. Took 40.029 secs.
:beam-sdks-go-examples:build (Thread[Task worker for ':',5,main]) started.
> Task :beam-sdks-go-examples:build
Caching disabled for task ':beam-sdks-go-examples:build': Caching has not been enabled for the task
Task ':beam-sdks-go-examples:build' is not up-to-date because:
Task has not declared any outputs despite executing actions.
:beam-sdks-go-examples:build (Thread[Task worker for ':',5,main]) completed. Took 0.0 secs.
:beam-sdks-java-container:prepare (Thread[Task worker for ':',5,main]) started.
> Task :beam-sdks-java-container:prepare
Caching disabled for task ':beam-sdks-java-container:prepare': Caching has not been enabled for the task
Task ':beam-sdks-java-container:prepare' is not up-to-date because:
Task has not declared any outputs despite executing actions.
Use project GOPATH: <https://builds.apache.org/job/beam_PostCommit_Go_GradleBuild/ws/src/sdks/java/container/.gogradle/project_gopath>
:beam-sdks-java-container:prepare (Thread[Task worker for ':',5,main]) completed. Took 0.001 secs.
:beam-sdks-java-container:resolveBuildDependencies (Thread[Task worker for ':',5,main]) started.
> Task :beam-sdks-java-container:resolveBuildDependencies
Build cache key for task ':beam-sdks-java-container:resolveBuildDependencies' is b9c0a03ca712a2cf225bc96eaa2d95af
Caching disabled for task ':beam-sdks-java-container:resolveBuildDependencies': Caching has not been enabled for the task
Task ':beam-sdks-java-container:resolveBuildDependencies' is not up-to-date because:
No history is available.
Cache <https://builds.apache.org/job/beam_PostCommit_Go_GradleBuild/ws/src/sdks/java/container/.gogradle/cache/PersistenceNotationToResolvedCache-0.10.bin> not found, skip.
Cache <https://builds.apache.org/job/beam_PostCommit_Go_GradleBuild/ws/src/sdks/java/container/.gogradle/cache/PersistenceResolvedToDependenciesCache-0.10.bin> not found, skip.
Resolving ./github.com/apache/beam/sdks/go@<https://builds.apache.org/job/beam_PostCommit_Go_GradleBuild/ws/src/sdks/go>
:beam-sdks-java-container:resolveBuildDependencies (Thread[Task worker for ':',5,main]) completed. Took 5.135 secs.
:beam-sdks-java-container:installDependencies (Thread[Task worker for ':',5,main]) started.
> Task :beam-sdks-java-container:installDependencies
Caching disabled for task ':beam-sdks-java-container:installDependencies': Caching has not been enabled for the task
Task ':beam-sdks-java-container:installDependencies' is not up-to-date because:
Task has not declared any outputs despite executing actions.
Cache <https://builds.apache.org/job/beam_PostCommit_Go_GradleBuild/ws/src/sdks/java/container/.gogradle/cache/VendorSnapshot-0.10.bin> not found, skip.
:beam-sdks-java-container:installDependencies (Thread[Task worker for ':',5,main]) completed. Took 0.488 secs.
:beam-sdks-java-container:buildLinuxAmd64 (Thread[Task worker for ':',5,main]) started.
> Task :beam-sdks-java-container:buildLinuxAmd64
Build cache key for task ':beam-sdks-java-container:buildLinuxAmd64' is 66cbf0ca7b2627bbe2513cda7db0b31c
Caching disabled for task ':beam-sdks-java-container:buildLinuxAmd64': Caching has not been enabled for the task
Task ':beam-sdks-java-container:buildLinuxAmd64' is not up-to-date because:
No history is available.
:beam-sdks-java-container:buildLinuxAmd64 (Thread[Task worker for ':',5,main]) completed. Took 2.552 secs.
:beam-sdks-java-container:build (Thread[Task worker for ':',5,main]) started.
> Task :beam-sdks-java-container:build
Caching disabled for task ':beam-sdks-java-container:build': Caching has not been enabled for the task
Task ':beam-sdks-java-container:build' is not up-to-date because:
Task has not declared any outputs despite executing actions.
:beam-sdks-java-container:build (Thread[Task worker for ':',5,main]) completed. Took 0.001 secs.
:beam-sdks-python-container:prepare (Thread[Task worker for ':',5,main]) started.
> Task :beam-sdks-python-container:prepare
Caching disabled for task ':beam-sdks-python-container:prepare': Caching has not been enabled for the task
Task ':beam-sdks-python-container:prepare' is not up-to-date because:
Task has not declared any outputs despite executing actions.
Use project GOPATH: <https://builds.apache.org/job/beam_PostCommit_Go_GradleBuild/ws/src/sdks/python/container/.gogradle/project_gopath>
:beam-sdks-python-container:prepare (Thread[Task worker for ':',5,main]) completed. Took 0.001 secs.
:beam-sdks-python-container:resolveBuildDependencies (Thread[Task worker for ':',5,main]) started.
> Task :beam-sdks-python-container:resolveBuildDependencies
Build cache key for task ':beam-sdks-python-container:resolveBuildDependencies' is 075aa0f2cbf4c13c4ffa98493c27fbed
Caching disabled for task ':beam-sdks-python-container:resolveBuildDependencies': Caching has not been enabled for the task
Task ':beam-sdks-python-container:resolveBuildDependencies' is not up-to-date because:
No history is available.
Cache <https://builds.apache.org/job/beam_PostCommit_Go_GradleBuild/ws/src/sdks/python/container/.gogradle/cache/PersistenceNotationToResolvedCache-0.10.bin> not found, skip.
Cache <https://builds.apache.org/job/beam_PostCommit_Go_GradleBuild/ws/src/sdks/python/container/.gogradle/cache/PersistenceResolvedToDependenciesCache-0.10.bin> not found, skip.
Resolving ./github.com/apache/beam/sdks/go@<https://builds.apache.org/job/beam_PostCommit_Go_GradleBuild/ws/src/sdks/go>
:beam-sdks-python-container:resolveBuildDependencies (Thread[Task worker for ':',5,main]) completed. Took 0.284 secs.
:beam-sdks-python-container:installDependencies (Thread[Task worker for ':',5,main]) started.
> Task :beam-sdks-python-container:installDependencies
Caching disabled for task ':beam-sdks-python-container:installDependencies': Caching has not been enabled for the task
Task ':beam-sdks-python-container:installDependencies' is not up-to-date because:
Task has not declared any outputs despite executing actions.
Cache <https://builds.apache.org/job/beam_PostCommit_Go_GradleBuild/ws/src/sdks/python/container/.gogradle/cache/VendorSnapshot-0.10.bin> not found, skip.
:beam-sdks-python-container:installDependencies (Thread[Task worker for ':',5,main]) completed. Took 0.457 secs.
:beam-sdks-python-container:buildLinuxAmd64 (Thread[Task worker for ':',5,main]) started.
> Task :beam-sdks-python-container:buildLinuxAmd64
Build cache key for task ':beam-sdks-python-container:buildLinuxAmd64' is 205449234fd2257c7827e7ad07371030
Caching disabled for task ':beam-sdks-python-container:buildLinuxAmd64': Caching has not been enabled for the task
Task ':beam-sdks-python-container:buildLinuxAmd64' is not up-to-date because:
No history is available.
:beam-sdks-python-container:buildLinuxAmd64 (Thread[Task worker for ':',5,main]) completed. Took 2.501 secs.
:beam-sdks-python-container:build (Thread[Task worker for ':',5,main]) started.
> Task :beam-sdks-python-container:build
Caching disabled for task ':beam-sdks-python-container:build': Caching has not been enabled for the task
Task ':beam-sdks-python-container:build' is not up-to-date because:
Task has not declared any outputs despite executing actions.
:beam-sdks-python-container:build (Thread[Task worker for ':',5,main]) completed. Took 0.001 secs.
FAILURE: Build failed with an exception.
* What went wrong:
Execution failed for task ':rat'.
> Found 11 files with unapproved/unknown licenses. See <https://builds.apache.org/job/beam_PostCommit_Go_GradleBuild/ws/src/build/reports/rat/rat-report.xml>
* Try:
Run with --stacktrace option to get the stack trace. Run with --debug option to get more log output. Run with --scan to get full insights.
* Get more help at https://help.gradle.org
Deprecated Gradle features were used in this build, making it incompatible with Gradle 5.0.
Use '--warning-mode all' to show the individual deprecation warnings.
See https://docs.gradle.org/4.10.2/userguide/command_line_interface.html#sec:command_line_warnings
BUILD FAILED in 12m 43s
34 actionable tasks: 32 executed, 2 up-to-date
Publishing build scan...
https://gradle.com/s/3x7j25xdeac4c
Build step 'Invoke Gradle script' changed build result to FAILURE
Build step 'Invoke Gradle script' marked build as failure
Jenkins build is back to normal : beam_PostCommit_Go_GradleBuild
#1043
Posted by Apache Jenkins Server <je...@builds.apache.org>.
See <https://builds.apache.org/job/beam_PostCommit_Go_GradleBuild/1043/display/redirect?page=changes>