You are viewing a plain text version of this content. The canonical link for it is here.
Posted to builds@hbase.apache.org by Apache Jenkins Server <je...@builds.apache.org> on 2015/11/27 00:06:58 UTC

Build failed in Jenkins: HBase-1.3 » latest1.8,Hadoop #401

See <https://builds.apache.org/job/HBase-1.3/jdk=latest1.8,label=Hadoop/401/>

------------------------------------------
[...truncated 45726 lines...]
Tests run: 1, Failures: 0, Errors: 0, Skipped: 0, Time elapsed: 124.257 sec - in org.apache.hadoop.hbase.mapreduce.TestSyncTable
Java HotSpot(TM) 64-Bit Server VM warning: ignoring option MaxPermSize=256m; support was removed in 8.0
Java HotSpot(TM) 64-Bit Server VM warning: ignoring option MaxPermSize=256m; support was removed in 8.0
Java HotSpot(TM) 64-Bit Server VM warning: ignoring option MaxPermSize=256m; support was removed in 8.0
Java HotSpot(TM) 64-Bit Server VM warning: ignoring option MaxPermSize=256m; support was removed in 8.0
Running org.apache.hadoop.hbase.io.hfile.TestHFileBlockIndex
Running org.apache.hadoop.hbase.io.hfile.TestSeekBeforeWithInlineBlocks
Tests run: 10, Failures: 0, Errors: 0, Skipped: 0, Time elapsed: 14.396 sec - in org.apache.hadoop.hbase.io.hfile.TestHFileBlockIndex
Java HotSpot(TM) 64-Bit Server VM warning: ignoring option MaxPermSize=256m; support was removed in 8.0
Java HotSpot(TM) 64-Bit Server VM warning: ignoring option MaxPermSize=256m; support was removed in 8.0
Java HotSpot(TM) 64-Bit Server VM warning: ignoring option MaxPermSize=256m; support was removed in 8.0
Java HotSpot(TM) 64-Bit Server VM warning: ignoring option MaxPermSize=256m; support was removed in 8.0
Tests run: 1, Failures: 0, Errors: 0, Skipped: 0, Time elapsed: 17.584 sec - in org.apache.hadoop.hbase.io.hfile.TestSeekBeforeWithInlineBlocks
Java HotSpot(TM) 64-Bit Server VM warning: ignoring option MaxPermSize=256m; support was removed in 8.0
Java HotSpot(TM) 64-Bit Server VM warning: ignoring option MaxPermSize=256m; support was removed in 8.0
Java HotSpot(TM) 64-Bit Server VM warning: ignoring option MaxPermSize=256m; support was removed in 8.0
Java HotSpot(TM) 64-Bit Server VM warning: ignoring option MaxPermSize=256m; support was removed in 8.0
Java HotSpot(TM) 64-Bit Server VM warning: ignoring option MaxPermSize=256m; support was removed in 8.0
Running org.apache.hadoop.hbase.io.hfile.TestScannerSelectionUsingTTL
Java HotSpot(TM) 64-Bit Server VM warning: ignoring option MaxPermSize=256m; support was removed in 8.0
Running org.apache.hadoop.hbase.io.hfile.TestHFileSeek
Tests run: 1, Failures: 0, Errors: 0, Skipped: 0, Time elapsed: 1.778 sec - in org.apache.hadoop.hbase.io.hfile.TestHFileSeek
Java HotSpot(TM) 64-Bit Server VM warning: ignoring option MaxPermSize=256m; support was removed in 8.0
Java HotSpot(TM) 64-Bit Server VM warning: ignoring option MaxPermSize=256m; support was removed in 8.0
Java HotSpot(TM) 64-Bit Server VM warning: ignoring option MaxPermSize=256m; support was removed in 8.0
Running org.apache.hadoop.hbase.io.hfile.TestHFileBlock
Tests run: 6, Failures: 0, Errors: 0, Skipped: 0, Time elapsed: 65.31 sec - in org.apache.hadoop.hbase.io.hfile.TestScannerSelectionUsingTTL
Java HotSpot(TM) 64-Bit Server VM warning: ignoring option MaxPermSize=256m; support was removed in 8.0
Java HotSpot(TM) 64-Bit Server VM warning: ignoring option MaxPermSize=256m; support was removed in 8.0
Java HotSpot(TM) 64-Bit Server VM warning: ignoring option MaxPermSize=256m; support was removed in 8.0
Java HotSpot(TM) 64-Bit Server VM warning: ignoring option MaxPermSize=256m; support was removed in 8.0
Java HotSpot(TM) 64-Bit Server VM warning: ignoring option MaxPermSize=256m; support was removed in 8.0
Java HotSpot(TM) 64-Bit Server VM warning: ignoring option MaxPermSize=256m; support was removed in 8.0
Java HotSpot(TM) 64-Bit Server VM warning: ignoring option MaxPermSize=256m; support was removed in 8.0
Java HotSpot(TM) 64-Bit Server VM warning: ignoring option MaxPermSize=256m; support was removed in 8.0
Running org.apache.hadoop.hbase.io.hfile.TestCacheConfig
Tests run: 6, Failures: 0, Errors: 0, Skipped: 0, Time elapsed: 2.017 sec - in org.apache.hadoop.hbase.io.hfile.TestCacheConfig
Java HotSpot(TM) 64-Bit Server VM warning: ignoring option MaxPermSize=256m; support was removed in 8.0
Java HotSpot(TM) 64-Bit Server VM warning: ignoring option MaxPermSize=256m; support was removed in 8.0
Java HotSpot(TM) 64-Bit Server VM warning: ignoring option MaxPermSize=256m; support was removed in 8.0
Java HotSpot(TM) 64-Bit Server VM warning: ignoring option MaxPermSize=256m; support was removed in 8.0
Java HotSpot(TM) 64-Bit Server VM warning: ignoring option MaxPermSize=256m; support was removed in 8.0
Java HotSpot(TM) 64-Bit Server VM warning: ignoring option MaxPermSize=256m; support was removed in 8.0
Running org.apache.hadoop.hbase.io.hfile.TestForceCacheImportantBlocks
Tests run: 5, Failures: 0, Errors: 0, Skipped: 0, Time elapsed: 179.669 sec - in org.apache.hadoop.hbase.mapreduce.TestCopyTable
Java HotSpot(TM) 64-Bit Server VM warning: ignoring option MaxPermSize=256m; support was removed in 8.0
Running org.apache.hadoop.hbase.io.hfile.TestCacheOnWrite
Tests run: 28, Failures: 0, Errors: 0, Skipped: 0, Time elapsed: 94.956 sec - in org.apache.hadoop.hbase.io.hfile.TestHFileBlock
Java HotSpot(TM) 64-Bit Server VM warning: ignoring option MaxPermSize=256m; support was removed in 8.0
Java HotSpot(TM) 64-Bit Server VM warning: ignoring option MaxPermSize=256m; support was removed in 8.0
Java HotSpot(TM) 64-Bit Server VM warning: ignoring option MaxPermSize=256m; support was removed in 8.0
Java HotSpot(TM) 64-Bit Server VM warning: ignoring option MaxPermSize=256m; support was removed in 8.0
Running org.apache.hadoop.hbase.io.encoding.TestLoadAndSwitchEncodeOnDisk
Tests run: 4, Failures: 0, Errors: 0, Skipped: 0, Time elapsed: 43.465 sec - in org.apache.hadoop.hbase.io.hfile.TestForceCacheImportantBlocks
Java HotSpot(TM) 64-Bit Server VM warning: ignoring option MaxPermSize=256m; support was removed in 8.0
Tests run: 1, Failures: 0, Errors: 0, Skipped: 0, Time elapsed: 28.879 sec - in org.apache.hadoop.hbase.io.encoding.TestLoadAndSwitchEncodeOnDisk
Java HotSpot(TM) 64-Bit Server VM warning: ignoring option MaxPermSize=256m; support was removed in 8.0
Running org.apache.hadoop.hbase.io.encoding.TestEncodedSeekers
Running org.apache.hadoop.hbase.io.encoding.TestChangingEncoding
Tests run: 4, Failures: 0, Errors: 0, Skipped: 0, Time elapsed: 176.877 sec - in org.apache.hadoop.hbase.mapreduce.TestMultiTableInputFormat
Java HotSpot(TM) 64-Bit Server VM warning: ignoring option MaxPermSize=256m; support was removed in 8.0
Running org.apache.hadoop.hbase.io.encoding.TestDataBlockEncoders
Tests run: 8, Failures: 0, Errors: 0, Skipped: 0, Time elapsed: 373.973 sec - in org.apache.hadoop.hbase.mapreduce.TestTableSnapshotInputFormat
Java HotSpot(TM) 64-Bit Server VM warning: ignoring option MaxPermSize=256m; support was removed in 8.0
Running org.apache.hadoop.hbase.io.encoding.TestBufferedDataBlockEncoder
Tests run: 28, Failures: 0, Errors: 0, Skipped: 0, Time elapsed: 46.308 sec - in org.apache.hadoop.hbase.io.encoding.TestDataBlockEncoders
Java HotSpot(TM) 64-Bit Server VM warning: ignoring option MaxPermSize=256m; support was removed in 8.0
Java HotSpot(TM) 64-Bit Server VM warning: ignoring option MaxPermSize=256m; support was removed in 8.0
Java HotSpot(TM) 64-Bit Server VM warning: ignoring option MaxPermSize=256m; support was removed in 8.0
Java HotSpot(TM) 64-Bit Server VM warning: ignoring option MaxPermSize=256m; support was removed in 8.0
Java HotSpot(TM) 64-Bit Server VM warning: ignoring option MaxPermSize=256m; support was removed in 8.0
Tests run: 1, Failures: 0, Errors: 0, Skipped: 0, Time elapsed: 14.805 sec - in org.apache.hadoop.hbase.io.encoding.TestBufferedDataBlockEncoder
Java HotSpot(TM) 64-Bit Server VM warning: ignoring option MaxPermSize=256m; support was removed in 8.0
Java HotSpot(TM) 64-Bit Server VM warning: ignoring option MaxPermSize=256m; support was removed in 8.0
Java HotSpot(TM) 64-Bit Server VM warning: ignoring option MaxPermSize=256m; support was removed in 8.0
Running org.apache.hadoop.hbase.filter.TestScanRowPrefix
Running org.apache.hadoop.hbase.filter.TestFilterWithScanLimits
Tests run: 1, Failures: 0, Errors: 0, Skipped: 0, Time elapsed: 4.013 sec - in org.apache.hadoop.hbase.filter.TestFilterWithScanLimits
Java HotSpot(TM) 64-Bit Server VM warning: ignoring option MaxPermSize=256m; support was removed in 8.0
Tests run: 1, Failures: 0, Errors: 0, Skipped: 0, Time elapsed: 6.476 sec - in org.apache.hadoop.hbase.filter.TestScanRowPrefix
Java HotSpot(TM) 64-Bit Server VM warning: ignoring option MaxPermSize=256m; support was removed in 8.0
Java HotSpot(TM) 64-Bit Server VM warning: ignoring option MaxPermSize=256m; support was removed in 8.0
Java HotSpot(TM) 64-Bit Server VM warning: ignoring option MaxPermSize=256m; support was removed in 8.0
Java HotSpot(TM) 64-Bit Server VM warning: ignoring option MaxPermSize=256m; support was removed in 8.0
Java HotSpot(TM) 64-Bit Server VM warning: ignoring option MaxPermSize=256m; support was removed in 8.0
Java HotSpot(TM) 64-Bit Server VM warning: ignoring option MaxPermSize=256m; support was removed in 8.0
Java HotSpot(TM) 64-Bit Server VM warning: ignoring option MaxPermSize=256m; support was removed in 8.0
Java HotSpot(TM) 64-Bit Server VM warning: ignoring option MaxPermSize=256m; support was removed in 8.0
Java HotSpot(TM) 64-Bit Server VM warning: ignoring option MaxPermSize=256m; support was removed in 8.0
Java HotSpot(TM) 64-Bit Server VM warning: ignoring option MaxPermSize=256m; support was removed in 8.0
Running org.apache.hadoop.hbase.filter.TestFilterWrapper
Running org.apache.hadoop.hbase.filter.TestFuzzyRowFilterEndToEnd
Tests run: 72, Failures: 0, Errors: 0, Skipped: 0, Time elapsed: 142.418 sec - in org.apache.hadoop.hbase.io.hfile.TestCacheOnWrite
Java HotSpot(TM) 64-Bit Server VM warning: ignoring option MaxPermSize=256m; support was removed in 8.0
Java HotSpot(TM) 64-Bit Server VM warning: ignoring option MaxPermSize=256m; support was removed in 8.0
Java HotSpot(TM) 64-Bit Server VM warning: ignoring option MaxPermSize=256m; support was removed in 8.0
Java HotSpot(TM) 64-Bit Server VM warning: ignoring option MaxPermSize=256m; support was removed in 8.0
Java HotSpot(TM) 64-Bit Server VM warning: ignoring option MaxPermSize=256m; support was removed in 8.0
Java HotSpot(TM) 64-Bit Server VM warning: ignoring option MaxPermSize=256m; support was removed in 8.0
Tests run: 1, Failures: 0, Errors: 0, Skipped: 0, Time elapsed: 3.596 sec - in org.apache.hadoop.hbase.filter.TestFilterWrapper
Java HotSpot(TM) 64-Bit Server VM warning: ignoring option MaxPermSize=256m; support was removed in 8.0
Java HotSpot(TM) 64-Bit Server VM warning: ignoring option MaxPermSize=256m; support was removed in 8.0
Java HotSpot(TM) 64-Bit Server VM warning: ignoring option MaxPermSize=256m; support was removed in 8.0
Java HotSpot(TM) 64-Bit Server VM warning: ignoring option MaxPermSize=256m; support was removed in 8.0
Java HotSpot(TM) 64-Bit Server VM warning: ignoring option MaxPermSize=256m; support was removed in 8.0
Java HotSpot(TM) 64-Bit Server VM warning: ignoring option MaxPermSize=256m; support was removed in 8.0
Java HotSpot(TM) 64-Bit Server VM warning: ignoring option MaxPermSize=256m; support was removed in 8.0
Java HotSpot(TM) 64-Bit Server VM warning: ignoring option MaxPermSize=256m; support was removed in 8.0
Running org.apache.hadoop.hbase.filter.TestColumnRangeFilter
Running org.apache.hadoop.hbase.filter.TestFuzzyRowAndColumnRangeFilter
Tests run: 1, Failures: 0, Errors: 0, Skipped: 0, Time elapsed: 4.43 sec - in org.apache.hadoop.hbase.filter.TestFuzzyRowAndColumnRangeFilter
Java HotSpot(TM) 64-Bit Server VM warning: ignoring option MaxPermSize=256m; support was removed in 8.0
Tests run: 1, Failures: 0, Errors: 0, Skipped: 0, Time elapsed: 7.751 sec - in org.apache.hadoop.hbase.filter.TestColumnRangeFilter
Running org.apache.hadoop.hbase.filter.TestMultiRowRangeFilter
Tests run: 20, Failures: 0, Errors: 0, Skipped: 0, Time elapsed: 131.4 sec - in org.apache.hadoop.hbase.io.encoding.TestEncodedSeekers
Tests run: 3, Failures: 0, Errors: 0, Skipped: 0, Time elapsed: 148.306 sec - in org.apache.hadoop.hbase.io.encoding.TestChangingEncoding
Tests run: 20, Failures: 0, Errors: 0, Skipped: 0, Time elapsed: 21.478 sec - in org.apache.hadoop.hbase.filter.TestMultiRowRangeFilter
Tests run: 3, Failures: 0, Errors: 0, Skipped: 0, Time elapsed: 195.323 sec - in org.apache.hadoop.hbase.filter.TestFuzzyRowFilterEndToEnd

Results :

Tests in error: 
org.apache.hadoop.hbase.wal.TestBoundedRegionGroupingStrategy.testConcurrentWrites(org.apache.hadoop.hbase.wal.TestBoundedRegionGroupingStrategy)
  Run 1: TestBoundedRegionGroupingStrategy.testConcurrentWrites:109 » IllegalState Coun...
  Run 2: TestBoundedRegionGroupingStrategy.testConcurrentWrites:109 » IO Failed on loca...
  Run 3: TestBoundedRegionGroupingStrategy.testConcurrentWrites:109 » Connect Call From...


Tests run: 2397, Failures: 0, Errors: 1, Skipped: 39

[INFO] ------------------------------------------------------------------------
[INFO] Reactor Summary:
[INFO] 
[INFO] Apache HBase ...................................... SUCCESS [1:14.089s]
[INFO] Apache HBase - Checkstyle ......................... SUCCESS [7.421s]
[INFO] Apache HBase - Resource Bundle .................... SUCCESS [0.209s]
[INFO] Apache HBase - Annotations ........................ SUCCESS [1.209s]
[INFO] Apache HBase - Protocol ........................... SUCCESS [19.504s]
[INFO] Apache HBase - Common ............................. SUCCESS [2:19.487s]
[INFO] Apache HBase - Procedure .......................... SUCCESS [3:28.439s]
[INFO] Apache HBase - Client ............................. SUCCESS [1:21.394s]
[INFO] Apache HBase - Hadoop Compatibility ............... SUCCESS [9.021s]
[INFO] Apache HBase - Hadoop Two Compatibility ........... SUCCESS [9.026s]
[INFO] Apache HBase - Prefix Tree ........................ SUCCESS [9.362s]
[INFO] Apache HBase - Server ............................. FAILURE [1:36:04.373s]
[INFO] Apache HBase - Testing Util ....................... SKIPPED
[INFO] Apache HBase - Thrift ............................. SKIPPED
[INFO] Apache HBase - Rest ............................... SKIPPED
[INFO] Apache HBase - Shell .............................. SKIPPED
[INFO] Apache HBase - Integration Tests .................. SKIPPED
[INFO] Apache HBase - Examples ........................... SKIPPED
[INFO] Apache HBase - External Block Cache ............... SKIPPED
[INFO] Apache HBase - Assembly ........................... SKIPPED
[INFO] Apache HBase - Shaded ............................. SKIPPED
[INFO] Apache HBase - Shaded - Client .................... SKIPPED
[INFO] Apache HBase - Shaded - Server .................... SKIPPED
[INFO] ------------------------------------------------------------------------
[INFO] BUILD FAILURE
[INFO] ------------------------------------------------------------------------
[INFO] Total time: 1:45:45.942s
[INFO] Finished at: Thu Nov 26 23:04:11 UTC 2015
[INFO] Final Memory: 94M/672M
[INFO] ------------------------------------------------------------------------
[ERROR] Failed to execute goal org.apache.maven.plugins:maven-surefire-plugin:2.18.1:test (secondPartTestsExecution) on project hbase-server: There are test failures.
[ERROR] 
[ERROR] Please refer to <https://builds.apache.org/job/HBase-1.3/jdk=latest1.8,label=Hadoop/ws/hbase-server/target/surefire-reports> for the individual test results.
[ERROR] -> [Help 1]
[ERROR] 
[ERROR] To see the full stack trace of the errors, re-run Maven with the -e switch.
[ERROR] Re-run Maven using the -X switch to enable full debug logging.
[ERROR] 
[ERROR] For more information about the errors and possible solutions, please read the following articles:
[ERROR] [Help 1] http://cwiki.apache.org/confluence/display/MAVEN/MojoFailureException
[ERROR] 
[ERROR] After correcting the problems, you can resume the build with the command
[ERROR]   mvn <goals> -rf :hbase-server
Build step 'Invoke top-level Maven targets' marked build as failure
Performing Post build task...
Match found for :.* : True
Logical operation result is TRUE
Running script  : # Post-build task script. TODO: Check this in and have all builds reference check-in.
pwd && ls
# NOTE!!!! The below code has been copied and pasted from ./dev-tools/run-test.sh
# Do not change here without syncing there and vice-versa.
ZOMBIE_TESTS_COUNT=`jps -v | grep surefirebooter | grep -e '-Dhbase.test' | wc -l`
if [[ $ZOMBIE_TESTS_COUNT != 0 ]] ; then
 echo "Suspicious java process found - waiting 30s to see if there are just slow to stop"
 sleep 30
 ZOMBIE_TESTS_COUNT=`jps -v | grep surefirebooter | grep -e '-Dhbase.test' | wc -l`
 if [[ $ZOMBIE_TESTS_COUNT != 0 ]] ; then
   echo " {color:red}There appear to be $ZOMBIE_TESTS_COUNT zombie tests{color}, they should have been killed by surefire but survived"
   jps -v | grep surefirebooter | grep -e '-Dhbase.test'
   jps -v | grep surefirebooter | grep -e '-Dhbase.test' | cut -d ' ' -f 1 | xargs -n 1 jstack
   # Exit with error
   exit 1
 else
   echo "We're ok: there is no zombie test, but some tests took some time to stop"
 fi
else
  echo "We're ok: there is no zombie test"
fi
[Hadoop] $ /bin/bash -xe /tmp/hudson1191327655245401804.sh
+ pwd
<https://builds.apache.org/job/HBase-1.3/jdk=latest1.8,label=Hadoop/ws/>
+ ls
bin
CHANGES.txt
conf
dev-support
hbase-annotations
hbase-assembly
hbase-checkstyle
hbase-client
hbase-common
hbase-examples
hbase-external-blockcache
hbase-hadoop2-compat
hbase-hadoop-compat
hbase-it
hbase-native-client
hbase-prefix-tree
hbase-procedure
hbase-protocol
hbase-resource-bundle
hbase-rest
hbase-server
hbase-shaded
hbase-shell
hbase-spark
hbase-testing-util
hbase-thrift
LICENSE.txt
NOTICE.txt
pom.xml
README.txt
src
target
++ jps -v
++ grep surefirebooter
++ wc -l
++ grep -e -Dhbase.test
+ ZOMBIE_TESTS_COUNT=0
+ [[ 0 != 0 ]]
+ echo 'We'\''re ok: there is no zombie test'
We're ok: there is no zombie test
POST BUILD TASK : SUCCESS
END OF POST BUILD TASK : 0
Archiving artifacts
Recording test results

Jenkins build is back to normal : HBase-1.3 » latest1.8,Hadoop #402

Posted by Apache Jenkins Server <je...@builds.apache.org>.
See <https://builds.apache.org/job/HBase-1.3/jdk=latest1.8,label=Hadoop/402/changes>


Re: Build failed in Jenkins: HBase-1.3 » latest1.8,Hadoop #401

Posted by Stack <st...@duboce.net>.
This fail and the TestRowCounter fail in 1.2 don't fail usually so letting
them slide for now till higher incidence of fail.
St.Ack

On Thu, Nov 26, 2015 at 3:06 PM, Apache Jenkins Server <
jenkins@builds.apache.org> wrote:

> See <
> https://builds.apache.org/job/HBase-1.3/jdk=latest1.8,label=Hadoop/401/>
>
> ------------------------------------------
> [...truncated 45726 lines...]
> Tests run: 1, Failures: 0, Errors: 0, Skipped: 0, Time elapsed: 124.257
> sec - in org.apache.hadoop.hbase.mapreduce.TestSyncTable
> Java HotSpot(TM) 64-Bit Server VM warning: ignoring option
> MaxPermSize=256m; support was removed in 8.0
> Java HotSpot(TM) 64-Bit Server VM warning: ignoring option
> MaxPermSize=256m; support was removed in 8.0
> Java HotSpot(TM) 64-Bit Server VM warning: ignoring option
> MaxPermSize=256m; support was removed in 8.0
> Java HotSpot(TM) 64-Bit Server VM warning: ignoring option
> MaxPermSize=256m; support was removed in 8.0
> Running org.apache.hadoop.hbase.io.hfile.TestHFileBlockIndex
> Running org.apache.hadoop.hbase.io.hfile.TestSeekBeforeWithInlineBlocks
> Tests run: 10, Failures: 0, Errors: 0, Skipped: 0, Time elapsed: 14.396
> sec - in org.apache.hadoop.hbase.io.hfile.TestHFileBlockIndex
> Java HotSpot(TM) 64-Bit Server VM warning: ignoring option
> MaxPermSize=256m; support was removed in 8.0
> Java HotSpot(TM) 64-Bit Server VM warning: ignoring option
> MaxPermSize=256m; support was removed in 8.0
> Java HotSpot(TM) 64-Bit Server VM warning: ignoring option
> MaxPermSize=256m; support was removed in 8.0
> Java HotSpot(TM) 64-Bit Server VM warning: ignoring option
> MaxPermSize=256m; support was removed in 8.0
> Tests run: 1, Failures: 0, Errors: 0, Skipped: 0, Time elapsed: 17.584 sec
> - in org.apache.hadoop.hbase.io.hfile.TestSeekBeforeWithInlineBlocks
> Java HotSpot(TM) 64-Bit Server VM warning: ignoring option
> MaxPermSize=256m; support was removed in 8.0
> Java HotSpot(TM) 64-Bit Server VM warning: ignoring option
> MaxPermSize=256m; support was removed in 8.0
> Java HotSpot(TM) 64-Bit Server VM warning: ignoring option
> MaxPermSize=256m; support was removed in 8.0
> Java HotSpot(TM) 64-Bit Server VM warning: ignoring option
> MaxPermSize=256m; support was removed in 8.0
> Java HotSpot(TM) 64-Bit Server VM warning: ignoring option
> MaxPermSize=256m; support was removed in 8.0
> Running org.apache.hadoop.hbase.io.hfile.TestScannerSelectionUsingTTL
> Java HotSpot(TM) 64-Bit Server VM warning: ignoring option
> MaxPermSize=256m; support was removed in 8.0
> Running org.apache.hadoop.hbase.io.hfile.TestHFileSeek
> Tests run: 1, Failures: 0, Errors: 0, Skipped: 0, Time elapsed: 1.778 sec
> - in org.apache.hadoop.hbase.io.hfile.TestHFileSeek
> Java HotSpot(TM) 64-Bit Server VM warning: ignoring option
> MaxPermSize=256m; support was removed in 8.0
> Java HotSpot(TM) 64-Bit Server VM warning: ignoring option
> MaxPermSize=256m; support was removed in 8.0
> Java HotSpot(TM) 64-Bit Server VM warning: ignoring option
> MaxPermSize=256m; support was removed in 8.0
> Running org.apache.hadoop.hbase.io.hfile.TestHFileBlock
> Tests run: 6, Failures: 0, Errors: 0, Skipped: 0, Time elapsed: 65.31 sec
> - in org.apache.hadoop.hbase.io.hfile.TestScannerSelectionUsingTTL
> Java HotSpot(TM) 64-Bit Server VM warning: ignoring option
> MaxPermSize=256m; support was removed in 8.0
> Java HotSpot(TM) 64-Bit Server VM warning: ignoring option
> MaxPermSize=256m; support was removed in 8.0
> Java HotSpot(TM) 64-Bit Server VM warning: ignoring option
> MaxPermSize=256m; support was removed in 8.0
> Java HotSpot(TM) 64-Bit Server VM warning: ignoring option
> MaxPermSize=256m; support was removed in 8.0
> Java HotSpot(TM) 64-Bit Server VM warning: ignoring option
> MaxPermSize=256m; support was removed in 8.0
> Java HotSpot(TM) 64-Bit Server VM warning: ignoring option
> MaxPermSize=256m; support was removed in 8.0
> Java HotSpot(TM) 64-Bit Server VM warning: ignoring option
> MaxPermSize=256m; support was removed in 8.0
> Java HotSpot(TM) 64-Bit Server VM warning: ignoring option
> MaxPermSize=256m; support was removed in 8.0
> Running org.apache.hadoop.hbase.io.hfile.TestCacheConfig
> Tests run: 6, Failures: 0, Errors: 0, Skipped: 0, Time elapsed: 2.017 sec
> - in org.apache.hadoop.hbase.io.hfile.TestCacheConfig
> Java HotSpot(TM) 64-Bit Server VM warning: ignoring option
> MaxPermSize=256m; support was removed in 8.0
> Java HotSpot(TM) 64-Bit Server VM warning: ignoring option
> MaxPermSize=256m; support was removed in 8.0
> Java HotSpot(TM) 64-Bit Server VM warning: ignoring option
> MaxPermSize=256m; support was removed in 8.0
> Java HotSpot(TM) 64-Bit Server VM warning: ignoring option
> MaxPermSize=256m; support was removed in 8.0
> Java HotSpot(TM) 64-Bit Server VM warning: ignoring option
> MaxPermSize=256m; support was removed in 8.0
> Java HotSpot(TM) 64-Bit Server VM warning: ignoring option
> MaxPermSize=256m; support was removed in 8.0
> Running org.apache.hadoop.hbase.io.hfile.TestForceCacheImportantBlocks
> Tests run: 5, Failures: 0, Errors: 0, Skipped: 0, Time elapsed: 179.669
> sec - in org.apache.hadoop.hbase.mapreduce.TestCopyTable
> Java HotSpot(TM) 64-Bit Server VM warning: ignoring option
> MaxPermSize=256m; support was removed in 8.0
> Running org.apache.hadoop.hbase.io.hfile.TestCacheOnWrite
> Tests run: 28, Failures: 0, Errors: 0, Skipped: 0, Time elapsed: 94.956
> sec - in org.apache.hadoop.hbase.io.hfile.TestHFileBlock
> Java HotSpot(TM) 64-Bit Server VM warning: ignoring option
> MaxPermSize=256m; support was removed in 8.0
> Java HotSpot(TM) 64-Bit Server VM warning: ignoring option
> MaxPermSize=256m; support was removed in 8.0
> Java HotSpot(TM) 64-Bit Server VM warning: ignoring option
> MaxPermSize=256m; support was removed in 8.0
> Java HotSpot(TM) 64-Bit Server VM warning: ignoring option
> MaxPermSize=256m; support was removed in 8.0
> Running org.apache.hadoop.hbase.io.encoding.TestLoadAndSwitchEncodeOnDisk
> Tests run: 4, Failures: 0, Errors: 0, Skipped: 0, Time elapsed: 43.465 sec
> - in org.apache.hadoop.hbase.io.hfile.TestForceCacheImportantBlocks
> Java HotSpot(TM) 64-Bit Server VM warning: ignoring option
> MaxPermSize=256m; support was removed in 8.0
> Tests run: 1, Failures: 0, Errors: 0, Skipped: 0, Time elapsed: 28.879 sec
> - in org.apache.hadoop.hbase.io.encoding.TestLoadAndSwitchEncodeOnDisk
> Java HotSpot(TM) 64-Bit Server VM warning: ignoring option
> MaxPermSize=256m; support was removed in 8.0
> Running org.apache.hadoop.hbase.io.encoding.TestEncodedSeekers
> Running org.apache.hadoop.hbase.io.encoding.TestChangingEncoding
> Tests run: 4, Failures: 0, Errors: 0, Skipped: 0, Time elapsed: 176.877
> sec - in org.apache.hadoop.hbase.mapreduce.TestMultiTableInputFormat
> Java HotSpot(TM) 64-Bit Server VM warning: ignoring option
> MaxPermSize=256m; support was removed in 8.0
> Running org.apache.hadoop.hbase.io.encoding.TestDataBlockEncoders
> Tests run: 8, Failures: 0, Errors: 0, Skipped: 0, Time elapsed: 373.973
> sec - in org.apache.hadoop.hbase.mapreduce.TestTableSnapshotInputFormat
> Java HotSpot(TM) 64-Bit Server VM warning: ignoring option
> MaxPermSize=256m; support was removed in 8.0
> Running org.apache.hadoop.hbase.io.encoding.TestBufferedDataBlockEncoder
> Tests run: 28, Failures: 0, Errors: 0, Skipped: 0, Time elapsed: 46.308
> sec - in org.apache.hadoop.hbase.io.encoding.TestDataBlockEncoders
> Java HotSpot(TM) 64-Bit Server VM warning: ignoring option
> MaxPermSize=256m; support was removed in 8.0
> Java HotSpot(TM) 64-Bit Server VM warning: ignoring option
> MaxPermSize=256m; support was removed in 8.0
> Java HotSpot(TM) 64-Bit Server VM warning: ignoring option
> MaxPermSize=256m; support was removed in 8.0
> Java HotSpot(TM) 64-Bit Server VM warning: ignoring option
> MaxPermSize=256m; support was removed in 8.0
> Java HotSpot(TM) 64-Bit Server VM warning: ignoring option
> MaxPermSize=256m; support was removed in 8.0
> Tests run: 1, Failures: 0, Errors: 0, Skipped: 0, Time elapsed: 14.805 sec
> - in org.apache.hadoop.hbase.io.encoding.TestBufferedDataBlockEncoder
> Java HotSpot(TM) 64-Bit Server VM warning: ignoring option
> MaxPermSize=256m; support was removed in 8.0
> Java HotSpot(TM) 64-Bit Server VM warning: ignoring option
> MaxPermSize=256m; support was removed in 8.0
> Java HotSpot(TM) 64-Bit Server VM warning: ignoring option
> MaxPermSize=256m; support was removed in 8.0
> Running org.apache.hadoop.hbase.filter.TestScanRowPrefix
> Running org.apache.hadoop.hbase.filter.TestFilterWithScanLimits
> Tests run: 1, Failures: 0, Errors: 0, Skipped: 0, Time elapsed: 4.013 sec
> - in org.apache.hadoop.hbase.filter.TestFilterWithScanLimits
> Java HotSpot(TM) 64-Bit Server VM warning: ignoring option
> MaxPermSize=256m; support was removed in 8.0
> Tests run: 1, Failures: 0, Errors: 0, Skipped: 0, Time elapsed: 6.476 sec
> - in org.apache.hadoop.hbase.filter.TestScanRowPrefix
> Java HotSpot(TM) 64-Bit Server VM warning: ignoring option
> MaxPermSize=256m; support was removed in 8.0
> Java HotSpot(TM) 64-Bit Server VM warning: ignoring option
> MaxPermSize=256m; support was removed in 8.0
> Java HotSpot(TM) 64-Bit Server VM warning: ignoring option
> MaxPermSize=256m; support was removed in 8.0
> Java HotSpot(TM) 64-Bit Server VM warning: ignoring option
> MaxPermSize=256m; support was removed in 8.0
> Java HotSpot(TM) 64-Bit Server VM warning: ignoring option
> MaxPermSize=256m; support was removed in 8.0
> Java HotSpot(TM) 64-Bit Server VM warning: ignoring option
> MaxPermSize=256m; support was removed in 8.0
> Java HotSpot(TM) 64-Bit Server VM warning: ignoring option
> MaxPermSize=256m; support was removed in 8.0
> Java HotSpot(TM) 64-Bit Server VM warning: ignoring option
> MaxPermSize=256m; support was removed in 8.0
> Java HotSpot(TM) 64-Bit Server VM warning: ignoring option
> MaxPermSize=256m; support was removed in 8.0
> Java HotSpot(TM) 64-Bit Server VM warning: ignoring option
> MaxPermSize=256m; support was removed in 8.0
> Running org.apache.hadoop.hbase.filter.TestFilterWrapper
> Running org.apache.hadoop.hbase.filter.TestFuzzyRowFilterEndToEnd
> Tests run: 72, Failures: 0, Errors: 0, Skipped: 0, Time elapsed: 142.418
> sec - in org.apache.hadoop.hbase.io.hfile.TestCacheOnWrite
> Java HotSpot(TM) 64-Bit Server VM warning: ignoring option
> MaxPermSize=256m; support was removed in 8.0
> Java HotSpot(TM) 64-Bit Server VM warning: ignoring option
> MaxPermSize=256m; support was removed in 8.0
> Java HotSpot(TM) 64-Bit Server VM warning: ignoring option
> MaxPermSize=256m; support was removed in 8.0
> Java HotSpot(TM) 64-Bit Server VM warning: ignoring option
> MaxPermSize=256m; support was removed in 8.0
> Java HotSpot(TM) 64-Bit Server VM warning: ignoring option
> MaxPermSize=256m; support was removed in 8.0
> Java HotSpot(TM) 64-Bit Server VM warning: ignoring option
> MaxPermSize=256m; support was removed in 8.0
> Tests run: 1, Failures: 0, Errors: 0, Skipped: 0, Time elapsed: 3.596 sec
> - in org.apache.hadoop.hbase.filter.TestFilterWrapper
> Java HotSpot(TM) 64-Bit Server VM warning: ignoring option
> MaxPermSize=256m; support was removed in 8.0
> Java HotSpot(TM) 64-Bit Server VM warning: ignoring option
> MaxPermSize=256m; support was removed in 8.0
> Java HotSpot(TM) 64-Bit Server VM warning: ignoring option
> MaxPermSize=256m; support was removed in 8.0
> Java HotSpot(TM) 64-Bit Server VM warning: ignoring option
> MaxPermSize=256m; support was removed in 8.0
> Java HotSpot(TM) 64-Bit Server VM warning: ignoring option
> MaxPermSize=256m; support was removed in 8.0
> Java HotSpot(TM) 64-Bit Server VM warning: ignoring option
> MaxPermSize=256m; support was removed in 8.0
> Java HotSpot(TM) 64-Bit Server VM warning: ignoring option
> MaxPermSize=256m; support was removed in 8.0
> Java HotSpot(TM) 64-Bit Server VM warning: ignoring option
> MaxPermSize=256m; support was removed in 8.0
> Running org.apache.hadoop.hbase.filter.TestColumnRangeFilter
> Running org.apache.hadoop.hbase.filter.TestFuzzyRowAndColumnRangeFilter
> Tests run: 1, Failures: 0, Errors: 0, Skipped: 0, Time elapsed: 4.43 sec -
> in org.apache.hadoop.hbase.filter.TestFuzzyRowAndColumnRangeFilter
> Java HotSpot(TM) 64-Bit Server VM warning: ignoring option
> MaxPermSize=256m; support was removed in 8.0
> Tests run: 1, Failures: 0, Errors: 0, Skipped: 0, Time elapsed: 7.751 sec
> - in org.apache.hadoop.hbase.filter.TestColumnRangeFilter
> Running org.apache.hadoop.hbase.filter.TestMultiRowRangeFilter
> Tests run: 20, Failures: 0, Errors: 0, Skipped: 0, Time elapsed: 131.4 sec
> - in org.apache.hadoop.hbase.io.encoding.TestEncodedSeekers
> Tests run: 3, Failures: 0, Errors: 0, Skipped: 0, Time elapsed: 148.306
> sec - in org.apache.hadoop.hbase.io.encoding.TestChangingEncoding
> Tests run: 20, Failures: 0, Errors: 0, Skipped: 0, Time elapsed: 21.478
> sec - in org.apache.hadoop.hbase.filter.TestMultiRowRangeFilter
> Tests run: 3, Failures: 0, Errors: 0, Skipped: 0, Time elapsed: 195.323
> sec - in org.apache.hadoop.hbase.filter.TestFuzzyRowFilterEndToEnd
>
> Results :
>
> Tests in error:
>
> org.apache.hadoop.hbase.wal.TestBoundedRegionGroupingStrategy.testConcurrentWrites(org.apache.hadoop.hbase.wal.TestBoundedRegionGroupingStrategy)
>   Run 1: TestBoundedRegionGroupingStrategy.testConcurrentWrites:109 »
> IllegalState Coun...
>   Run 2: TestBoundedRegionGroupingStrategy.testConcurrentWrites:109 » IO
> Failed on loca...
>   Run 3: TestBoundedRegionGroupingStrategy.testConcurrentWrites:109 »
> Connect Call From...
>
>
> Tests run: 2397, Failures: 0, Errors: 1, Skipped: 39
>
> [INFO]
> ------------------------------------------------------------------------
> [INFO] Reactor Summary:
> [INFO]
> [INFO] Apache HBase ...................................... SUCCESS
> [1:14.089s]
> [INFO] Apache HBase - Checkstyle ......................... SUCCESS [7.421s]
> [INFO] Apache HBase - Resource Bundle .................... SUCCESS [0.209s]
> [INFO] Apache HBase - Annotations ........................ SUCCESS [1.209s]
> [INFO] Apache HBase - Protocol ........................... SUCCESS
> [19.504s]
> [INFO] Apache HBase - Common ............................. SUCCESS
> [2:19.487s]
> [INFO] Apache HBase - Procedure .......................... SUCCESS
> [3:28.439s]
> [INFO] Apache HBase - Client ............................. SUCCESS
> [1:21.394s]
> [INFO] Apache HBase - Hadoop Compatibility ............... SUCCESS [9.021s]
> [INFO] Apache HBase - Hadoop Two Compatibility ........... SUCCESS [9.026s]
> [INFO] Apache HBase - Prefix Tree ........................ SUCCESS [9.362s]
> [INFO] Apache HBase - Server ............................. FAILURE
> [1:36:04.373s]
> [INFO] Apache HBase - Testing Util ....................... SKIPPED
> [INFO] Apache HBase - Thrift ............................. SKIPPED
> [INFO] Apache HBase - Rest ............................... SKIPPED
> [INFO] Apache HBase - Shell .............................. SKIPPED
> [INFO] Apache HBase - Integration Tests .................. SKIPPED
> [INFO] Apache HBase - Examples ........................... SKIPPED
> [INFO] Apache HBase - External Block Cache ............... SKIPPED
> [INFO] Apache HBase - Assembly ........................... SKIPPED
> [INFO] Apache HBase - Shaded ............................. SKIPPED
> [INFO] Apache HBase - Shaded - Client .................... SKIPPED
> [INFO] Apache HBase - Shaded - Server .................... SKIPPED
> [INFO]
> ------------------------------------------------------------------------
> [INFO] BUILD FAILURE
> [INFO]
> ------------------------------------------------------------------------
> [INFO] Total time: 1:45:45.942s
> [INFO] Finished at: Thu Nov 26 23:04:11 UTC 2015
> [INFO] Final Memory: 94M/672M
> [INFO]
> ------------------------------------------------------------------------
> [ERROR] Failed to execute goal
> org.apache.maven.plugins:maven-surefire-plugin:2.18.1:test
> (secondPartTestsExecution) on project hbase-server: There are test failures.
> [ERROR]
> [ERROR] Please refer to <
> https://builds.apache.org/job/HBase-1.3/jdk=latest1.8,label=Hadoop/ws/hbase-server/target/surefire-reports>
> for the individual test results.
> [ERROR] -> [Help 1]
> [ERROR]
> [ERROR] To see the full stack trace of the errors, re-run Maven with the
> -e switch.
> [ERROR] Re-run Maven using the -X switch to enable full debug logging.
> [ERROR]
> [ERROR] For more information about the errors and possible solutions,
> please read the following articles:
> [ERROR] [Help 1]
> http://cwiki.apache.org/confluence/display/MAVEN/MojoFailureException
> [ERROR]
> [ERROR] After correcting the problems, you can resume the build with the
> command
> [ERROR]   mvn <goals> -rf :hbase-server
> Build step 'Invoke top-level Maven targets' marked build as failure
> Performing Post build task...
> Match found for :.* : True
> Logical operation result is TRUE
> Running script  : # Post-build task script. TODO: Check this in and have
> all builds reference check-in.
> pwd && ls
> # NOTE!!!! The below code has been copied and pasted from
> ./dev-tools/run-test.sh
> # Do not change here without syncing there and vice-versa.
> ZOMBIE_TESTS_COUNT=`jps -v | grep surefirebooter | grep -e '-Dhbase.test'
> | wc -l`
> if [[ $ZOMBIE_TESTS_COUNT != 0 ]] ; then
>  echo "Suspicious java process found - waiting 30s to see if there are
> just slow to stop"
>  sleep 30
>  ZOMBIE_TESTS_COUNT=`jps -v | grep surefirebooter | grep -e '-Dhbase.test'
> | wc -l`
>  if [[ $ZOMBIE_TESTS_COUNT != 0 ]] ; then
>    echo " {color:red}There appear to be $ZOMBIE_TESTS_COUNT zombie
> tests{color}, they should have been killed by surefire but survived"
>    jps -v | grep surefirebooter | grep -e '-Dhbase.test'
>    jps -v | grep surefirebooter | grep -e '-Dhbase.test' | cut -d ' ' -f 1
> | xargs -n 1 jstack
>    # Exit with error
>    exit 1
>  else
>    echo "We're ok: there is no zombie test, but some tests took some time
> to stop"
>  fi
> else
>   echo "We're ok: there is no zombie test"
> fi
> [Hadoop] $ /bin/bash -xe /tmp/hudson1191327655245401804.sh
> + pwd
> <https://builds.apache.org/job/HBase-1.3/jdk=latest1.8,label=Hadoop/ws/>
> + ls
> bin
> CHANGES.txt
> conf
> dev-support
> hbase-annotations
> hbase-assembly
> hbase-checkstyle
> hbase-client
> hbase-common
> hbase-examples
> hbase-external-blockcache
> hbase-hadoop2-compat
> hbase-hadoop-compat
> hbase-it
> hbase-native-client
> hbase-prefix-tree
> hbase-procedure
> hbase-protocol
> hbase-resource-bundle
> hbase-rest
> hbase-server
> hbase-shaded
> hbase-shell
> hbase-spark
> hbase-testing-util
> hbase-thrift
> LICENSE.txt
> NOTICE.txt
> pom.xml
> README.txt
> src
> target
> ++ jps -v
> ++ grep surefirebooter
> ++ wc -l
> ++ grep -e -Dhbase.test
> + ZOMBIE_TESTS_COUNT=0
> + [[ 0 != 0 ]]
> + echo 'We'\''re ok: there is no zombie test'
> We're ok: there is no zombie test
> POST BUILD TASK : SUCCESS
> END OF POST BUILD TASK : 0
> Archiving artifacts
> Recording test results
>

Re: Build failed in Jenkins: HBase-1.3 » latest1.8,Hadoop #401

Posted by Stack <st...@duboce.net>.
This fail and the TestRowCounter fail in 1.2 don't fail usually so letting
them slide for now till higher incidence of fail.
St.Ack

On Thu, Nov 26, 2015 at 3:06 PM, Apache Jenkins Server <
jenkins@builds.apache.org> wrote:

> See <
> https://builds.apache.org/job/HBase-1.3/jdk=latest1.8,label=Hadoop/401/>
>
> ------------------------------------------
> [...truncated 45726 lines...]
> Tests run: 1, Failures: 0, Errors: 0, Skipped: 0, Time elapsed: 124.257
> sec - in org.apache.hadoop.hbase.mapreduce.TestSyncTable
> Java HotSpot(TM) 64-Bit Server VM warning: ignoring option
> MaxPermSize=256m; support was removed in 8.0
> Java HotSpot(TM) 64-Bit Server VM warning: ignoring option
> MaxPermSize=256m; support was removed in 8.0
> Java HotSpot(TM) 64-Bit Server VM warning: ignoring option
> MaxPermSize=256m; support was removed in 8.0
> Java HotSpot(TM) 64-Bit Server VM warning: ignoring option
> MaxPermSize=256m; support was removed in 8.0
> Running org.apache.hadoop.hbase.io.hfile.TestHFileBlockIndex
> Running org.apache.hadoop.hbase.io.hfile.TestSeekBeforeWithInlineBlocks
> Tests run: 10, Failures: 0, Errors: 0, Skipped: 0, Time elapsed: 14.396
> sec - in org.apache.hadoop.hbase.io.hfile.TestHFileBlockIndex
> Java HotSpot(TM) 64-Bit Server VM warning: ignoring option
> MaxPermSize=256m; support was removed in 8.0
> Java HotSpot(TM) 64-Bit Server VM warning: ignoring option
> MaxPermSize=256m; support was removed in 8.0
> Java HotSpot(TM) 64-Bit Server VM warning: ignoring option
> MaxPermSize=256m; support was removed in 8.0
> Java HotSpot(TM) 64-Bit Server VM warning: ignoring option
> MaxPermSize=256m; support was removed in 8.0
> Tests run: 1, Failures: 0, Errors: 0, Skipped: 0, Time elapsed: 17.584 sec
> - in org.apache.hadoop.hbase.io.hfile.TestSeekBeforeWithInlineBlocks
> Java HotSpot(TM) 64-Bit Server VM warning: ignoring option
> MaxPermSize=256m; support was removed in 8.0
> Java HotSpot(TM) 64-Bit Server VM warning: ignoring option
> MaxPermSize=256m; support was removed in 8.0
> Java HotSpot(TM) 64-Bit Server VM warning: ignoring option
> MaxPermSize=256m; support was removed in 8.0
> Java HotSpot(TM) 64-Bit Server VM warning: ignoring option
> MaxPermSize=256m; support was removed in 8.0
> Java HotSpot(TM) 64-Bit Server VM warning: ignoring option
> MaxPermSize=256m; support was removed in 8.0
> Running org.apache.hadoop.hbase.io.hfile.TestScannerSelectionUsingTTL
> Java HotSpot(TM) 64-Bit Server VM warning: ignoring option
> MaxPermSize=256m; support was removed in 8.0
> Running org.apache.hadoop.hbase.io.hfile.TestHFileSeek
> Tests run: 1, Failures: 0, Errors: 0, Skipped: 0, Time elapsed: 1.778 sec
> - in org.apache.hadoop.hbase.io.hfile.TestHFileSeek
> Java HotSpot(TM) 64-Bit Server VM warning: ignoring option
> MaxPermSize=256m; support was removed in 8.0
> Java HotSpot(TM) 64-Bit Server VM warning: ignoring option
> MaxPermSize=256m; support was removed in 8.0
> Java HotSpot(TM) 64-Bit Server VM warning: ignoring option
> MaxPermSize=256m; support was removed in 8.0
> Running org.apache.hadoop.hbase.io.hfile.TestHFileBlock
> Tests run: 6, Failures: 0, Errors: 0, Skipped: 0, Time elapsed: 65.31 sec
> - in org.apache.hadoop.hbase.io.hfile.TestScannerSelectionUsingTTL
> Java HotSpot(TM) 64-Bit Server VM warning: ignoring option
> MaxPermSize=256m; support was removed in 8.0
> Java HotSpot(TM) 64-Bit Server VM warning: ignoring option
> MaxPermSize=256m; support was removed in 8.0
> Java HotSpot(TM) 64-Bit Server VM warning: ignoring option
> MaxPermSize=256m; support was removed in 8.0
> Java HotSpot(TM) 64-Bit Server VM warning: ignoring option
> MaxPermSize=256m; support was removed in 8.0
> Java HotSpot(TM) 64-Bit Server VM warning: ignoring option
> MaxPermSize=256m; support was removed in 8.0
> Java HotSpot(TM) 64-Bit Server VM warning: ignoring option
> MaxPermSize=256m; support was removed in 8.0
> Java HotSpot(TM) 64-Bit Server VM warning: ignoring option
> MaxPermSize=256m; support was removed in 8.0
> Java HotSpot(TM) 64-Bit Server VM warning: ignoring option
> MaxPermSize=256m; support was removed in 8.0
> Running org.apache.hadoop.hbase.io.hfile.TestCacheConfig
> Tests run: 6, Failures: 0, Errors: 0, Skipped: 0, Time elapsed: 2.017 sec
> - in org.apache.hadoop.hbase.io.hfile.TestCacheConfig
> Java HotSpot(TM) 64-Bit Server VM warning: ignoring option
> MaxPermSize=256m; support was removed in 8.0
> Java HotSpot(TM) 64-Bit Server VM warning: ignoring option
> MaxPermSize=256m; support was removed in 8.0
> Java HotSpot(TM) 64-Bit Server VM warning: ignoring option
> MaxPermSize=256m; support was removed in 8.0
> Java HotSpot(TM) 64-Bit Server VM warning: ignoring option
> MaxPermSize=256m; support was removed in 8.0
> Java HotSpot(TM) 64-Bit Server VM warning: ignoring option
> MaxPermSize=256m; support was removed in 8.0
> Java HotSpot(TM) 64-Bit Server VM warning: ignoring option
> MaxPermSize=256m; support was removed in 8.0
> Running org.apache.hadoop.hbase.io.hfile.TestForceCacheImportantBlocks
> Tests run: 5, Failures: 0, Errors: 0, Skipped: 0, Time elapsed: 179.669
> sec - in org.apache.hadoop.hbase.mapreduce.TestCopyTable
> Java HotSpot(TM) 64-Bit Server VM warning: ignoring option
> MaxPermSize=256m; support was removed in 8.0
> Running org.apache.hadoop.hbase.io.hfile.TestCacheOnWrite
> Tests run: 28, Failures: 0, Errors: 0, Skipped: 0, Time elapsed: 94.956
> sec - in org.apache.hadoop.hbase.io.hfile.TestHFileBlock
> Java HotSpot(TM) 64-Bit Server VM warning: ignoring option
> MaxPermSize=256m; support was removed in 8.0
> Java HotSpot(TM) 64-Bit Server VM warning: ignoring option
> MaxPermSize=256m; support was removed in 8.0
> Java HotSpot(TM) 64-Bit Server VM warning: ignoring option
> MaxPermSize=256m; support was removed in 8.0
> Java HotSpot(TM) 64-Bit Server VM warning: ignoring option
> MaxPermSize=256m; support was removed in 8.0
> Running org.apache.hadoop.hbase.io.encoding.TestLoadAndSwitchEncodeOnDisk
> Tests run: 4, Failures: 0, Errors: 0, Skipped: 0, Time elapsed: 43.465 sec
> - in org.apache.hadoop.hbase.io.hfile.TestForceCacheImportantBlocks
> Java HotSpot(TM) 64-Bit Server VM warning: ignoring option
> MaxPermSize=256m; support was removed in 8.0
> Tests run: 1, Failures: 0, Errors: 0, Skipped: 0, Time elapsed: 28.879 sec
> - in org.apache.hadoop.hbase.io.encoding.TestLoadAndSwitchEncodeOnDisk
> Java HotSpot(TM) 64-Bit Server VM warning: ignoring option
> MaxPermSize=256m; support was removed in 8.0
> Running org.apache.hadoop.hbase.io.encoding.TestEncodedSeekers
> Running org.apache.hadoop.hbase.io.encoding.TestChangingEncoding
> Tests run: 4, Failures: 0, Errors: 0, Skipped: 0, Time elapsed: 176.877
> sec - in org.apache.hadoop.hbase.mapreduce.TestMultiTableInputFormat
> Java HotSpot(TM) 64-Bit Server VM warning: ignoring option
> MaxPermSize=256m; support was removed in 8.0
> Running org.apache.hadoop.hbase.io.encoding.TestDataBlockEncoders
> Tests run: 8, Failures: 0, Errors: 0, Skipped: 0, Time elapsed: 373.973
> sec - in org.apache.hadoop.hbase.mapreduce.TestTableSnapshotInputFormat
> Java HotSpot(TM) 64-Bit Server VM warning: ignoring option
> MaxPermSize=256m; support was removed in 8.0
> Running org.apache.hadoop.hbase.io.encoding.TestBufferedDataBlockEncoder
> Tests run: 28, Failures: 0, Errors: 0, Skipped: 0, Time elapsed: 46.308
> sec - in org.apache.hadoop.hbase.io.encoding.TestDataBlockEncoders
> Java HotSpot(TM) 64-Bit Server VM warning: ignoring option
> MaxPermSize=256m; support was removed in 8.0
> Java HotSpot(TM) 64-Bit Server VM warning: ignoring option
> MaxPermSize=256m; support was removed in 8.0
> Java HotSpot(TM) 64-Bit Server VM warning: ignoring option
> MaxPermSize=256m; support was removed in 8.0
> Java HotSpot(TM) 64-Bit Server VM warning: ignoring option
> MaxPermSize=256m; support was removed in 8.0
> Java HotSpot(TM) 64-Bit Server VM warning: ignoring option
> MaxPermSize=256m; support was removed in 8.0
> Tests run: 1, Failures: 0, Errors: 0, Skipped: 0, Time elapsed: 14.805 sec
> - in org.apache.hadoop.hbase.io.encoding.TestBufferedDataBlockEncoder
> Java HotSpot(TM) 64-Bit Server VM warning: ignoring option
> MaxPermSize=256m; support was removed in 8.0
> Java HotSpot(TM) 64-Bit Server VM warning: ignoring option
> MaxPermSize=256m; support was removed in 8.0
> Java HotSpot(TM) 64-Bit Server VM warning: ignoring option
> MaxPermSize=256m; support was removed in 8.0
> Running org.apache.hadoop.hbase.filter.TestScanRowPrefix
> Running org.apache.hadoop.hbase.filter.TestFilterWithScanLimits
> Tests run: 1, Failures: 0, Errors: 0, Skipped: 0, Time elapsed: 4.013 sec
> - in org.apache.hadoop.hbase.filter.TestFilterWithScanLimits
> Java HotSpot(TM) 64-Bit Server VM warning: ignoring option
> MaxPermSize=256m; support was removed in 8.0
> Tests run: 1, Failures: 0, Errors: 0, Skipped: 0, Time elapsed: 6.476 sec
> - in org.apache.hadoop.hbase.filter.TestScanRowPrefix
> Java HotSpot(TM) 64-Bit Server VM warning: ignoring option
> MaxPermSize=256m; support was removed in 8.0
> Java HotSpot(TM) 64-Bit Server VM warning: ignoring option
> MaxPermSize=256m; support was removed in 8.0
> Java HotSpot(TM) 64-Bit Server VM warning: ignoring option
> MaxPermSize=256m; support was removed in 8.0
> Java HotSpot(TM) 64-Bit Server VM warning: ignoring option
> MaxPermSize=256m; support was removed in 8.0
> Java HotSpot(TM) 64-Bit Server VM warning: ignoring option
> MaxPermSize=256m; support was removed in 8.0
> Java HotSpot(TM) 64-Bit Server VM warning: ignoring option
> MaxPermSize=256m; support was removed in 8.0
> Java HotSpot(TM) 64-Bit Server VM warning: ignoring option
> MaxPermSize=256m; support was removed in 8.0
> Java HotSpot(TM) 64-Bit Server VM warning: ignoring option
> MaxPermSize=256m; support was removed in 8.0
> Java HotSpot(TM) 64-Bit Server VM warning: ignoring option
> MaxPermSize=256m; support was removed in 8.0
> Java HotSpot(TM) 64-Bit Server VM warning: ignoring option
> MaxPermSize=256m; support was removed in 8.0
> Running org.apache.hadoop.hbase.filter.TestFilterWrapper
> Running org.apache.hadoop.hbase.filter.TestFuzzyRowFilterEndToEnd
> Tests run: 72, Failures: 0, Errors: 0, Skipped: 0, Time elapsed: 142.418
> sec - in org.apache.hadoop.hbase.io.hfile.TestCacheOnWrite
> Java HotSpot(TM) 64-Bit Server VM warning: ignoring option
> MaxPermSize=256m; support was removed in 8.0
> Java HotSpot(TM) 64-Bit Server VM warning: ignoring option
> MaxPermSize=256m; support was removed in 8.0
> Java HotSpot(TM) 64-Bit Server VM warning: ignoring option
> MaxPermSize=256m; support was removed in 8.0
> Java HotSpot(TM) 64-Bit Server VM warning: ignoring option
> MaxPermSize=256m; support was removed in 8.0
> Java HotSpot(TM) 64-Bit Server VM warning: ignoring option
> MaxPermSize=256m; support was removed in 8.0
> Java HotSpot(TM) 64-Bit Server VM warning: ignoring option
> MaxPermSize=256m; support was removed in 8.0
> Tests run: 1, Failures: 0, Errors: 0, Skipped: 0, Time elapsed: 3.596 sec
> - in org.apache.hadoop.hbase.filter.TestFilterWrapper
> Java HotSpot(TM) 64-Bit Server VM warning: ignoring option
> MaxPermSize=256m; support was removed in 8.0
> Java HotSpot(TM) 64-Bit Server VM warning: ignoring option
> MaxPermSize=256m; support was removed in 8.0
> Java HotSpot(TM) 64-Bit Server VM warning: ignoring option
> MaxPermSize=256m; support was removed in 8.0
> Java HotSpot(TM) 64-Bit Server VM warning: ignoring option
> MaxPermSize=256m; support was removed in 8.0
> Java HotSpot(TM) 64-Bit Server VM warning: ignoring option
> MaxPermSize=256m; support was removed in 8.0
> Java HotSpot(TM) 64-Bit Server VM warning: ignoring option
> MaxPermSize=256m; support was removed in 8.0
> Java HotSpot(TM) 64-Bit Server VM warning: ignoring option
> MaxPermSize=256m; support was removed in 8.0
> Java HotSpot(TM) 64-Bit Server VM warning: ignoring option
> MaxPermSize=256m; support was removed in 8.0
> Running org.apache.hadoop.hbase.filter.TestColumnRangeFilter
> Running org.apache.hadoop.hbase.filter.TestFuzzyRowAndColumnRangeFilter
> Tests run: 1, Failures: 0, Errors: 0, Skipped: 0, Time elapsed: 4.43 sec -
> in org.apache.hadoop.hbase.filter.TestFuzzyRowAndColumnRangeFilter
> Java HotSpot(TM) 64-Bit Server VM warning: ignoring option
> MaxPermSize=256m; support was removed in 8.0
> Tests run: 1, Failures: 0, Errors: 0, Skipped: 0, Time elapsed: 7.751 sec
> - in org.apache.hadoop.hbase.filter.TestColumnRangeFilter
> Running org.apache.hadoop.hbase.filter.TestMultiRowRangeFilter
> Tests run: 20, Failures: 0, Errors: 0, Skipped: 0, Time elapsed: 131.4 sec
> - in org.apache.hadoop.hbase.io.encoding.TestEncodedSeekers
> Tests run: 3, Failures: 0, Errors: 0, Skipped: 0, Time elapsed: 148.306
> sec - in org.apache.hadoop.hbase.io.encoding.TestChangingEncoding
> Tests run: 20, Failures: 0, Errors: 0, Skipped: 0, Time elapsed: 21.478
> sec - in org.apache.hadoop.hbase.filter.TestMultiRowRangeFilter
> Tests run: 3, Failures: 0, Errors: 0, Skipped: 0, Time elapsed: 195.323
> sec - in org.apache.hadoop.hbase.filter.TestFuzzyRowFilterEndToEnd
>
> Results :
>
> Tests in error:
>
> org.apache.hadoop.hbase.wal.TestBoundedRegionGroupingStrategy.testConcurrentWrites(org.apache.hadoop.hbase.wal.TestBoundedRegionGroupingStrategy)
>   Run 1: TestBoundedRegionGroupingStrategy.testConcurrentWrites:109 »
> IllegalState Coun...
>   Run 2: TestBoundedRegionGroupingStrategy.testConcurrentWrites:109 » IO
> Failed on loca...
>   Run 3: TestBoundedRegionGroupingStrategy.testConcurrentWrites:109 »
> Connect Call From...
>
>
> Tests run: 2397, Failures: 0, Errors: 1, Skipped: 39
>
> [INFO]
> ------------------------------------------------------------------------
> [INFO] Reactor Summary:
> [INFO]
> [INFO] Apache HBase ...................................... SUCCESS
> [1:14.089s]
> [INFO] Apache HBase - Checkstyle ......................... SUCCESS [7.421s]
> [INFO] Apache HBase - Resource Bundle .................... SUCCESS [0.209s]
> [INFO] Apache HBase - Annotations ........................ SUCCESS [1.209s]
> [INFO] Apache HBase - Protocol ........................... SUCCESS
> [19.504s]
> [INFO] Apache HBase - Common ............................. SUCCESS
> [2:19.487s]
> [INFO] Apache HBase - Procedure .......................... SUCCESS
> [3:28.439s]
> [INFO] Apache HBase - Client ............................. SUCCESS
> [1:21.394s]
> [INFO] Apache HBase - Hadoop Compatibility ............... SUCCESS [9.021s]
> [INFO] Apache HBase - Hadoop Two Compatibility ........... SUCCESS [9.026s]
> [INFO] Apache HBase - Prefix Tree ........................ SUCCESS [9.362s]
> [INFO] Apache HBase - Server ............................. FAILURE
> [1:36:04.373s]
> [INFO] Apache HBase - Testing Util ....................... SKIPPED
> [INFO] Apache HBase - Thrift ............................. SKIPPED
> [INFO] Apache HBase - Rest ............................... SKIPPED
> [INFO] Apache HBase - Shell .............................. SKIPPED
> [INFO] Apache HBase - Integration Tests .................. SKIPPED
> [INFO] Apache HBase - Examples ........................... SKIPPED
> [INFO] Apache HBase - External Block Cache ............... SKIPPED
> [INFO] Apache HBase - Assembly ........................... SKIPPED
> [INFO] Apache HBase - Shaded ............................. SKIPPED
> [INFO] Apache HBase - Shaded - Client .................... SKIPPED
> [INFO] Apache HBase - Shaded - Server .................... SKIPPED
> [INFO]
> ------------------------------------------------------------------------
> [INFO] BUILD FAILURE
> [INFO]
> ------------------------------------------------------------------------
> [INFO] Total time: 1:45:45.942s
> [INFO] Finished at: Thu Nov 26 23:04:11 UTC 2015
> [INFO] Final Memory: 94M/672M
> [INFO]
> ------------------------------------------------------------------------
> [ERROR] Failed to execute goal
> org.apache.maven.plugins:maven-surefire-plugin:2.18.1:test
> (secondPartTestsExecution) on project hbase-server: There are test failures.
> [ERROR]
> [ERROR] Please refer to <
> https://builds.apache.org/job/HBase-1.3/jdk=latest1.8,label=Hadoop/ws/hbase-server/target/surefire-reports>
> for the individual test results.
> [ERROR] -> [Help 1]
> [ERROR]
> [ERROR] To see the full stack trace of the errors, re-run Maven with the
> -e switch.
> [ERROR] Re-run Maven using the -X switch to enable full debug logging.
> [ERROR]
> [ERROR] For more information about the errors and possible solutions,
> please read the following articles:
> [ERROR] [Help 1]
> http://cwiki.apache.org/confluence/display/MAVEN/MojoFailureException
> [ERROR]
> [ERROR] After correcting the problems, you can resume the build with the
> command
> [ERROR]   mvn <goals> -rf :hbase-server
> Build step 'Invoke top-level Maven targets' marked build as failure
> Performing Post build task...
> Match found for :.* : True
> Logical operation result is TRUE
> Running script  : # Post-build task script. TODO: Check this in and have
> all builds reference check-in.
> pwd && ls
> # NOTE!!!! The below code has been copied and pasted from
> ./dev-tools/run-test.sh
> # Do not change here without syncing there and vice-versa.
> ZOMBIE_TESTS_COUNT=`jps -v | grep surefirebooter | grep -e '-Dhbase.test'
> | wc -l`
> if [[ $ZOMBIE_TESTS_COUNT != 0 ]] ; then
>  echo "Suspicious java process found - waiting 30s to see if there are
> just slow to stop"
>  sleep 30
>  ZOMBIE_TESTS_COUNT=`jps -v | grep surefirebooter | grep -e '-Dhbase.test'
> | wc -l`
>  if [[ $ZOMBIE_TESTS_COUNT != 0 ]] ; then
>    echo " {color:red}There appear to be $ZOMBIE_TESTS_COUNT zombie
> tests{color}, they should have been killed by surefire but survived"
>    jps -v | grep surefirebooter | grep -e '-Dhbase.test'
>    jps -v | grep surefirebooter | grep -e '-Dhbase.test' | cut -d ' ' -f 1
> | xargs -n 1 jstack
>    # Exit with error
>    exit 1
>  else
>    echo "We're ok: there is no zombie test, but some tests took some time
> to stop"
>  fi
> else
>   echo "We're ok: there is no zombie test"
> fi
> [Hadoop] $ /bin/bash -xe /tmp/hudson1191327655245401804.sh
> + pwd
> <https://builds.apache.org/job/HBase-1.3/jdk=latest1.8,label=Hadoop/ws/>
> + ls
> bin
> CHANGES.txt
> conf
> dev-support
> hbase-annotations
> hbase-assembly
> hbase-checkstyle
> hbase-client
> hbase-common
> hbase-examples
> hbase-external-blockcache
> hbase-hadoop2-compat
> hbase-hadoop-compat
> hbase-it
> hbase-native-client
> hbase-prefix-tree
> hbase-procedure
> hbase-protocol
> hbase-resource-bundle
> hbase-rest
> hbase-server
> hbase-shaded
> hbase-shell
> hbase-spark
> hbase-testing-util
> hbase-thrift
> LICENSE.txt
> NOTICE.txt
> pom.xml
> README.txt
> src
> target
> ++ jps -v
> ++ grep surefirebooter
> ++ wc -l
> ++ grep -e -Dhbase.test
> + ZOMBIE_TESTS_COUNT=0
> + [[ 0 != 0 ]]
> + echo 'We'\''re ok: there is no zombie test'
> We're ok: there is no zombie test
> POST BUILD TASK : SUCCESS
> END OF POST BUILD TASK : 0
> Archiving artifacts
> Recording test results
>