You are viewing a plain text version of this content. The canonical link for it is here.
Posted to builds@beam.apache.org by Apache Jenkins Server <je...@builds.apache.org> on 2021/03/20 06:16:51 UTC
Build failed in Jenkins: beam_PreCommit_Java_Cron #3811
See <https://ci-beam.apache.org/job/beam_PreCommit_Java_Cron/3811/display/redirect>
Changes:
------------------------------------------
[...truncated 638.91 KB...]
> Task :runners:spark:3:job-server:checkstyleTest NO-SOURCE
> Task :runners:spark:3:job-server:javadoc NO-SOURCE
> Task :runners:spark:3:job-server:spotbugsMain NO-SOURCE
> Task :runners:spark:3:job-server:spotbugsTest SKIPPED
> Task :runners:spark:3:job-server:test NO-SOURCE
> Task :runners:spark:3:job-server:check UP-TO-DATE
> Task :runners:extensions-java:metrics:checkstyleTest FROM-CACHE
> Task :sdks:java:io:hadoop-common:checkstyleTest FROM-CACHE
> Task :runners:extensions-java:metrics:javadoc FROM-CACHE
> Task :runners:extensions-java:metrics:spotbugsMain FROM-CACHE
> Task :runners:extensions-java:metrics:spotbugsTest SKIPPED
> Task :sdks:java:io:hadoop-common:javadoc FROM-CACHE
> Task :runners:extensions-java:metrics:test FROM-CACHE
> Task :runners:extensions-java:metrics:check UP-TO-DATE
> Task :runners:extensions-java:metrics:build
> Task :runners:extensions-java:metrics:buildDependents
> Task :sdks:java:io:hadoop-common:spotbugsMain FROM-CACHE
> Task :sdks:java:io:hadoop-common:spotbugsTest SKIPPED
> Task :sdks:java:io:hadoop-common:test FROM-CACHE
> Task :sdks:java:io:hadoop-common:check UP-TO-DATE
> Task :sdks:java:io:hadoop-common:build
> Task :sdks:java:io:hadoop-common:buildDependents
> Task :sdks:java:extensions:sql:hcatalog:compileJava FROM-CACHE
> Task :sdks:java:extensions:sql:hcatalog:classes UP-TO-DATE
> Task :sdks:java:extensions:sql:hcatalog:javadoc FROM-CACHE
> Task :release:go-licenses:java:createLicenses
> Task :sdks:java:core:analyzeClassesDependencies FROM-CACHE
> Task :sdks:java:core:analyzeTestClassesDependencies SKIPPED
> Task :sdks:java:core:analyzeDependencies UP-TO-DATE
> Task :sdks:java:core:checkstyleMain FROM-CACHE
> Task :sdks:java:container:pullLicenses
Copying already-fetched licenses from <https://ci-beam.apache.org/job/beam_PreCommit_Java_Cron/ws/src/sdks/java/container/build/reports/dependency-license> to <https://ci-beam.apache.org/job/beam_PreCommit_Java_Cron/ws/src/sdks/java/container/build/target/java_third_party_licenses>
> Task :sdks:java:container:java8:copyDockerfileDependencies
> Task :sdks:java:container:java8:copyGolangLicenses
> Task :sdks:java:core:checkstyleTest FROM-CACHE
> Task :runners:samza:job-server:distTar
> Task :sdks:java:core:javadoc FROM-CACHE
> Task :sdks:java:container:pullLicenses
Already using interpreter /usr/bin/python3
Using base prefix '/usr'
New python executable in <https://ci-beam.apache.org/job/beam_PreCommit_Java_Cron/ws/src/sdks/java/container/build/virtualenv/bin/python3>
Also creating executable in <https://ci-beam.apache.org/job/beam_PreCommit_Java_Cron/ws/src/sdks/java/container/build/virtualenv/bin/python>
Installing setuptools, pip, wheel...
> Task :sdks:java:io:kinesis:spotbugsMain
> Task :sdks:java:io:kinesis:test
> Task :runners:spark:2:job-server:shadowJar FROM-CACHE
> Task :runners:spark:2:job-server:build
> Task :runners:spark:2:job-server:buildDependents
> Task :runners:spark:2:buildDependents
> Task :sdks:java:io:snowflake:expansion-service:distZip
> Task :sdks:java:io:snowflake:expansion-service:compileTestJava NO-SOURCE
> Task :sdks:java:io:snowflake:expansion-service:testClasses UP-TO-DATE
> Task :sdks:java:io:snowflake:expansion-service:packageTests
> Task :sdks:java:io:snowflake:expansion-service:assemble
> Task :runners:spark:3:job-server:shadowJar FROM-CACHE
> Task :runners:spark:3:job-server:build
> Task :runners:spark:3:job-server:buildDependents
> Task :runners:spark:3:buildDependents
> Task :sdks:java:io:kafka:buildDependents
> Task :sdks:java:io:synthetic:buildDependents
> Task :sdks:java:io:snowflake:expansion-service:analyzeClassesDependencies FROM-CACHE
> Task :sdks:java:io:snowflake:expansion-service:analyzeTestClassesDependencies SKIPPED
> Task :sdks:java:io:snowflake:expansion-service:analyzeDependencies UP-TO-DATE
> Task :sdks:java:io:snowflake:expansion-service:checkstyleMain NO-SOURCE
> Task :sdks:java:io:snowflake:expansion-service:checkstyleTest NO-SOURCE
> Task :sdks:java:io:snowflake:expansion-service:javadoc NO-SOURCE
> Task :sdks:java:io:snowflake:expansion-service:spotbugsMain NO-SOURCE
> Task :sdks:java:io:snowflake:expansion-service:spotbugsTest SKIPPED
> Task :sdks:java:io:snowflake:expansion-service:test NO-SOURCE
> Task :sdks:java:io:snowflake:expansion-service:check UP-TO-DATE
> Task :sdks:java:core:spotbugsMain FROM-CACHE
> Task :sdks:java:core:spotbugsTest SKIPPED
> Task :sdks:java:core:test FROM-CACHE
> Task :sdks:java:core:validateShadedJarDoesntLeakNonProjectClasses
> Task :sdks:java:core:check
> Task :sdks:java:core:build
> Task :sdks:java:core:buildNeeded
> Task :sdks:java:container:pullLicenses
done.
DEPRECATION: Python 3.5 reached the end of its life on September 13th, 2020. Please upgrade your Python as Python 3.5 is no longer maintained. pip 21.0 will drop support for Python 3.5 in January 2021. pip 21.0 will remove support for this functionality.
Collecting beautifulsoup4<5.0,>=4.9.0
Using cached beautifulsoup4-4.9.3-py3-none-any.whl (115 kB)
> Task :sdks:java:io:snowflake:expansion-service:shadowJar FROM-CACHE
> Task :sdks:java:io:snowflake:expansion-service:build
> Task :sdks:java:io:snowflake:expansion-service:buildDependents
> Task :sdks:java:io:snowflake:buildDependents
> Task :sdks:java:testing:test-utils:buildDependents
> Task :sdks:java:container:pullLicenses
Collecting future<1.0.0,>=0.16.0
Using cached future-0.18.2-py3-none-any.whl
Collecting pyyaml<6.0.0,>=3.12
Using cached PyYAML-5.3.1-cp35-cp35m-linux_x86_64.whl
Collecting tenacity<6.0,>=5.0.2
Using cached tenacity-5.1.5-py2.py3-none-any.whl (34 kB)
Collecting soupsieve>1.2
Using cached soupsieve-2.1-py3-none-any.whl (32 kB)
Collecting six>=1.9.0
Using cached six-1.15.0-py2.py3-none-any.whl (10 kB)
Installing collected packages: soupsieve, six, tenacity, pyyaml, future, beautifulsoup4
Successfully installed beautifulsoup4-4.9.3 future-0.18.2 pyyaml-5.3.1 six-1.15.0 soupsieve-2.1 tenacity-5.1.5
Executing <https://ci-beam.apache.org/job/beam_PreCommit_Java_Cron/ws/src/sdks/java/container/build/virtualenv/bin/python> <https://ci-beam.apache.org/job/beam_PreCommit_Java_Cron/ws/src/sdks/java/container/license_scripts/pull_licenses_java.py> --license_index=<https://ci-beam.apache.org/job/beam_PreCommit_Java_Cron/ws/src/sdks/java/container/build/reports/dependency-license/index.json> --output_dir=<https://ci-beam.apache.org/job/beam_PreCommit_Java_Cron/ws/src/sdks/java/container/build/target/java_third_party_licenses> --dep_url_yaml=<https://ci-beam.apache.org/job/beam_PreCommit_Java_Cron/ws/src/sdks/java/container/license_scripts/dep_urls_java.yaml>
INFO:root:Pulling license for 206 dependencies using 16 threads.
INFO:root:pull_licenses_java.py succeed. It took 3.425141 seconds with 16 threads.
> Task :runners:samza:job-server:distZip
> Task :runners:samza:job-server:compileTestJava NO-SOURCE
> Task :runners:samza:job-server:testClasses UP-TO-DATE
> Task :runners:samza:job-server:packageTests
> Task :runners:samza:job-server:assemble
> Task :runners:samza:job-server:analyzeClassesDependencies FROM-CACHE
> Task :runners:samza:job-server:analyzeTestClassesDependencies SKIPPED
> Task :runners:samza:job-server:analyzeDependencies UP-TO-DATE
> Task :runners:samza:job-server:checkstyleMain NO-SOURCE
> Task :runners:samza:job-server:checkstyleTest NO-SOURCE
> Task :runners:samza:job-server:javadoc NO-SOURCE
> Task :runners:samza:job-server:spotbugsMain NO-SOURCE
> Task :runners:samza:job-server:spotbugsTest SKIPPED
> Task :runners:samza:job-server:test NO-SOURCE
> Task :runners:samza:job-server:check UP-TO-DATE
> Task :sdks:java:container:pullLicenses
Copying licenses from <https://ci-beam.apache.org/job/beam_PreCommit_Java_Cron/ws/src/sdks/java/container/build/target/java_third_party_licenses> to <https://ci-beam.apache.org/job/beam_PreCommit_Java_Cron/ws/src/sdks/java/container/build/target/third_party_licenses.>
Finished license_scripts.sh
> Task :sdks:java:container:java8:copyJavaThirdPartyLicenses NO-SOURCE
> Task :runners:samza:job-server:shadowJar FROM-CACHE
> Task :runners:samza:job-server:build
> Task :runners:samza:job-server:buildDependents
> Task :runners:samza:buildDependents
> Task :runners:java-job-service:buildDependents
> Task :sdks:java:expansion-service:buildDependents
> Task :sdks:java:extensions:sql:jdbc:shadowJarTest
> Task :sdks:java:extensions:sql:jdbc:preCommit
> Task :runners:direct-java:needsRunnerTests
org.apache.beam.sdk.transforms.ParDoTest$TimerFamilyTests > testTimerFamilyEventTimeBounded STANDARD_OUT
timer Id : timer1
timerMap : org.apache.beam.repackaged.direct_java.runners.core.SimpleDoFnRunner$TimerInternalsTimerMap@7469cd64
timer Id : timer2
timerMap : org.apache.beam.repackaged.direct_java.runners.core.SimpleDoFnRunner$TimerInternalsTimerMap@a95750f
org.apache.beam.sdk.transforms.ParDoTest$TimerFamilyTests > testTimerFamilyEventTimeUnbounded STANDARD_OUT
timer Id : timer1
timerMap : org.apache.beam.repackaged.direct_java.runners.core.SimpleDoFnRunner$TimerInternalsTimerMap@24681dbd
timer Id : timer2
timerMap : org.apache.beam.repackaged.direct_java.runners.core.SimpleDoFnRunner$TimerInternalsTimerMap@5274bcc6
org.apache.beam.sdk.transforms.ParDoLifecycleTest > testTeardownCalledAfterExceptionInFinishBundleStateful FAILED
java.lang.AssertionError at ParDoLifecycleTest.java:300
org.apache.beam.sdk.transforms.ParDoTest$LifecycleTests > testWindowingInStartAndFinishBundle STANDARD_OUT
Process: elem:1
Finish: 3
> Task :sdks:go:resolveBuildDependencies
Resolving google.golang.org/api: commit='0324d5e90dc7753607860272666845fad9ceb97e', urls=[https://code.googlesource.com/google-api-go-client]
Resolving google.golang.org/genproto: commit='4d944d34d83c502a5f761500a14d8842648415c3', urls=[https://github.com/google/go-genproto]
Resolving google.golang.org/grpc: commit='5e8f83304c0563d1ba74db05fee83d9c18ab9a58', urls=[https://github.com/grpc/grpc-go]
> Task :sdks:java:io:kinesis:check
> Task :sdks:java:io:kinesis:build
> Task :sdks:go:resolveBuildDependencies
Resolving google.golang.org/protobuf: commit='d165be301fb1e13390ad453281ded24385fd8ebc', urls=[https://go.googlesource.com/protobuf]
Resolving cached github.com/etcd-io/etcd: commit='11214aa33bf5a47d3d9d8dafe0f6b97237dfe921', urls=[https://github.com/etcd-io/etcd.git, git@github.com:etcd-io/etcd.git]
Resolving cached github.com/etcd-io/etcd: commit='11214aa33bf5a47d3d9d8dafe0f6b97237dfe921', urls=[https://github.com/etcd-io/etcd.git, git@github.com:etcd-io/etcd.git]
> Task :sdks:go:installDependencies
> Task :sdks:go:buildLinuxAmd64
> Task :sdks:go:goBuild
> Task :sdks:java:container:resolveBuildDependencies
Resolving ./github.com/apache/beam/sdks/go@<https://ci-beam.apache.org/job/beam_PreCommit_Java_Cron/ws/src/sdks/go>
> Task :sdks:java:container:installDependencies
> Task :sdks:java:container:buildLinuxAmd64
> Task :sdks:java:container:goBuild
> Task :sdks:java:container:java8:copySdkHarnessLauncher
> Task :sdks:java:container:java8:dockerPrepare
> Task :sdks:java:container:java8:docker
> Task :runners:direct-java:needsRunnerTests
875 tests completed, 1 failed, 7 skipped
> Task :runners:direct-java:needsRunnerTests FAILED
> Task :runners:direct-java:jar
> Task :runners:direct-java:packageTests
> Task :runners:direct-java:assemble
> Task :runners:direct-java:analyzeClassesDependencies FROM-CACHE
> Task :runners:direct-java:analyzeTestClassesDependencies SKIPPED
> Task :runners:direct-java:analyzeDependencies UP-TO-DATE
> Task :runners:direct-java:checkstyleMain FROM-CACHE
> Task :runners:direct-java:checkstyleTest FROM-CACHE
> Task :runners:direct-java:javadoc FROM-CACHE
> Task :sdks:java:javadoc:allJavadoc
> Task :runners:direct-java:spotbugsMain FROM-CACHE
> Task :runners:direct-java:spotbugsTest SKIPPED
> Task :runners:direct-java:test FROM-CACHE
> Task :runners:direct-java:validateShadedJarDoesntLeakNonProjectClasses
> Task :runners:direct-java:check
> Task :runners:direct-java:build
> Task :sdks:java:io:amazon-web-services2:check
> Task :sdks:java:io:amazon-web-services2:build
> Task :sdks:java:io:amazon-web-services2:buildDependents
> Task :sdks:java:io:kinesis:buildDependents
> Task :runners:direct-java:buildDependents
> Task :sdks:java:io:common:buildDependents
> Task :runners:local-java:buildDependents
> Task :runners:java-fn-execution:buildDependents
> Task :sdks:java:harness:buildDependents
> Task :sdks:java:extensions:google-cloud-platform-core:buildDependents
> Task :runners:core-java:buildDependents
> Task :runners:core-construction-java:buildDependents
> Task :sdks:java:fn-execution:buildDependents
> Task :sdks:java:core:buildDependents
FAILURE: Build failed with an exception.
* What went wrong:
Execution failed for task ':runners:direct-java:needsRunnerTests'.
> There were failing tests. See the report at: file://<https://ci-beam.apache.org/job/beam_PreCommit_Java_Cron/ws/src/runners/direct-java/build/reports/tests/needsRunnerTests/index.html>
* Try:
Run with --stacktrace option to get the stack trace. Run with --info or --debug option to get more log output. Run with --scan to get full insights.
* Get more help at https://help.gradle.org
Deprecated Gradle features were used in this build, making it incompatible with Gradle 7.0.
Use '--warning-mode all' to show the individual deprecation warnings.
See https://docs.gradle.org/6.8/userguide/command_line_interface.html#sec:command_line_warnings
BUILD FAILED in 16m 17s
1150 actionable tasks: 454 executed, 694 from cache, 2 up-to-date
Gradle was unable to watch the file system for changes. The inotify watches limit is too low.
Publishing build scan...
https://gradle.com/s/chmv4u4pih45c
Build step 'Invoke Gradle script' changed build result to FAILURE
Build step 'Invoke Gradle script' marked build as failure
---------------------------------------------------------------------
To unsubscribe, e-mail: builds-unsubscribe@beam.apache.org
For additional commands, e-mail: builds-help@beam.apache.org
Jenkins build is back to normal : beam_PreCommit_Java_Cron #3812
Posted by Apache Jenkins Server <je...@builds.apache.org>.
See <https://ci-beam.apache.org/job/beam_PreCommit_Java_Cron/3812/display/redirect>
---------------------------------------------------------------------
To unsubscribe, e-mail: builds-unsubscribe@beam.apache.org
For additional commands, e-mail: builds-help@beam.apache.org