You are viewing a plain text version of this content. The canonical link for it is here.
Posted to builds@beam.apache.org by Apache Jenkins Server <je...@builds.apache.org> on 2021/10/06 18:21:46 UTC

Build failed in Jenkins: beam_PreCommit_GoPortable_Cron #843

See <https://ci-beam.apache.org/job/beam_PreCommit_GoPortable_Cron/843/display/redirect?page=changes>

Changes:

[Robert Bradshaw] Restore "Default to Runner v2 for Python Streaming jobs. (#15140)"

[Robert Bradshaw] Avoid incompatible setting.

[noreply] [BEAM-12909][BEAM-12849]  Add support for running spark3 nexmark queries


------------------------------------------
[...truncated 1.25 MB...]
      coder_id: "c3"
      is_bounded: BOUNDED
      windowing_strategy_id: "w0"
    >
  >
  pcollections: <
    key: "n6"
    value: <
      unique_name: "n6"
      coder_id: "c4"
      is_bounded: BOUNDED
      windowing_strategy_id: "w0"
    >
  >
  pcollections: <
    key: "n7"
    value: <
      unique_name: "n7"
      coder_id: "c3"
      is_bounded: BOUNDED
      windowing_strategy_id: "w0"
    >
  >
  pcollections: <
    key: "n7_keyede11_1"
    value: <
      unique_name: "n7_keyede11_1"
      coder_id: "c7"
      is_bounded: BOUNDED
      windowing_strategy_id: "w0"
    >
  >
  pcollections: <
    key: "n8"
    value: <
      unique_name: "n8"
      coder_id: "c0"
      is_bounded: BOUNDED
      windowing_strategy_id: "w0"
    >
  >
  pcollections: <
    key: "n9"
    value: <
      unique_name: "n9"
      coder_id: "c3"
      is_bounded: BOUNDED
      windowing_strategy_id: "w0"
    >
  >
  pcollections: <
    key: "n9_keyede11_2"
    value: <
      unique_name: "n9_keyede11_2"
      coder_id: "c7"
      is_bounded: BOUNDED
      windowing_strategy_id: "w0"
    >
  >
  windowing_strategies: <
    key: "w0"
    value: <
      window_fn: <
        urn: "beam:window_fn:global_windows:v1"
      >
      merge_status: NON_MERGING
      window_coder_id: "c1"
      trigger: <
        default: <
        >
      >
      accumulation_mode: DISCARDING
      output_time: END_OF_WINDOW
      closing_behavior: EMIT_IF_NONEMPTY
      OnTimeBehavior: FIRE_IF_NONEMPTY
      environment_id: "go"
    >
  >
  coders: <
    key: "c0"
    value: <
      spec: <
        urn: "beam:coder:bytes:v1"
      >
    >
  >
  coders: <
    key: "c1"
    value: <
      spec: <
        urn: "beam:coder:global_window:v1"
      >
    >
  >
  coders: <
    key: "c2"
    value: <
      spec: <
        urn: "beam:go:coder:custom:v1"
        payload: "Cgd2YXJpbnR6EgIIAhpdCklnaXRodWIuY29tL2FwYWNoZS9iZWFtL3Nka3MvdjIvZ28vcGtnL2JlYW0vY29yZS9ydW50aW1lL2NvZGVyeC5lbmNWYXJJbnRaEhAIFiIECBlADyoGCBQSAggIImkKSWdpdGh1Yi5jb20vYXBhY2hlL2JlYW0vc2Rrcy92Mi9nby9wa2cvYmVhbS9jb3JlL3J1bnRpbWUvY29kZXJ4LmRlY1ZhckludFoSHAgWIgQIGUADIgYIFBICCAgqBAgZQA8qBAgZQAE="
      >
    >
  >
  coders: <
    key: "c3"
    value: <
      spec: <
        urn: "beam:coder:length_prefix:v1"
      >
      component_coder_ids: "c2"
    >
  >
  coders: <
    key: "c4"
    value: <
      spec: <
        urn: "beam:coder:kv:v1"
      >
      component_coder_ids: "c3"
      component_coder_ids: "c3"
    >
  >
  coders: <
    key: "c5"
    value: <
      spec: <
        urn: "beam:coder:iterable:v1"
      >
      component_coder_ids: "c3"
    >
  >
  coders: <
    key: "c6"
    value: <
      spec: <
        urn: "beam:coder:kv:v1"
      >
      component_coder_ids: "c3"
      component_coder_ids: "c5"
    >
  >
  coders: <
    key: "c7"
    value: <
      spec: <
        urn: "beam:coder:kv:v1"
      >
      component_coder_ids: "c0"
      component_coder_ids: "c3"
    >
  >
  environments: <
    key: "go"
    value: <
      urn: "beam:env:docker:v1"
      payload: "\n\026apache/beam_go_sdk:dev"
      capabilities: "beam:protocol:progress_reporting:v0"
      capabilities: "beam:protocol:multi_core_bundle_processing:v1"
      capabilities: "beam:version:sdk_base:go"
      capabilities: "beam:coder:bytes:v1"
      capabilities: "beam:coder:bool:v1"
      capabilities: "beam:coder:varint:v1"
      capabilities: "beam:coder:double:v1"
      capabilities: "beam:coder:string_utf8:v1"
      capabilities: "beam:coder:length_prefix:v1"
      capabilities: "beam:coder:kv:v1"
      capabilities: "beam:coder:iterable:v1"
      capabilities: "beam:coder:state_backed_iterable:v1"
      capabilities: "beam:coder:windowed_value:v1"
      capabilities: "beam:coder:global_window:v1"
      capabilities: "beam:coder:interval_window:v1"
      capabilities: "beam:coder:row:v1"
      dependencies: <
        type_urn: "beam:artifact:type:go_worker_binary:v1"
        role_urn: "beam:artifact:role:staging_to:v1"
        role_payload: "\n\006worker"
      >
    >
  >
>
root_transform_ids: "e1"
root_transform_ids: "e2"
root_transform_ids: "e3"
root_transform_ids: "e4"
root_transform_ids: "e5"
root_transform_ids: "e6"
root_transform_ids: "e7"
root_transform_ids: "s1"
2021/10/06 18:20:26 Prepared job with id: go-job-7-1633544426455961637-9d1c5b9f-4af4-48f1-a565-6c41319b2ace and staging token: go-job-7-1633544426455961637-9d1c5b9f-4af4-48f1-a565-6c41319b2ace
2021/10/06 18:20:26 Cross-compiling <https://ci-beam.apache.org/job/beam_PreCommit_GoPortable_Cron/ws/src/sdks/go/test/regression/pardo_test.go> as /tmp/worker-7-1633544426458990380
2021/10/06 18:20:29 Staged binary artifact with token: 
2021/10/06 18:20:29 Submitted job: go-job-7-1633544426455961637-9d1c5b9f-4af4-48f1-a565-6c41319b2ace
2021/10/06 18:20:29 2021-10-06 18:20:29. (1): Make sure that locally built Python SDK docker image has Python 3.8 interpreter.
2021/10/06 18:20:29 2021-10-06 18:20:29. (11): ==================== <function read_to_impulse at 0x7febede299d0> ====================
2021/10/06 18:20:29 2021-10-06 18:20:29. (12): ==================== <function impulse_to_input at 0x7febede29a60> ====================
2021/10/06 18:20:29 2021-10-06 18:20:29. (13): ==================== <function sort_stages at 0x7febede29ca0> ====================
2021/10/06 18:20:29 2021-10-06 18:20:29. (14): ==================== <function setup_timer_mapping at 0x7febede29c10> ====================
2021/10/06 18:20:29 2021-10-06 18:20:29. (15): ==================== <function populate_data_channel_coders at 0x7febede29d30> ====================
2021/10/06 18:20:29 2021-10-06 18:20:29. (16): starting control server on port 35323
2021/10/06 18:20:29 2021-10-06 18:20:29. (17): starting data server on port 41773
2021/10/06 18:20:29 2021-10-06 18:20:29. (18): starting state server on port 41899
2021/10/06 18:20:29 2021-10-06 18:20:29. (19): starting logging server on port 39091
2021/10/06 18:20:29 Job state: STOPPED
2021/10/06 18:20:29 Job state: STARTING
2021/10/06 18:20:29 Job state: RUNNING
2021/10/06 18:20:29 2021-10-06 18:20:29. (20): Created Worker handler <apache_beam.runners.portability.fn_api_runner.worker_handlers.DockerSdkWorkerHandler object at 0x7febedf225b0> for environment go (beam:env:docker:v1, b'\n\x16apache/beam_go_sdk:dev')
2021/10/06 18:20:29 2021-10-06 18:20:29. (21): Attempting to pull image apache/beam_go_sdk:dev
2021/10/06 18:20:30 2021-10-06 18:20:30. (22): Unable to pull image apache/beam_go_sdk:dev, defaulting to local image if it exists
2021/10/06 18:20:34 2021-10-06 18:20:34. (23): Waiting for docker to start up. Current status is running
2021/10/06 18:20:34 2021-10-06 18:20:34. (24): Docker container is running. container_id = b'a5afd09d469a2a00f5dd99daec2dd8018d5d79b05de5d5460d0c674304accbd6', worker_id = worker_31
2021/10/06 18:20:35 2021-10-06 18:20:35. (25): Running (((e8)+(e9))+(e11_keyed2))+(n9_keyede11_2/Write)
2021/10/06 18:20:35 2021-10-06 18:20:35. (26): Running (((e1)+(e2))+(e3))+(CoGBK/Write)
2021/10/06 18:20:35 2021-10-06 18:20:35. (27): Running (((((CoGBK/Read)+(e5))+(e6))+(e7))+(e11_keyed1))+(n7_keyede11_1/Write)
2021/10/06 18:20:35 2021-10-06 18:20:35. (28): Running (((((((e10)+(e11))+(e13_keyed3))+(e13_keyed1))+(e13_keyed2))+(n13_keyede13_3/Write))+(n12_keyede13_2/Write))+(n11_keyede13_1/Write)
2021/10/06 18:20:35 2021-10-06 18:20:35. (29): Running (e12)+(e13)
2021/10/06 18:20:38 2021-10-06 18:20:38. (30): Successfully completed job in 9.03425908088684 seconds.
2021/10/06 18:20:38 Job state: DONE
--- PASS: TestEmitParDoAfterGBK (12.19s)
PASS
ok  	github.com/apache/beam/sdks/v2/go/test/regression	88.961s

> Task :sdks:go:test:ulrValidatesRunner FAILED

FAILURE: Build failed with an exception.

* Where:
Build file '<https://ci-beam.apache.org/job/beam_PreCommit_GoPortable_Cron/ws/src/sdks/go/test/build.gradle'> line: 171

* What went wrong:
Execution failed for task ':sdks:go:test:ulrValidatesRunner'.
> Process 'command 'sh'' finished with non-zero exit value 1

* Try:
Run with --stacktrace option to get the stack trace. Run with --info or --debug option to get more log output. Run with --scan to get full insights.

* Get more help at https://help.gradle.org

Deprecated Gradle features were used in this build, making it incompatible with Gradle 7.0.
Use '--warning-mode all' to show the individual deprecation warnings.
See https://docs.gradle.org/6.9.1/userguide/command_line_interface.html#sec:command_line_warnings

BUILD FAILED in 7m 1s
108 actionable tasks: 82 executed, 21 from cache, 5 up-to-date

Publishing build scan...
https://gradle.com/s/apaul2rt6kexu

Build step 'Invoke Gradle script' changed build result to FAILURE
Build step 'Invoke Gradle script' marked build as failure

---------------------------------------------------------------------
To unsubscribe, e-mail: builds-unsubscribe@beam.apache.org
For additional commands, e-mail: builds-help@beam.apache.org


Jenkins build is back to normal : beam_PreCommit_GoPortable_Cron #844

Posted by Apache Jenkins Server <je...@builds.apache.org>.
See <https://ci-beam.apache.org/job/beam_PreCommit_GoPortable_Cron/844/display/redirect?page=changes>


---------------------------------------------------------------------
To unsubscribe, e-mail: builds-unsubscribe@beam.apache.org
For additional commands, e-mail: builds-help@beam.apache.org